EE Transaction Type,Dependent Transaction Type,Effective Date,EE Signature,EE Signature Date,Control,Suffix,Account,Plan Number,Plan Name,Claim Office,Network ID Number,Customer Code,EE SSN,Dependent SSN,Dependent Relationship,Last Name,First Name,Middle Initial,DOB,Gender,Ethnicity,PCP/PCD,PCP/PCD Current Patient,Provider Cap Office Number,COB,Dep Student Indicator,Dep OOA Indicator,EE Prior Coverage Indicator,EE Late Entrant,EE Language Indicator,Hire Date,Earnings,Earnings Frequency,Beneficiary (Last Name First Name MI),Beneficiary Relationship,Continuation of Coverage Expiration Date,Continuation of Coverage Event Date,Continuation of Coverage Length of Coverage,Work Location Zip Code,Street Address Line 1,Street Address Line 2,City,State,Zip Code,Home Phone Number,Work Phone Number,Accept Code,Evidence Code,EE Email Address,Communication Disability Code,EE Alternate ID,Dep Alternate ID,Old Control,Old Suffix,Old Account,New Control,New Suffix,New Account,
Not captured,Not captured,07/08/2019,Not captured,Not captured,863949,020,00072,ARS-01-0051351,Beacon International,Not captured,Not captured,Not captured,,,,Zhou,Qi,,11/23/1977,female,Not captured,Not captured,Not captured,Not captured,Not captured,Not captured,Not captured,Not captured,Not captured,Not captured,Not captured,Not captured,Not captured,,,Not captured,Not captured,Not captured,Not captured,687 Driggs Ave,,Brooklyn,New York,11211,,,Not captured,Not captured,cindarella77@yahoo.com,Not captured,701938123,,Not captured,Not captured,Not captured,Not captured,Not captured,Not captured,
Not captured,Not captured,07/08/2019,Not captured,Not captured,863949,020,00072,ARS-01-0051350,Beacon International,Not captured,Not captured,Not captured,,,,Lim,Rivington,,11/01/2018,male,Not captured,Not captured,Not captured,Not captured,Not captured,Not captured,Not captured,Not captured,Not captured,Not captured,Not captured,Not captured,Not captured,,,Not captured,Not captured,Not captured,Not captured,687 Driggs Ave,,Brooklyn,New York,11211,,,Not captured,Not captured,cindarella77@yahoo.com,Not captured,701938122,,Not captured,Not captured,Not captured,Not captured,Not captured,Not captured,
Not captured,Not captured,07/08/2019,Not captured,Not captured,863949,020,00072,ARS-02-0051349,Beacon America,Not captured,Not captured,Not captured,,,,Rickman,Gary,L,11/10/1952,male,Not captured,Not captured,Not captured,Not captured,Not captured,Not captured,Not captured,Not captured,Not captured,Not captured,Not captured,Not captured,Not captured,,,Not captured,Not captured,Not captured,Not captured,PO BOX 315,,PURDY,Missouri,65734,,,Not captured,Not captured,gkrickman@gmail.com,Not captured,701938121,,Not captured,Not captured,Not captured,Not captured,Not captured,Not captured,
Not captured,Not captured,07/08/2019,Not captured,Not captured,863949,020,00072,ARS-01-0051335,Beacon International,Not captured,Not captured,Not captured,,,,O&apos;Keefe,Maire,C,03/07/1997,female,Not captured,Not captured,Not captured,Not captured,Not captured,Not captured,Not captured,Not captured,Not captured,Not captured,Not captured,Not captured,Not captured,,,Not captured,Not captured,Not captured,Not captured,6673 Walnutwood Circle,,Baltimore,Maryland,21212,,,Not captured,Not captured,kokamerica@gmail.com,Not captured,701938099,,Not captured,Not captured,Not captured,Not captured,Not captured,Not captured,
Not captured,Not captured,07/08/2019,Not captured,Not captured,863949,020,00072,ARS-02-0051334,Beacon America,Not captured,Not captured,Not captured,,,,Thompson,Dale,W,12/19/1945,male,Not captured,Not captured,Not captured,Not captured,Not captured,Not captured,Not captured,Not captured,Not captured,Not captured,Not captured,Not captured,Not captured,,,Not captured,Not captured,Not captured,Not captured,1510 Goetz Blvd.,,Joplin,Missouri,64801,,,Not captured,Not captured,twods500@yahoo.com,Not captured,701938098,,Not captured,Not captured,Not captured,Not captured,Not captured,Not captured,
Not captured,Not captured,07/08/2019,Not captured,Not captured,863949,020,00072,ARS-01-0051332,Beacon International,Not captured,Not captured,Not captured,,,,MacDonald,KELLY,,01/18/1977,female,Not captured,Not captured,Not captured,Not captured,Not captured,Not captured,Not captured,Not captured,Not captured,Not captured,Not captured,Not captured,Not captured,Kelly MacDonald,Wife,Not captured,Not captured,Not captured,Not captured,6037 E. MOUNTAIN COURT,,CAVE CREEK,Arizona,85331,8165089011,,Not captured,Not captured,steve@blackmountainpartners.com,Not captured,701938095,,Not captured,Not captured,Not captured,Not captured,Not captured,Not captured,
Not captured,Not captured,07/08/2019,Not captured,Not captured,863949,020,00072,ARS-01-0051331,Beacon International,Not captured,Not captured,Not captured,,,,ANDERSON,Steve,,08/07/1966,male,Not captured,Not captured,Not captured,Not captured,Not captured,Not captured,Not captured,Not captured,Not captured,Not captured,Not captured,Not captured,Not captured,Kelly MacDonald,Wife,Not captured,Not captured,Not captured,Not captured,6037 E. MOUNTAIN COURT,,CAVE CREEK,Arizona,85331,8165089011,,Not captured,Not captured,steve@blackmountainpartners.com,Not captured,701938094,,Not captured,Not captured,Not captured,Not captured,Not captured,Not captured,
Not captured,Not captured,07/08/2019,Not captured,Not captured,863949,020,00072,ARS-02-0051315,Beacon America,Not captured,Not captured,Not captured,,,,Kroeger,Kate,,07/09/1969,female,Not captured,Not captured,Not captured,Not captured,Not captured,Not captured,Not captured,Not captured,Not captured,Not captured,Not captured,Not captured,Not captured,,,Not captured,Not captured,Not captured,Not captured,40 West 116th Street,,New York,New York,10026,,,Not captured,Not captured,katemjkroeger@gmail.com,Not captured,701938078,,Not captured,Not captured,Not captured,Not captured,Not captured,Not captured,
Not captured,Not captured,07/08/2019,Not captured,Not captured,863949,020,00072,ARS-02-0051313,Beacon America,Not captured,Not captured,Not captured,,,,Iakimova,Andray,,09/11/2004,male,Not captured,Not captured,Not captured,Not captured,Not captured,Not captured,Not captured,Not captured,Not captured,Not captured,Not captured,Not captured,Not captured,,,Not captured,Not captured,Not captured,Not captured,Prevomaiskaja 14,,maikop,,133570,,,Not captured,Not captured,mdmitry1973@gmail.com,Not captured,701938076,,Not captured,Not captured,Not captured,Not captured,Not captured,Not captured,
Not captured,Not captured,07/08/2019,Not captured,Not captured,863949,020,00072,ARS-02-0051312,Beacon America,Not captured,Not captured,Not captured,,,,Iakimova,Vera,,09/26/1984,female,Not captured,Not captured,Not captured,Not captured,Not captured,Not captured,Not captured,Not captured,Not captured,Not captured,Not captured,Not captured,Not captured,,,Not captured,Not captured,Not captured,Not captured,Prevomaiskaja 14,,maikop,,133570,,,Not captured,Not captured,mdmitry1973@gmail.com,Not captured,701938075,,Not captured,Not captured,Not captured,Not captured,Not captured,Not captured,
Not captured,Not captured,07/08/2019,Not captured,Not captured,863949,020,00072,ARS-01-0051311,Beacon International,Not captured,Not captured,Not captured,,,,Ilowitz,Dasi,,01/26/1971,female,Not captured,Not captured,Not captured,Not captured,Not captured,Not captured,Not captured,Not captured,Not captured,Not captured,Not captured,Not captured,Not captured,,,Not captured,Not captured,Not captured,Not captured,1631 52nd Street,,Brooklyn,New York,11204,646-496-6558,,Not captured,Not captured,jay@bergenboiler.com,Not captured,701938074,,Not captured,Not captured,Not captured,Not captured,Not captured,Not captured,
Not captured,Not captured,07/08/2019,Not captured,Not captured,863949,020,00072,ARS-01-0051310,Beacon International,Not captured,Not captured,Not captured,,,,Ilowitz,Yaakov,,09/18/1969,male,Not captured,Not captured,Not captured,Not captured,Not captured,Not captured,Not captured,Not captured,Not captured,Not captured,Not captured,Not captured,Not captured,,,Not captured,Not captured,Not captured,Not captured,1631 52nd Street,,Brooklyn,New York,11204,646-496-6558,,Not captured,Not captured,jay@bergenboiler.com,Not captured,701938073,,Not captured,Not captured,Not captured,Not captured,Not captured,Not captured,
Not captured,Not captured,07/07/2019,Not captured,Not captured,863949,020,00072,ARS-01-0051309,Beacon International,Not captured,Not captured,Not captured,,,,Dietrich,Bryce,J,05/11/1982,male,Not captured,Not captured,Not captured,Not captured,Not captured,Not captured,Not captured,Not captured,Not captured,Not captured,Not captured,Not captured,Not captured,,,Not captured,Not captured,Not captured,Not captured,3934 Foster Street B417,,Pittsburgh,Pennsylvania,15201,,,Not captured,Not captured,rachelptindall@gmail.com,Not captured,701938072,,Not captured,Not captured,Not captured,Not captured,Not captured,Not captured,
Not captured,Not captured,07/07/2019,Not captured,Not captured,863949,020,00072,ARS-01-0051308,Beacon International,Not captured,Not captured,Not captured,,,,Tindall,Rachel,P,09/07/1983,female,Not captured,Not captured,Not captured,Not captured,Not captured,Not captured,Not captured,Not captured,Not captured,Not captured,Not captured,Not captured,Not captured,,,Not captured,Not captured,Not captured,Not captured,3934 Foster Street B417,,Pittsburgh,Pennsylvania,15201,,,Not captured,Not captured,rachelptindall@gmail.com,Not captured,701938071,,Not captured,Not captured,Not captured,Not captured,Not captured,Not captured,
Not captured,Not captured,07/07/2019,Not captured,Not captured,863949,020,00072,ARS-01-0051307,Beacon International,Not captured,Not captured,Not captured,,,,Friedmann Schaffer,Martin,,04/23/1997,male,Not captured,Not captured,Not captured,Not captured,Not captured,Not captured,Not captured,Not captured,Not captured,Not captured,Not captured,Not captured,Not captured,,,Not captured,Not captured,Not captured,Not captured,17201 Collins Ave Unit 1804,,Sunny Isles,Florida,33160,,,Not captured,Not captured,martinfriedmann2@gmail.com,Not captured,701938070,,Not captured,Not captured,Not captured,Not captured,Not captured,Not captured,
Not captured,Not captured,07/07/2019,Not captured,Not captured,863949,020,00072,ARS-01-0051306,Beacon International,Not captured,Not captured,Not captured,,,,Alinor Jerome,Malissa,,02/07/1993,female,Not captured,Not captured,Not captured,Not captured,Not captured,Not captured,Not captured,Not captured,Not captured,Not captured,Not captured,Not captured,Not captured,,,Not captured,Not captured,Not captured,Not captured,264 Pine Ridge Cir,,Winterville,Georgia,30683,,,Not captured,Not captured,m.alinor@yahoo.com,Not captured,701938069,,Not captured,Not captured,Not captured,Not captured,Not captured,Not captured,
Not captured,Not captured,07/07/2019,Not captured,Not captured,863949,020,00072,ARS-01-0051305,Beacon International,Not captured,Not captured,Not captured,,,,Collins,Cerenity,,03/27/1995,female,Not captured,Not captured,Not captured,Not captured,Not captured,Not captured,Not captured,Not captured,Not captured,Not captured,Not captured,Not captured,Not captured,,,Not captured,Not captured,Not captured,Not captured,250 Epps Bridge Pkwy,,ATHENS,Georgia,30606,,,Not captured,Not captured,cerenity.collins@outlook.com,Not captured,701938068,,Not captured,Not captured,Not captured,Not captured,Not captured,Not captured,
Not captured,Not captured,07/07/2019,Not captured,Not captured,863949,020,00072,ARS-01-0051300,Beacon International,Not captured,Not captured,Not captured,,,,Baer,Hannah,R,07/26/1988,female,Not captured,Not captured,Not captured,Not captured,Not captured,Not captured,Not captured,Not captured,Not captured,Not captured,Not captured,Not captured,Not captured,,,Not captured,Not captured,Not captured,Not captured,2200 Riverfront Dr #1308,,Little Rock,Arkansas,72202,,,Not captured,Not captured,squaremouth@postcatcher.com,Not captured,701938063,,Not captured,Not captured,Not captured,Not captured,Not captured,Not captured,
Not captured,Not captured,07/07/2019,Not captured,Not captured,863949,020,00072,ARS-01-0051299,Beacon International,Not captured,Not captured,Not captured,,,,Wilkins,Matthew,G,12/07/1982,male,Not captured,Not captured,Not captured,Not captured,Not captured,Not captured,Not captured,Not captured,Not captured,Not captured,Not captured,Not captured,Not captured,,,Not captured,Not captured,Not captured,Not captured,2200 Riverfront Dr #1308,,Little Rock,Arkansas,72202,,,Not captured,Not captured,squaremouth@postcatcher.com,Not captured,701938062,,Not captured,Not captured,Not captured,Not captured,Not captured,Not captured,
Not captured,Not captured,07/07/2019,Not captured,Not captured,863949,020,00072,ARS-01-0051298,Beacon International,Not captured,Not captured,Not captured,Passport(14CL28912),,,Roquette,Annie,M,05/04/1992,female,Not captured,Not captured,Not captured,Not captured,Not captured,Not captured,Not captured,Not captured,Not captured,Not captured,Not captured,Not captured,Not captured,Pierre Roquette,Father of Annie Roquette,Not captured,Not captured,Not captured,Not captured,Vista Linda,,Maria Trinidad Sanchez,MTS,0824,8298735144,,Not captured,Not captured,annie.roquette@gmail.com,Not captured,701938061,,Not captured,Not captured,Not captured,Not captured,Not captured,Not captured,
Not captured,Not captured,07/07/2019,Not captured,Not captured,863949,020,00072,OVI-28-0051297,OverseasCare Visitors Insurance Plan,Not captured,Not captured,Not captured,Passport(FO669985),,,da Cruz,Eunice,,12/18/1950,male,Not captured,Not captured,Not captured,Not captured,Not captured,Not captured,Not captured,Not captured,Not captured,Not captured,Not captured,Not captured,Not captured,Daniela Fernanda de Abreu,Daughter,Not captured,Not captured,Not captured,Not captured,217 Columbia St 1C,,Ithaca,New York,14850,6073191369,,Not captured,Not captured,ambordokan@gmail.com,Not captured,701938060,,Not captured,Not captured,Not captured,Not captured,Not captured,Not captured,
Not captured,Not captured,07/07/2019,Not captured,Not captured,863949,020,00072,ARS-01-0051289,Beacon International,Not captured,Not captured,Not captured,,,,Schmit,Matthew,B,11/26/1991,male,Not captured,Not captured,Not captured,Not captured,Not captured,Not captured,Not captured,Not captured,Not captured,Not captured,Not captured,Not captured,Not captured,,,Not captured,Not captured,Not captured,Not captured,5708 E 6th Street,,Tucson,Arizona,85711,,,Not captured,Not captured,supergoofup@gmail.com,Not captured,701938052,,Not captured,Not captured,Not captured,Not captured,Not captured,Not captured,
Not captured,Not captured,07/07/2019,Not captured,Not captured,863949,020,00072,ARS-01-0051288,Beacon International,Not captured,Not captured,Not captured,,,,Robertson,Amy,N,12/14/1988,female,Not captured,Not captured,Not captured,Not captured,Not captured,Not captured,Not captured,Not captured,Not captured,Not captured,Not captured,Not captured,Not captured,,,Not captured,Not captured,Not captured,Not captured,5708 E 6th Street,,Tucson,Arizona,85711,,,Not captured,Not captured,supergoofup@gmail.com,Not captured,701938051,,Not captured,Not captured,Not captured,Not captured,Not captured,Not captured,
Not captured,Not captured,07/06/2019,Not captured,Not captured,863949,020,00072,ARS-02-0051286,Beacon America,Not captured,Not captured,Not captured,Passport(8J1456484),,,PEREZPUSZTAI,LEONARDO,,02/26/2014,male,Not captured,Not captured,Not captured,Not captured,Not captured,Not captured,Not captured,Not captured,Not captured,Not captured,Not captured,Not captured,Not captured,SANTIAGO PEREZ & ANIKO PUSZTAI,PARENTS,Not captured,Not captured,Not captured,Not captured,153 PLEASANT AVE,,FANWOOD,NEW JERSEY,07023,9084512880,9084512880,Not captured,Not captured,AAPEREZ14@COMCAST.NET,Not captured,701938049,,Not captured,Not captured,Not captured,Not captured,Not captured,Not captured,
Not captured,Not captured,07/06/2019,Not captured,Not captured,863949,020,00072,ARS-01-0051285,Beacon International,Not captured,Not captured,Not captured,,,,Bedetti,H&eacute;lo&iuml;se,,07/23/2018,female,Not captured,Not captured,Not captured,Not captured,Not captured,Not captured,Not captured,Not captured,Not captured,Not captured,Not captured,Not captured,Not captured,,,Not captured,Not captured,Not captured,Not captured,5204 rue Drolet,,Montr&eacute;al,Quebec,H2T 2H2,,,Not captured,Not captured,xfer44@gmail.com,Not captured,701938048,,Not captured,Not captured,Not captured,Not captured,Not captured,Not captured,
Not captured,Not captured,07/06/2019,Not captured,Not captured,863949,020,00072,ARS-01-0051284,Beacon International,Not captured,Not captured,Not captured,,,,Houz&eacute;,B&eacute;reng&egrave;re,,02/21/1984,female,Not captured,Not captured,Not captured,Not captured,Not captured,Not captured,Not captured,Not captured,Not captured,Not captured,Not captured,Not captured,Not captured,,,Not captured,Not captured,Not captured,Not captured,5204 rue Drolet,,Montr&eacute;al,Quebec,H2T 2H2,,,Not captured,Not captured,xfer44@gmail.com,Not captured,701938047,,Not captured,Not captured,Not captured,Not captured,Not captured,Not captured,
Not captured,Not captured,07/06/2019,Not captured,Not captured,863949,020,00072,ARS-01-0051283,Beacon International,Not captured,Not captured,Not captured,,,,Bedetti,Christophe,,07/11/1982,male,Not captured,Not captured,Not captured,Not captured,Not captured,Not captured,Not captured,Not captured,Not captured,Not captured,Not captured,Not captured,Not captured,,,Not captured,Not captured,Not captured,Not captured,5204 rue Drolet,,Montr&eacute;al,Quebec,H2T 2H2,,,Not captured,Not captured,xfer44@gmail.com,Not captured,701938046,,Not captured,Not captured,Not captured,Not captured,Not captured,Not captured,
Not captured,Not captured,07/06/2019,Not captured,Not captured,863949,020,00072,ARS-02-0051282,Beacon America,Not captured,Not captured,Not captured,,,,Chen,Robert,,05/17/1976,male,Not captured,Not captured,Not captured,Not captured,Not captured,Not captured,Not captured,Not captured,Not captured,Not captured,Not captured,Not captured,Not captured,,,Not captured,Not captured,Not captured,Not captured,16 Beverley Path Glendale,,Glendale Kingston,,Kingston 20,,,Not captured,Not captured,robertchenball17@gmail.com,Not captured,701938045,,Not captured,Not captured,Not captured,Not captured,Not captured,Not captured,
Not captured,Not captured,07/06/2019,Not captured,Not captured,863949,020,00072,ARS-01-0051281,Beacon International,Not captured,Not captured,Not captured,,,,O&apos;Connell,Kevin,M,04/17/1991,male,Not captured,Not captured,Not captured,Not captured,Not captured,Not captured,Not captured,Not captured,Not captured,Not captured,Not captured,Not captured,Not captured,,,Not captured,Not captured,Not captured,Not captured,166 Central Ave,,Brooklyn,New York,11221,,,Not captured,Not captured,kevin.oconnell17@gmail.com,Not captured,701938044,,Not captured,Not captured,Not captured,Not captured,Not captured,Not captured,
Not captured,Not captured,07/06/2019,Not captured,Not captured,863949,020,00072,ARS-01-0051279,Beacon International,Not captured,Not captured,Not captured,,,,Pucheta,Sofia,A,01/06/1994,female,Not captured,Not captured,Not captured,Not captured,Not captured,Not captured,Not captured,Not captured,Not captured,Not captured,Not captured,Not captured,Not captured,,,Not captured,Not captured,Not captured,Not captured,Bv Arturo Illia 95 4a,,Cordoba,,5000,,,Not captured,Not captured,sofia.abig.94@gmail.com,Not captured,701938039,,Not captured,Not captured,Not captured,Not captured,Not captured,Not captured,
Not captured,Not captured,07/07/2019,Not captured,Not captured,863949,020,00072,ARS-01-0051269,Beacon International,Not captured,Not captured,Not captured,,,,Kranz,Chaim Z,,12/20/1997,male,Not captured,Not captured,Not captured,Not captured,Not captured,Not captured,Not captured,Not captured,Not captured,Not captured,Not captured,Not captured,Not captured,,,Not captured,Not captured,Not captured,Not captured,27 Roselle Ct,,Lakewood,New Jersey,08701,908-910-5301,,Not captured,Not captured,jkranzpoly@optonline.net,Not captured,701938025,,Not captured,Not captured,Not captured,Not captured,Not captured,Not captured,
Not captured,Not captured,07/07/2019,Not captured,Not captured,863949,020,00072,ARS-01-0051268,Beacon International,Not captured,Not captured,Not captured,,,,Kranz,Dov J,,04/09/1993,male,Not captured,Not captured,Not captured,Not captured,Not captured,Not captured,Not captured,Not captured,Not captured,Not captured,Not captured,Not captured,Not captured,,,Not captured,Not captured,Not captured,Not captured,27 Roselle Ct,,Lakewood,New Jersey,08701,908-910-5301,,Not captured,Not captured,jkranzpoly@optonline.net,Not captured,701938024,,Not captured,Not captured,Not captured,Not captured,Not captured,Not captured,
Not captured,Not captured,07/07/2019,Not captured,Not captured,863949,020,00072,ARS-01-0051267,Beacon International,Not captured,Not captured,Not captured,,,,Kranz,Rachel D,,09/08/1959,female,Not captured,Not captured,Not captured,Not captured,Not captured,Not captured,Not captured,Not captured,Not captured,Not captured,Not captured,Not captured,Not captured,,,Not captured,Not captured,Not captured,Not captured,27 Roselle Ct,,Lakewood,New Jersey,08701,908-910-5301,,Not captured,Not captured,jkranzpoly@optonline.net,Not captured,701938023,,Not captured,Not captured,Not captured,Not captured,Not captured,Not captured,
Not captured,Not captured,07/07/2019,Not captured,Not captured,863949,020,00072,ARS-01-0051266,Beacon International,Not captured,Not captured,Not captured,,,,Kranz,Jonathen,,08/03/1957,male,Not captured,Not captured,Not captured,Not captured,Not captured,Not captured,Not captured,Not captured,Not captured,Not captured,Not captured,Not captured,Not captured,,,Not captured,Not captured,Not captured,Not captured,27 Roselle Ct,,Lakewood,New Jersey,08701,908-910-5301,,Not captured,Not captured,jkranzpoly@optonline.net,Not captured,701938022,,Not captured,Not captured,Not captured,Not captured,Not captured,Not captured,
Not captured,Not captured,07/06/2019,Not captured,Not captured,863949,020,00072,ARS-02-0051242,Beacon America,Not captured,Not captured,Not captured,Passport(pad031923),,,puig puigdomenech,marc,,06/20/2004,male,Not captured,Not captured,Not captured,Not captured,Not captured,Not captured,Not captured,Not captured,Not captured,Not captured,Not captured,Not captured,Not captured,montserrat puigdomenech,mother,Not captured,Not captured,Not captured,Not captured,ANGEL 16,,ELCHE,Alicante,03203,34626771213,,Not captured,Not captured,rcoves@decoasports.com,Not captured,701937978,,Not captured,Not captured,Not captured,Not captured,Not captured,Not captured,
Not captured,Not captured,07/06/2019,Not captured,Not captured,863949,020,00072,ARS-02-0051239,Beacon America,Not captured,Not captured,Not captured,Passport(PAI932313),,,vidal cid,mar,,06/24/2002,female,Not captured,Not captured,Not captured,Not captured,Not captured,Not captured,Not captured,Not captured,Not captured,Not captured,Not captured,Not captured,Not captured,juan enrique vidal ruiz,father,Not captured,Not captured,Not captured,Not captured,ANGEL 16,,ELCHE,Alicante,03203,34626771213,,Not captured,Not captured,rcoves@decoasports.com,Not captured,701937975,,Not captured,Not captured,Not captured,Not captured,Not captured,Not captured,