EE Transaction Type,Dependent Transaction Type,Effective Date,EE Signature,EE Signature Date,Control,Suffix,Account,Plan Number,Plan Name,Claim Office,Network ID Number,Customer Code,EE SSN,Dependent SSN,Dependent Relationship,Last Name,First Name,Middle Initial,DOB,Gender,Ethnicity,PCP/PCD,PCP/PCD Current Patient,Provider Cap Office Number,COB,Dep Student Indicator,Dep OOA Indicator,EE Prior Coverage Indicator,EE Late Entrant,EE Language Indicator,Hire Date,Earnings,Earnings Frequency,Beneficiary (Last Name First Name MI),Beneficiary Relationship,Continuation of Coverage Expiration Date,Continuation of Coverage Event Date,Continuation of Coverage Length of Coverage,Work Location Zip Code,Street Address Line 1,Street Address Line 2,City,State,Zip Code,Home Phone Number,Work Phone Number,Accept Code,Evidence Code,EE Email Address,Communication Disability Code,EE Alternate ID,Dep Alternate ID,Old Control,Old Suffix,Old Account,New Control,New Suffix,New Account,
Not captured,Not captured,07/05/2019,Not captured,Not captured,863949,020,00072,ARS-03-0051176,Essential America,Not captured,Not captured,Not captured,Passport(P2551728),,,Maisuria,Shaishav,,10/30/1998,male,Not captured,Not captured,Not captured,Not captured,Not captured,Not captured,Not captured,Not captured,Not captured,Not captured,Not captured,Not captured,Not captured,,,Not captured,Not captured,Not captured,Not captured,9 Nal Duplex Viswa Kuij Colony Kankara,,Ahsadabad,Gujarat,330028,8802663220,,Not captured,Not captured,shaishavm1998@gmail.com,Not captured,701937797,,Not captured,Not captured,Not captured,Not captured,Not captured,Not captured,
Not captured,Not captured,07/05/2019,Not captured,Not captured,863949,020,00072,ARS-03-0051177,Essential America,Not captured,Not captured,Not captured,Passport(229214940),,,Wiberg,Carole,,07/12/1965,female,Not captured,Not captured,Not captured,Not captured,Not captured,Not captured,Not captured,Not captured,Not captured,Not captured,Not captured,Not captured,Not captured,,,Not captured,Not captured,Not captured,Not captured,10601 Poachers Run,,Chestfield,Virginia,23832,8043999640,,Not captured,Not captured,carolewiberg12@gmail.com,Not captured,701937798,,Not captured,Not captured,Not captured,Not captured,Not captured,Not captured,
Not captured,Not captured,07/05/2019,Not captured,Not captured,863949,020,00072,ARS-01-0051275,Beacon International,Not captured,Not captured,Not captured,,,,Cloyd,Danielle,D,02/21/1998,female,Not captured,Not captured,Not captured,Not captured,Not captured,Not captured,Not captured,Not captured,Not captured,Not captured,Not captured,Not captured,Not captured,,,Not captured,Not captured,Not captured,Not captured,19157 Wellesley Ave,,Sandy,Oregon,97055,,,Not captured,Not captured,hdraider@usa.com,Not captured,701938035,,Not captured,Not captured,Not captured,Not captured,Not captured,Not captured,
Not captured,Not captured,07/05/2019,Not captured,Not captured,863949,020,00072,ARS-01-0051274,Beacon International,Not captured,Not captured,Not captured,,,,Wilson,Hayden,D,03/11/1998,male,Not captured,Not captured,Not captured,Not captured,Not captured,Not captured,Not captured,Not captured,Not captured,Not captured,Not captured,Not captured,Not captured,,,Not captured,Not captured,Not captured,Not captured,19157 Wellesley Ave,,Sandy,Oregon,97055,,,Not captured,Not captured,hdraider@usa.com,Not captured,701938034,,Not captured,Not captured,Not captured,Not captured,Not captured,Not captured,
Not captured,Not captured,07/05/2019,Not captured,Not captured,863949,020,00072,ARS-01-0051273,Beacon International,Not captured,Not captured,Not captured,,,,Wilson,Tom,R,08/14/1964,male,Not captured,Not captured,Not captured,Not captured,Not captured,Not captured,Not captured,Not captured,Not captured,Not captured,Not captured,Not captured,Not captured,,,Not captured,Not captured,Not captured,Not captured,19157 Wellesley Ave,,Sandy,Oregon,97055,,,Not captured,Not captured,hdraider@usa.com,Not captured,701938033,,Not captured,Not captured,Not captured,Not captured,Not captured,Not captured,
Not captured,Not captured,07/05/2019,Not captured,Not captured,863949,020,00072,ARS-01-0051264,Beacon International,Not captured,Not captured,Not captured,,,,Lee,Rachel,M,09/29/1995,female,Not captured,Not captured,Not captured,Not captured,Not captured,Not captured,Not captured,Not captured,Not captured,Not captured,Not captured,Not captured,Not captured,,,Not captured,Not captured,Not captured,Not captured,3049 Montrose Ave,,La Crescentaq,California,91214,,,Not captured,Not captured,rachelminjoo@gmail.com,Not captured,701938001,,Not captured,Not captured,Not captured,Not captured,Not captured,Not captured,
Not captured,Not captured,07/05/2019,Not captured,Not captured,863949,020,00072,ARS-01-0051263,Beacon International,Not captured,Not captured,Not captured,,,,Manning,Monica,Y,05/15/1966,female,Not captured,Not captured,Not captured,Not captured,Not captured,Not captured,Not captured,Not captured,Not captured,Not captured,Not captured,Not captured,Not captured,,,Not captured,Not captured,Not captured,Not captured,6100 BRADLEY LANE,,CLINTON,Maryland,20735,,,Not captured,Not captured,cwingmann@gmail.com,Not captured,701938000,,Not captured,Not captured,Not captured,Not captured,Not captured,Not captured,
Not captured,Not captured,07/05/2019,Not captured,Not captured,863949,020,00072,ARS-01-0051262,Beacon International,Not captured,Not captured,Not captured,,,,Manning,Christopher,S,02/15/1966,male,Not captured,Not captured,Not captured,Not captured,Not captured,Not captured,Not captured,Not captured,Not captured,Not captured,Not captured,Not captured,Not captured,,,Not captured,Not captured,Not captured,Not captured,6100 BRADLEY LANE,,CLINTON,Maryland,20735,,,Not captured,Not captured,cwingmann@gmail.com,Not captured,701937999,,Not captured,Not captured,Not captured,Not captured,Not captured,Not captured,
Not captured,Not captured,07/04/2019,Not captured,Not captured,863949,020,00072,ARS-01-0051261,Beacon International,Not captured,Not captured,Not captured,,,,Motanis-Shoufany,Nassim,,08/27/2016,male,Not captured,Not captured,Not captured,Not captured,Not captured,Not captured,Not captured,Not captured,Not captured,Not captured,Not captured,Not captured,Not captured,,,Not captured,Not captured,Not captured,Not captured,3159 South Barrington Ave APT F,,Los Angeles,California,90066,,,Not captured,Not captured,shoufanym@gmail.com,Not captured,701937998,,Not captured,Not captured,Not captured,Not captured,Not captured,Not captured,
Not captured,Not captured,07/04/2019,Not captured,Not captured,863949,020,00072,ARS-01-0051260,Beacon International,Not captured,Not captured,Not captured,,,,Motanis,Helen,,09/22/1983,female,Not captured,Not captured,Not captured,Not captured,Not captured,Not captured,Not captured,Not captured,Not captured,Not captured,Not captured,Not captured,Not captured,,,Not captured,Not captured,Not captured,Not captured,3159 South Barrington Ave APT F,,Los Angeles,California,90066,,,Not captured,Not captured,shoufanym@gmail.com,Not captured,701937997,,Not captured,Not captured,Not captured,Not captured,Not captured,Not captured,
Not captured,Not captured,07/04/2019,Not captured,Not captured,863949,020,00072,ARS-01-0051259,Beacon International,Not captured,Not captured,Not captured,,,,Shoufany,Monder,,10/12/1981,male,Not captured,Not captured,Not captured,Not captured,Not captured,Not captured,Not captured,Not captured,Not captured,Not captured,Not captured,Not captured,Not captured,,,Not captured,Not captured,Not captured,Not captured,3159 South Barrington Ave APT F,,Los Angeles,California,90066,,,Not captured,Not captured,shoufanym@gmail.com,Not captured,701937996,,Not captured,Not captured,Not captured,Not captured,Not captured,Not captured,
Not captured,Not captured,07/04/2019,Not captured,Not captured,863949,020,00072,ARS-02-0051258,Beacon America,Not captured,Not captured,Not captured,,,,Malone,Leslie,M,08/24/1971,female,Not captured,Not captured,Not captured,Not captured,Not captured,Not captured,Not captured,Not captured,Not captured,Not captured,Not captured,Not captured,Not captured,,,Not captured,Not captured,Not captured,Not captured,14507 Woodside Crossing,,Humble,Texas,77396,,,Not captured,Not captured,ellemarie6808@gmail.com,Not captured,701937995,,Not captured,Not captured,Not captured,Not captured,Not captured,Not captured,
Not captured,Not captured,07/04/2019,Not captured,Not captured,863949,020,00072,ARS-02-0051257,Beacon America,Not captured,Not captured,Not captured,,,,Rice,Colin,c,01/24/1975,male,Not captured,Not captured,Not captured,Not captured,Not captured,Not captured,Not captured,Not captured,Not captured,Not captured,Not captured,Not captured,Not captured,,,Not captured,Not captured,Not captured,Not captured,14507 Woodside Crossing,,Humble,Texas,77396,,,Not captured,Not captured,ellemarie6808@gmail.com,Not captured,701937994,,Not captured,Not captured,Not captured,Not captured,Not captured,Not captured,
Not captured,Not captured,07/04/2019,Not captured,Not captured,863949,020,00072,ARS-01-0051256,Beacon International,Not captured,Not captured,Not captured,,,,Adler,Yitta,M,09/10/2000,female,Not captured,Not captured,Not captured,Not captured,Not captured,Not captured,Not captured,Not captured,Not captured,Not captured,Not captured,Not captured,Not captured,,,Not captured,Not captured,Not captured,Not captured,1588 E. 21st St,,Brooklyn City,New York,11210,,,Not captured,Not captured,adleryitty6@gmail.com,Not captured,701937993,,Not captured,Not captured,Not captured,Not captured,Not captured,Not captured,
Not captured,Not captured,07/04/2019,Not captured,Not captured,863949,020,00072,ARS-01-0051255,Beacon International,Not captured,Not captured,Not captured,,,,Shain,Shoshana,D,05/07/2000,female,Not captured,Not captured,Not captured,Not captured,Not captured,Not captured,Not captured,Not captured,Not captured,Not captured,Not captured,Not captured,Not captured,,,Not captured,Not captured,Not captured,Not captured,1588 E. 21st St,,Brooklyn City,New York,11210,,,Not captured,Not captured,adleryitty6@gmail.com,Not captured,701937992,,Not captured,Not captured,Not captured,Not captured,Not captured,Not captured,
Not captured,Not captured,07/04/2019,Not captured,Not captured,863949,020,00072,ARS-02-0051253,Beacon America,Not captured,Not captured,Not captured,,,,Mikel,David,,12/19/2017,male,Not captured,Not captured,Not captured,Not captured,Not captured,Not captured,Not captured,Not captured,Not captured,Not captured,Not captured,Not captured,Not captured,,,Not captured,Not captured,Not captured,Not captured,42 Dykstras Way,,Monsey,,10952,845-371-1717,,Not captured,Not captured,Shaya@primeins.com,Not captured,701937989,,Not captured,Not captured,Not captured,Not captured,Not captured,Not captured,
Not captured,Not captured,07/04/2019,Not captured,Not captured,863949,020,00072,ARS-02-0051252,Beacon America,Not captured,Not captured,Not captured,,,,Mikel,Yehuda,,12/03/2015,male,Not captured,Not captured,Not captured,Not captured,Not captured,Not captured,Not captured,Not captured,Not captured,Not captured,Not captured,Not captured,Not captured,,,Not captured,Not captured,Not captured,Not captured,42 Dykstras Way,,Monsey,,10952,845-371-1717,,Not captured,Not captured,Shaya@primeins.com,Not captured,701937988,,Not captured,Not captured,Not captured,Not captured,Not captured,Not captured,
Not captured,Not captured,07/04/2019,Not captured,Not captured,863949,020,00072,ARS-02-0051251,Beacon America,Not captured,Not captured,Not captured,,,,Mikel,Chaim,,12/19/2013,male,Not captured,Not captured,Not captured,Not captured,Not captured,Not captured,Not captured,Not captured,Not captured,Not captured,Not captured,Not captured,Not captured,,,Not captured,Not captured,Not captured,Not captured,42 Dykstras Way,,Monsey,,10952,845-371-1717,,Not captured,Not captured,Shaya@primeins.com,Not captured,701937987,,Not captured,Not captured,Not captured,Not captured,Not captured,Not captured,
Not captured,Not captured,07/04/2019,Not captured,Not captured,863949,020,00072,ARS-02-0051250,Beacon America,Not captured,Not captured,Not captured,,,,Mikel,Avrohom,,10/12/2011,male,Not captured,Not captured,Not captured,Not captured,Not captured,Not captured,Not captured,Not captured,Not captured,Not captured,Not captured,Not captured,Not captured,,,Not captured,Not captured,Not captured,Not captured,42 Dykstras Way,,Monsey,,10952,845-371-1717,,Not captured,Not captured,Shaya@primeins.com,Not captured,701937986,,Not captured,Not captured,Not captured,Not captured,Not captured,Not captured,
Not captured,Not captured,07/04/2019,Not captured,Not captured,863949,020,00072,ARS-02-0051249,Beacon America,Not captured,Not captured,Not captured,,,,Mikel,Leah,,10/09/2008,female,Not captured,Not captured,Not captured,Not captured,Not captured,Not captured,Not captured,Not captured,Not captured,Not captured,Not captured,Not captured,Not captured,,,Not captured,Not captured,Not captured,Not captured,42 Dykstras Way,,Monsey,,10952,845-371-1717,,Not captured,Not captured,Shaya@primeins.com,Not captured,701937985,,Not captured,Not captured,Not captured,Not captured,Not captured,Not captured,
Not captured,Not captured,07/04/2019,Not captured,Not captured,863949,020,00072,ARS-02-0051248,Beacon America,Not captured,Not captured,Not captured,,,,Mikel,Meir,,01/30/2007,male,Not captured,Not captured,Not captured,Not captured,Not captured,Not captured,Not captured,Not captured,Not captured,Not captured,Not captured,Not captured,Not captured,,,Not captured,Not captured,Not captured,Not captured,42 Dykstras Way,,Monsey,,10952,845-371-1717,,Not captured,Not captured,Shaya@primeins.com,Not captured,701937984,,Not captured,Not captured,Not captured,Not captured,Not captured,Not captured,
Not captured,Not captured,07/04/2019,Not captured,Not captured,863949,020,00072,ARS-02-0051247,Beacon America,Not captured,Not captured,Not captured,,,,Mikel,Sorah M,,12/20/1981,female,Not captured,Not captured,Not captured,Not captured,Not captured,Not captured,Not captured,Not captured,Not captured,Not captured,Not captured,Not captured,Not captured,,,Not captured,Not captured,Not captured,Not captured,42 Dykstras Way,,Monsey,,10952,845-371-1717,,Not captured,Not captured,Shaya@primeins.com,Not captured,701937983,,Not captured,Not captured,Not captured,Not captured,Not captured,Not captured,
Not captured,Not captured,07/04/2019,Not captured,Not captured,863949,020,00072,ARS-02-0051246,Beacon America,Not captured,Not captured,Not captured,,,,Mikel,Joseph,,12/06/1979,male,Not captured,Not captured,Not captured,Not captured,Not captured,Not captured,Not captured,Not captured,Not captured,Not captured,Not captured,Not captured,Not captured,,,Not captured,Not captured,Not captured,Not captured,42 Dykstras Way,,Monsey,,10952,845-371-1717,,Not captured,Not captured,Shaya@primeins.com,Not captured,701937982,,Not captured,Not captured,Not captured,Not captured,Not captured,Not captured,
Not captured,Not captured,07/05/2019,Not captured,Not captured,863949,020,00072,ARS-02-0051245,Beacon America,Not captured,Not captured,Not captured,,,,rodriguez,luis,,02/13/2007,male,Not captured,Not captured,Not captured,Not captured,Not captured,Not captured,Not captured,Not captured,Not captured,Not captured,Not captured,Not captured,Not captured,PATRICIA MORENO,MOTHER,Not captured,Not captured,Not captured,Not captured,LAGUNA VISTA 41,,CABO SAN LUCAS,Baja California Sur,23450,6241576741,,Not captured,Not captured,luz@innoventures.ca,Not captured,701937981,,Not captured,Not captured,Not captured,Not captured,Not captured,Not captured,
Not captured,Not captured,07/05/2019,Not captured,Not captured,863949,020,00072,ARS-02-0051244,Beacon America,Not captured,Not captured,Not captured,Passport(NA),,,solguren,luz,,12/24/1983,female,Not captured,Not captured,Not captured,Not captured,Not captured,Not captured,Not captured,Not captured,Not captured,Not captured,Not captured,Not captured,Not captured,PATRICIA MORENO,MOTHER,Not captured,Not captured,Not captured,Not captured,LAGUNA VISTA 41,,CABO SAN LUCAS,Baja California Sur,23450,6241576741,,Not captured,Not captured,luz@innoventures.ca,Not captured,701937980,,Not captured,Not captured,Not captured,Not captured,Not captured,Not captured,
Not captured,Not captured,07/04/2019,Not captured,Not captured,863949,020,00072,ARS-01-0051243,Beacon International,Not captured,Not captured,Not captured,,,,Cherry,Nathanael,A,02/17/1981,male,Not captured,Not captured,Not captured,Not captured,Not captured,Not captured,Not captured,Not captured,Not captured,Not captured,Not captured,Not captured,Not captured,,,Not captured,Not captured,Not captured,Not captured,15 Haley Dr.,,Hampton,,23661,,,Not captured,Not captured,ncher2011@gmail.com,Not captured,701937979,,Not captured,Not captured,Not captured,Not captured,Not captured,Not captured,
Not captured,Not captured,07/04/2019,Not captured,Not captured,863949,020,00072,ARS-01-0051241,Beacon International,Not captured,Not captured,Not captured,,,,Perini,Odete,,11/01/1960,female,Not captured,Not captured,Not captured,Not captured,Not captured,Not captured,Not captured,Not captured,Not captured,Not captured,Not captured,Not captured,Not captured,,,Not captured,Not captured,Not captured,Not captured,Rua vacylly,,Farroupilha RS,,95176310,,,Not captured,Not captured,anunez571@gmail.com,Not captured,701937977,,Not captured,Not captured,Not captured,Not captured,Not captured,Not captured,
Not captured,Not captured,07/04/2019,Not captured,Not captured,863949,020,00072,ARS-01-0051240,Beacon International,Not captured,Not captured,Not captured,,,,Biasibetti,Eloi,,02/20/1954,male,Not captured,Not captured,Not captured,Not captured,Not captured,Not captured,Not captured,Not captured,Not captured,Not captured,Not captured,Not captured,Not captured,,,Not captured,Not captured,Not captured,Not captured,Rua vacylly,,Farroupilha RS,,95176310,,,Not captured,Not captured,anunez571@gmail.com,Not captured,701937976,,Not captured,Not captured,Not captured,Not captured,Not captured,Not captured,
Not captured,Not captured,07/03/2019,Not captured,Not captured,863949,020,00072,ARS-01-0051238,Beacon International,Not captured,Not captured,Not captured,,,,Yap,Amanda,,07/04/1985,female,Not captured,Not captured,Not captured,Not captured,Not captured,Not captured,Not captured,Not captured,Not captured,Not captured,Not captured,Not captured,Not captured,,,Not captured,Not captured,Not captured,Not captured,41 Fern St,,Bangor,Maine,04401,,,Not captured,Not captured,amandarya@gmail.com,Not captured,701937974,,Not captured,Not captured,Not captured,Not captured,Not captured,Not captured,
Not captured,Not captured,07/03/2019,Not captured,Not captured,863949,020,00072,ARS-01-0051237,Beacon International,Not captured,Not captured,Not captured,,,,Santulli,Elizabeth,,12/15/1989,female,Not captured,Not captured,Not captured,Not captured,Not captured,Not captured,Not captured,Not captured,Not captured,Not captured,Not captured,Not captured,Not captured,,,Not captured,Not captured,Not captured,Not captured,132 Main St,,East Hampton,Connecticut,06424,,,Not captured,Not captured,rorydbeirne@gmail.com,Not captured,701937973,,Not captured,Not captured,Not captured,Not captured,Not captured,Not captured,
Not captured,Not captured,07/03/2019,Not captured,Not captured,863949,020,00072,ARS-01-0051236,Beacon International,Not captured,Not captured,Not captured,,,,Beirne,Rory,,11/25/1988,male,Not captured,Not captured,Not captured,Not captured,Not captured,Not captured,Not captured,Not captured,Not captured,Not captured,Not captured,Not captured,Not captured,,,Not captured,Not captured,Not captured,Not captured,132 Main St,,East Hampton,Connecticut,06424,,,Not captured,Not captured,rorydbeirne@gmail.com,Not captured,701937972,,Not captured,Not captured,Not captured,Not captured,Not captured,Not captured,
Not captured,Not captured,07/03/2019,Not captured,Not captured,863949,020,00072,ARS-02-0051234,Beacon America,Not captured,Not captured,Not captured,,,,Yu,Le,T,01/06/1991,male,Not captured,Not captured,Not captured,Not captured,Not captured,Not captured,Not captured,Not captured,Not captured,Not captured,Not captured,Not captured,Not captured,,,Not captured,Not captured,Not captured,Not captured,3249 34th street,,astoria,New York,11106,,,Not captured,Not captured,leyu00@gmail.com,Not captured,701937965,,Not captured,Not captured,Not captured,Not captured,Not captured,Not captured,
Not captured,Not captured,07/03/2019,Not captured,Not captured,863949,020,00072,ARS-01-0051231,Beacon International,Not captured,Not captured,Not captured,,,,Wright,Virginia,T,06/01/1954,female,Not captured,Not captured,Not captured,Not captured,Not captured,Not captured,Not captured,Not captured,Not captured,Not captured,Not captured,Not captured,Not captured,,,Not captured,Not captured,Not captured,Not captured,647 WOODWARD WAY NW,,Atlanta,Georgia,30327,,,Not captured,Not captured,virginia.wright@harrynorman.com,Not captured,701937962,,Not captured,Not captured,Not captured,Not captured,Not captured,Not captured,
Not captured,Not captured,07/03/2019,Not captured,Not captured,863949,020,00072,ARS-01-0051230,Beacon International,Not captured,Not captured,Not captured,,,,Digesti,Deborah,J,11/27/1962,female,Not captured,Not captured,Not captured,Not captured,Not captured,Not captured,Not captured,Not captured,Not captured,Not captured,Not captured,Not captured,Not captured,,,Not captured,Not captured,Not captured,Not captured,15117 Dasmarinas,,Corpus Christi,Texas,78418,,,Not captured,Not captured,ddigesti1@yahoo.com,Not captured,701937932,,Not captured,Not captured,Not captured,Not captured,Not captured,Not captured,
Not captured,Not captured,07/03/2019,Not captured,Not captured,863949,020,00072,ARS-01-0051225,Beacon International,Not captured,Not captured,Not captured,,,,Royce,Kevin,J,07/23/1999,male,Not captured,Not captured,Not captured,Not captured,Not captured,Not captured,Not captured,Not captured,Not captured,Not captured,Not captured,Not captured,Not captured,,,Not captured,Not captured,Not captured,Not captured,336 Laurel Drive,,York,Pennsylvania,17406,,,Not captured,Not captured,maria@royceadv.com,Not captured,701937890,,Not captured,Not captured,Not captured,Not captured,Not captured,Not captured,
Not captured,Not captured,07/03/2019,Not captured,Not captured,863949,020,00072,ARS-01-0051224,Beacon International,Not captured,Not captured,Not captured,,,,Royce,Elliot,W,07/30/1996,male,Not captured,Not captured,Not captured,Not captured,Not captured,Not captured,Not captured,Not captured,Not captured,Not captured,Not captured,Not captured,Not captured,,,Not captured,Not captured,Not captured,Not captured,336 Laurel Drive,,York,Pennsylvania,17406,,,Not captured,Not captured,maria@royceadv.com,Not captured,701937889,,Not captured,Not captured,Not captured,Not captured,Not captured,Not captured,
Not captured,Not captured,07/03/2019,Not captured,Not captured,863949,020,00072,ARS-01-0051223,Beacon International,Not captured,Not captured,Not captured,,,,Royce,Mark,A,06/23/1961,male,Not captured,Not captured,Not captured,Not captured,Not captured,Not captured,Not captured,Not captured,Not captured,Not captured,Not captured,Not captured,Not captured,,,Not captured,Not captured,Not captured,Not captured,336 Laurel Drive,,York,Pennsylvania,17406,,,Not captured,Not captured,maria@royceadv.com,Not captured,701937888,,Not captured,Not captured,Not captured,Not captured,Not captured,Not captured,