EE Transaction Type,Dependent Transaction Type,Effective Date,EE Signature,EE Signature Date,Control,Suffix,Account,Plan Number,Plan Name,Claim Office,Network ID Number,Customer Code,EE SSN,Dependent SSN,Dependent Relationship,Last Name,First Name,Middle Initial,DOB,Gender,Ethnicity,PCP/PCD,PCP/PCD Current Patient,Provider Cap Office Number,COB,Dep Student Indicator,Dep OOA Indicator,EE Prior Coverage Indicator,EE Late Entrant,EE Language Indicator,Hire Date,Earnings,Earnings Frequency,Beneficiary (Last Name First Name MI),Beneficiary Relationship,Continuation of Coverage Expiration Date,Continuation of Coverage Event Date,Continuation of Coverage Length of Coverage,Work Location Zip Code,Street Address Line 1,Street Address Line 2,City,State,Zip Code,Home Phone Number,Work Phone Number,Accept Code,Evidence Code,EE Email Address,Communication Disability Code,EE Alternate ID,Dep Alternate ID,Old Control,Old Suffix,Old Account,New Control,New Suffix,New Account,
Not captured,Not captured,07/01/2019,Not captured,Not captured,863949,020,00072,ARS-01-0051162,Beacon International,Not captured,Not captured,Not captured,,,,Seaboch,Timothy,,06/29/1993,male,Not captured,Not captured,Not captured,Not captured,Not captured,Not captured,Not captured,Not captured,Not captured,Not captured,Not captured,Not captured,Not captured,,,Not captured,Not captured,Not captured,Not captured,9791 Roe Drive,,Santee,California,92071,,,Not captured,Not captured,timseaboch@yahoo.com,Not captured,701937778,,Not captured,Not captured,Not captured,Not captured,Not captured,Not captured,
Not captured,Not captured,07/01/2019,Not captured,Not captured,863949,020,00072,ARS-01-0051158,Beacon International,Not captured,Not captured,Not captured,,,,Maamaatuaiahutapu,Keitapu,R,07/06/1964,male,Not captured,Not captured,Not captured,Not captured,Not captured,Not captured,Not captured,Not captured,Not captured,Not captured,Not captured,Not captured,Not captured,,,Not captured,Not captured,Not captured,Not captured,BP 8367,,Tahiti,,98719,,,Not captured,Not captured,keitapu.maamaatua@gmail.com,Not captured,701937771,,Not captured,Not captured,Not captured,Not captured,Not captured,Not captured,
Not captured,Not captured,07/01/2019,Not captured,Not captured,863949,020,00072,ARS-01-0051157,Beacon International,Not captured,Not captured,Not captured,,,,Mason,Kindra,L,11/15/1986,female,Not captured,Not captured,Not captured,Not captured,Not captured,Not captured,Not captured,Not captured,Not captured,Not captured,Not captured,Not captured,Not captured,,,Not captured,Not captured,Not captured,Not captured,1 Laurel St,,San Carlos,California,94070,,,Not captured,Not captured,carolyn.g.mason@gmail.com,Not captured,701937770,,Not captured,Not captured,Not captured,Not captured,Not captured,Not captured,
Not captured,Not captured,07/01/2019,Not captured,Not captured,863949,020,00072,ARS-01-0051156,Beacon International,Not captured,Not captured,Not captured,,,,Peine,Clare,A,02/09/1996,female,Not captured,Not captured,Not captured,Not captured,Not captured,Not captured,Not captured,Not captured,Not captured,Not captured,Not captured,Not captured,Not captured,,,Not captured,Not captured,Not captured,Not captured,2252 Goodrich Avenue,,Saint Paul,Minnesota,55105,,,Not captured,Not captured,peine002@umn.edu,Not captured,701937769,,Not captured,Not captured,Not captured,Not captured,Not captured,Not captured,
Not captured,Not captured,07/01/2019,Not captured,Not captured,863949,020,00072,ARS-01-0051149,Beacon International,Not captured,Not captured,Not captured,,,,Browne,Frances,G,09/08/1997,female,Not captured,Not captured,Not captured,Not captured,Not captured,Not captured,Not captured,Not captured,Not captured,Not captured,Not captured,Not captured,Not captured,,,Not captured,Not captured,Not captured,Not captured,6 South Wynstone Dr,,Barrington,Illinois,60010,,,Not captured,Not captured,tbrownejr@yahoo.com,Not captured,701937762,,Not captured,Not captured,Not captured,Not captured,Not captured,Not captured,
Not captured,Not captured,07/01/2019,Not captured,Not captured,863949,020,00072,ARS-01-0051148,Beacon International,Not captured,Not captured,Not captured,,,,Browne,Margaret,E,12/18/1962,female,Not captured,Not captured,Not captured,Not captured,Not captured,Not captured,Not captured,Not captured,Not captured,Not captured,Not captured,Not captured,Not captured,,,Not captured,Not captured,Not captured,Not captured,6 South Wynstone Dr,,Barrington,Illinois,60010,,,Not captured,Not captured,tbrownejr@yahoo.com,Not captured,701937761,,Not captured,Not captured,Not captured,Not captured,Not captured,Not captured,
Not captured,Not captured,07/01/2019,Not captured,Not captured,863949,020,00072,ARS-01-0051147,Beacon International,Not captured,Not captured,Not captured,,,,Browne,Thomas,E,06/01/1963,male,Not captured,Not captured,Not captured,Not captured,Not captured,Not captured,Not captured,Not captured,Not captured,Not captured,Not captured,Not captured,Not captured,,,Not captured,Not captured,Not captured,Not captured,6 South Wynstone Dr,,Barrington,Illinois,60010,,,Not captured,Not captured,tbrownejr@yahoo.com,Not captured,701937760,,Not captured,Not captured,Not captured,Not captured,Not captured,Not captured,
Not captured,Not captured,07/01/2019,Not captured,Not captured,863949,020,00072,ARS-01-0051144,Beacon International,Not captured,Not captured,Not captured,,,,Jubera,Elizabeth,,10/01/1980,female,Not captured,Not captured,Not captured,Not captured,Not captured,Not captured,Not captured,Not captured,Not captured,Not captured,Not captured,Not captured,Not captured,,,Not captured,Not captured,Not captured,Not captured,3261 Cape Cod Ct,,Alameda,California,94501,,,Not captured,Not captured,ejubera@gmail.com,Not captured,701937742,,Not captured,Not captured,Not captured,Not captured,Not captured,Not captured,
Not captured,Not captured,07/01/2019,Not captured,Not captured,863949,020,00072,ARS-02-0051141,Beacon America,Not captured,Not captured,Not captured,Passport(G12202955),,,Acosta Marquez,ARACELI,,04/07/1989,female,Not captured,Not captured,Not captured,Not captured,Not captured,Not captured,Not captured,Not captured,Not captured,Not captured,Not captured,Not captured,Not captured,Giuseppe Ciampa,Husband,Not captured,Not captured,Not captured,Not captured,Via Caracciolo 201a,,Meta,Napoli,80062,+393453184120,,Not captured,Not captured,shellyam1704@gmail.com,Not captured,701937739,,Not captured,Not captured,Not captured,Not captured,Not captured,Not captured,
Not captured,Not captured,07/01/2019,Not captured,Not captured,863949,020,00072,ARS-01-0051139,Beacon International,Not captured,Not captured,Not captured,Passport(596846948),,,Eggert,Hartmut,,11/08/1965,male,Not captured,Not captured,Not captured,Not captured,Not captured,Not captured,Not captured,Not captured,Not captured,Not captured,Not captured,Not captured,Not captured,Silke Egget,Sister,Not captured,Not captured,Not captured,Not captured,1010 N Central Ave,,Glendale,California,91202,8182617746,,Not captured,Not captured,Hartmut8@bycmail.com,Not captured,701937737,,Not captured,Not captured,Not captured,Not captured,Not captured,Not captured,
Not captured,Not captured,07/01/2019,Not captured,Not captured,863949,020,00072,OVI-28-0051138,OverseasCare Visitors Insurance Plan,Not captured,Not captured,Not captured,Passport(N9605927),,,RAJENDRAN,ABARANJI,,04/25/1959,female,Not captured,Not captured,Not captured,Not captured,Not captured,Not captured,Not captured,Not captured,Not captured,Not captured,Not captured,Not captured,Not captured,KAVITHA rajendran,DAUGHTER,Not captured,Not captured,Not captured,Not captured,3 Robbins Ln Apt D,,Rocky Hill,Connecticut,06067,9592829469,,Not captured,Not captured,kavi.ramji@gmail.com,Not captured,701937736,,Not captured,Not captured,Not captured,Not captured,Not captured,Not captured,
Not captured,Not captured,07/01/2019,Not captured,Not captured,863949,020,00072,OVI-28-0051137,OverseasCare Visitors Insurance Plan,Not captured,Not captured,Not captured,Passport(N9605927),,,RENGASAMY NAICKER,RAJENDRAN,,10/17/1948,male,Not captured,Not captured,Not captured,Not captured,Not captured,Not captured,Not captured,Not captured,Not captured,Not captured,Not captured,Not captured,Not captured,KAVITHA rajendran,DAUGHTER,Not captured,Not captured,Not captured,Not captured,3 Robbins Ln Apt D,,Rocky Hill,Connecticut,06067,9592829469,,Not captured,Not captured,kavi.ramji@gmail.com,Not captured,701937735,,Not captured,Not captured,Not captured,Not captured,Not captured,Not captured,
Not captured,Not captured,06/30/2019,Not captured,Not captured,863949,020,00072,ARS-01-0051136,Beacon International,Not captured,Not captured,Not captured,,,,Nicewander,David,,08/17/1968,male,Not captured,Not captured,Not captured,Not captured,Not captured,Not captured,Not captured,Not captured,Not captured,Not captured,Not captured,Not captured,Not captured,,,Not captured,Not captured,Not captured,Not captured,611 S Cesar Chavez Blvd,,Dallas,Texas,75201,,,Not captured,Not captured,sheri7510@gmail.com,Not captured,701937734,,Not captured,Not captured,Not captured,Not captured,Not captured,Not captured,
Not captured,Not captured,06/30/2019,Not captured,Not captured,863949,020,00072,ARS-01-0051135,Beacon International,Not captured,Not captured,Not captured,,,,Winsper,Sheri,,10/05/1975,female,Not captured,Not captured,Not captured,Not captured,Not captured,Not captured,Not captured,Not captured,Not captured,Not captured,Not captured,Not captured,Not captured,,,Not captured,Not captured,Not captured,Not captured,611 S Cesar Chavez Blvd,,Dallas,Texas,75201,,,Not captured,Not captured,sheri7510@gmail.com,Not captured,701937733,,Not captured,Not captured,Not captured,Not captured,Not captured,Not captured,
Not captured,Not captured,06/30/2019,Not captured,Not captured,863949,020,00072,ARS-01-0051134,Beacon International,Not captured,Not captured,Not captured,,,,Metchik,Robyn,,02/21/1951,female,Not captured,Not captured,Not captured,Not captured,Not captured,Not captured,Not captured,Not captured,Not captured,Not captured,Not captured,Not captured,Not captured,,,Not captured,Not captured,Not captured,Not captured,1316 Broad Street,,San Luis Obispo,California,93401,,,Not captured,Not captured,paul@metchiklaw.com,Not captured,701937732,,Not captured,Not captured,Not captured,Not captured,Not captured,Not captured,
Not captured,Not captured,06/30/2019,Not captured,Not captured,863949,020,00072,ARS-01-0051133,Beacon International,Not captured,Not captured,Not captured,,,,Metchik,Paul,,06/05/1951,male,Not captured,Not captured,Not captured,Not captured,Not captured,Not captured,Not captured,Not captured,Not captured,Not captured,Not captured,Not captured,Not captured,,,Not captured,Not captured,Not captured,Not captured,1316 Broad Street,,San Luis Obispo,California,93401,,,Not captured,Not captured,paul@metchiklaw.com,Not captured,701937731,,Not captured,Not captured,Not captured,Not captured,Not captured,Not captured,
Not captured,Not captured,06/30/2019,Not captured,Not captured,863949,020,00072,ARS-01-0051132,Beacon International,Not captured,Not captured,Not captured,,,,Hindle,Holly,,10/03/2010,female,Not captured,Not captured,Not captured,Not captured,Not captured,Not captured,Not captured,Not captured,Not captured,Not captured,Not captured,Not captured,Not captured,,,Not captured,Not captured,Not captured,Not captured,1128 Gambelli Dr,,Yorktown Heights,New York,10598,,,Not captured,Not captured,veronikahindle@gmail.com,Not captured,701937730,,Not captured,Not captured,Not captured,Not captured,Not captured,Not captured,
Not captured,Not captured,06/30/2019,Not captured,Not captured,863949,020,00072,ARS-01-0051131,Beacon International,Not captured,Not captured,Not captured,,,,Hindle,Veronika,,08/12/1976,female,Not captured,Not captured,Not captured,Not captured,Not captured,Not captured,Not captured,Not captured,Not captured,Not captured,Not captured,Not captured,Not captured,,,Not captured,Not captured,Not captured,Not captured,1128 Gambelli Dr,,Yorktown Heights,New York,10598,,,Not captured,Not captured,veronikahindle@gmail.com,Not captured,701937729,,Not captured,Not captured,Not captured,Not captured,Not captured,Not captured,
Not captured,Not captured,06/30/2019,Not captured,Not captured,863949,020,00072,ARS-01-0051128,Beacon International,Not captured,Not captured,Not captured,,,,Olguin Ribera,Rodney Gonzalo,,06/01/1979,male,Not captured,Not captured,Not captured,Not captured,Not captured,Not captured,Not captured,Not captured,Not captured,Not captured,Not captured,Not captured,Not captured,,,Not captured,Not captured,Not captured,Not captured,Alekse Santica 5,,Mostar,,88000,,,Not captured,Not captured,olguinrod@gmail.com,Not captured,701937726,,Not captured,Not captured,Not captured,Not captured,Not captured,Not captured,
Not captured,Not captured,06/29/2019,Not captured,Not captured,863949,020,00072,ARS-02-0051126,Beacon America,Not captured,Not captured,Not captured,Passport(R4727835),,,Chinnasamy Naicker,Rajalakshmi,,04/05/1949,female,Not captured,Not captured,Not captured,Not captured,Not captured,Not captured,Not captured,Not captured,Not captured,Not captured,Not captured,Not captured,Not captured,Vishnupriya Venkataramanujam,Daughter,Not captured,Not captured,Not captured,Not captured,304 Apache Drive,,Cedar Park,Texas,78613,5126568439,,Not captured,Not captured,rampreeya@gmail.com,Not captured,701937724,,Not captured,Not captured,Not captured,Not captured,Not captured,Not captured,
Not captured,Not captured,06/29/2019,Not captured,Not captured,863949,020,00072,ARS-01-0051125,Beacon International,Not captured,Not captured,Not captured,,,,Bennett,Connie,M,07/29/1963,female,Not captured,Not captured,Not captured,Not captured,Not captured,Not captured,Not captured,Not captured,Not captured,Not captured,Not captured,Not captured,Not captured,,,Not captured,Not captured,Not captured,Not captured,1479 Bedford Avenue,,Brooklyn,New York,11216,,,Not captured,Not captured,lcbills14@gmail.com,Not captured,701937723,,Not captured,Not captured,Not captured,Not captured,Not captured,Not captured,
Not captured,Not captured,06/29/2019,Not captured,Not captured,863949,020,00072,ARS-01-0051124,Beacon International,Not captured,Not captured,Not captured,,,,Bennett,Lloyd,D,03/08/1958,male,Not captured,Not captured,Not captured,Not captured,Not captured,Not captured,Not captured,Not captured,Not captured,Not captured,Not captured,Not captured,Not captured,,,Not captured,Not captured,Not captured,Not captured,1479 Bedford Avenue,,Brooklyn,New York,11216,,,Not captured,Not captured,lcbills14@gmail.com,Not captured,701937722,,Not captured,Not captured,Not captured,Not captured,Not captured,Not captured,
Not captured,Not captured,06/29/2019,Not captured,Not captured,863949,020,00072,ARS-02-0051123,Beacon America,Not captured,Not captured,Not captured,,,,Joshi,Rama,,06/01/1943,female,Not captured,Not captured,Not captured,Not captured,Not captured,Not captured,Not captured,Not captured,Not captured,Not captured,Not captured,Not captured,Not captured,Ashish joshi,Son,Not captured,Not captured,Not captured,Not captured,33 lavender dr,,Edison,New Jersey,08820,4435706018,,Not captured,Not captured,Ashish1875@gmail.com,Not captured,701937721,,Not captured,Not captured,Not captured,Not captured,Not captured,Not captured,
Not captured,Not captured,06/29/2019,Not captured,Not captured,863949,020,00072,ARS-01-0051122,Beacon International,Not captured,Not captured,Not captured,,,,Vilas Delgado,Carlos,,04/02/1989,male,Not captured,Not captured,Not captured,Not captured,Not captured,Not captured,Not captured,Not captured,Not captured,Not captured,Not captured,Not captured,Not captured,,,Not captured,Not captured,Not captured,Not captured,1475 Euclid Street NW,,Washington,Dist. of Columbia,20009,,,Not captured,Not captured,carlosvilasd@gmail.com,Not captured,701937720,,Not captured,Not captured,Not captured,Not captured,Not captured,Not captured,
Not captured,Not captured,06/29/2019,Not captured,Not captured,863949,020,00072,ARS-01-0051121,Beacon International,Not captured,Not captured,Not captured,,,,Hortop,Mark,G,02/27/1994,male,Not captured,Not captured,Not captured,Not captured,Not captured,Not captured,Not captured,Not captured,Not captured,Not captured,Not captured,Not captured,Not captured,,,Not captured,Not captured,Not captured,Not captured,360 West 34th Street 11R,,New York,New York,10001,,,Not captured,Not captured,henshawrebecca@gmail.com,Not captured,701937719,,Not captured,Not captured,Not captured,Not captured,Not captured,Not captured,
Not captured,Not captured,06/29/2019,Not captured,Not captured,863949,020,00072,ARS-01-0051120,Beacon International,Not captured,Not captured,Not captured,,,,Henshaw,Rebecca,,09/13/1993,female,Not captured,Not captured,Not captured,Not captured,Not captured,Not captured,Not captured,Not captured,Not captured,Not captured,Not captured,Not captured,Not captured,,,Not captured,Not captured,Not captured,Not captured,360 West 34th Street 11R,,New York,New York,10001,,,Not captured,Not captured,henshawrebecca@gmail.com,Not captured,701937718,,Not captured,Not captured,Not captured,Not captured,Not captured,Not captured,
Not captured,Not captured,06/29/2019,Not captured,Not captured,863949,020,00072,ARS-02-0051119,Beacon America,Not captured,Not captured,Not captured,Passport(C557576),,,Ribeiro,Vitor,M,03/05/1948,male,Not captured,Not captured,Not captured,Not captured,Not captured,Not captured,Not captured,Not captured,Not captured,Not captured,Not captured,Not captured,Not captured,,,Not captured,Not captured,Not captured,Not captured,Av da Republica 81 6E,,Matosinhos,Porto,4450 241,+351912108845,,Not captured,Not captured,vitorribeiro.boanova@hotmail.com,Not captured,701937695,,Not captured,Not captured,Not captured,Not captured,Not captured,Not captured,
Not captured,Not captured,06/30/2019,Not captured,Not captured,863949,020,00072,ARS-02-0051111,Beacon America,Not captured,Not captured,Not captured,Passport(EC7516950),,,Pangantihon,Sandie,E,12/16/1973,male,Not captured,Not captured,Not captured,Not captured,Not captured,Not captured,Not captured,Not captured,Not captured,Not captured,Not captured,Not captured,Not captured,Ernesto Pangantihon,Husband,Not captured,Not captured,Not captured,Not captured,8730 West Tonopah Drive,,Peoria,Arizona,85382,6235615378,,Not captured,Not captured,monalewars@yahoo.com,Not captured,701937642,,Not captured,Not captured,Not captured,Not captured,Not captured,Not captured,
Not captured,Not captured,07/01/2019,Not captured,Not captured,863949,020,00072,ARS-03-0050911,Essential America,Not captured,Not captured,Not captured,Passport(494220013),,,Hoffman,meyer,,05/21/1955,male,Not captured,Not captured,Not captured,Not captured,Not captured,Not captured,Not captured,Not captured,Not captured,Not captured,Not captured,Not captured,Not captured,,,Not captured,Not captured,Not captured,Not captured,60 South 8th Street,,Brooklyn,New York,11249,7183885629,,Not captured,Not captured,meyermhoffman@gmail.com,Not captured,701937162,,Not captured,Not captured,Not captured,Not captured,Not captured,Not captured,
Not captured,Not captured,07/01/2019,Not captured,Not captured,863949,020,00072,ARS-03-0050911,Essential America,Not captured,Not captured,Not captured,,Passport(TZ1056898),Spouse,Hoffman,Kinuko,,01/27/1955,female,Not captured,Not captured,Not captured,Not captured,Not captured,Not captured,Not captured,Not captured,Not captured,Not captured,Not captured,Not captured,Not captured,,,Not captured,Not captured,Not captured,Not captured,60 South 8th Street,,Brooklyn,New York,11249,7183885629,,Not captured,Not captured,meyermhoffman@gmail.com,Not captured,,701937163,Not captured,Not captured,Not captured,Not captured,Not captured,Not captured,
Not captured,Not captured,06/30/2019,Not captured,Not captured,863949,020,00072,ARS-01-0051070,Beacon International,Not captured,Not captured,Not captured,,,,Rietveld,Andrew,,03/04/2002,male,Not captured,Not captured,Not captured,Not captured,Not captured,Not captured,Not captured,Not captured,Not captured,Not captured,Not captured,Not captured,Not captured,Jeffrey Rietveld,Father,Not captured,Not captured,Not captured,Not captured,114 E Main Ave,,Zeeland,Michigan,49464,616-879-9588,616-772-5544,Not captured,Not captured,jrietveld@ootbgames.com,Not captured,701937568,,Not captured,Not captured,Not captured,Not captured,Not captured,Not captured,
Not captured,Not captured,06/29/2019,Not captured,Not captured,863949,020,00072,ARS-01-0051064,Beacon International,Not captured,Not captured,Not captured,,,,Schira,Gregoire,H,01/14/1978,male,Not captured,Not captured,Not captured,Not captured,Not captured,Not captured,Not captured,Not captured,Not captured,Not captured,Not captured,Not captured,Not captured,,,Not captured,Not captured,Not captured,Not captured,Junction Court,,Nairobi,,6052,,,Not captured,Not captured,gschira@safer-access.com,Not captured,701937541,,Not captured,Not captured,Not captured,Not captured,Not captured,Not captured,
Not captured,Not captured,06/30/2019,Not captured,Not captured,863949,020,00072,ARS-01-0051045,Beacon International,Not captured,Not captured,Not captured,Passport(644284656),,,Gorodetsky,Sara,,04/05/2004,female,Not captured,Not captured,Not captured,Not captured,Not captured,Not captured,Not captured,Not captured,Not captured,Not captured,Not captured,Not captured,Not captured,Mendy Gorodetsky,Mendy Gorodetsky,Not captured,Not captured,Not captured,Not captured,132 Washington Ave,,Brooklyn,New York,11205,7184151300,,Not captured,Not captured,mendy@asbestway.com,Not captured,701937522,,Not captured,Not captured,Not captured,Not captured,Not captured,Not captured,
Not captured,Not captured,06/29/2019,Not captured,Not captured,863949,020,00072,ARS-02-0051037,Beacon America,Not captured,Not captured,Not captured,Passport(na),,,Medina,Reinerio Dario,,09/17/1982,male,Not captured,Not captured,Not captured,Not captured,Not captured,Not captured,Not captured,Not captured,Not captured,Not captured,Not captured,Not captured,Not captured,Estate,na,Not captured,Not captured,Not captured,Not captured,National Center for State Courts,,Bogota,Distrito Capltal de Santa Fe de Bogot&atilde;,na,5714898640 114,,Not captured,Not captured,yrodriguez@ncsc.co,Not captured,701937514,,Not captured,Not captured,Not captured,Not captured,Not captured,Not captured,
Not captured,Not captured,06/29/2019,Not captured,Not captured,863949,020,00072,ARS-01-0051036,Beacon International,Not captured,Not captured,Not captured,,,,Uffmann,Alexis,M,09/01/1996,female,Not captured,Not captured,Not captured,Not captured,Not captured,Not captured,Not captured,Not captured,Not captured,Not captured,Not captured,Not captured,Not captured,David Todd Uffmann,Husband,Not captured,Not captured,Not captured,Not captured,1505 W. Springfield,,St. James,Missouri,65559,573-690-2105,573-690-2105,Not captured,Not captured,rebecca.uffmann@gmail.com,Not captured,701937513,,Not captured,Not captured,Not captured,Not captured,Not captured,Not captured,
Not captured,Not captured,06/29/2019,Not captured,Not captured,863949,020,00072,ARS-01-0051035,Beacon International,Not captured,Not captured,Not captured,Passport(529796357),,,Uffmann,Rebecca,J,03/14/1972,female,Not captured,Not captured,Not captured,Not captured,Not captured,Not captured,Not captured,Not captured,Not captured,Not captured,Not captured,Not captured,Not captured,David Todd Uffmann,Husband,Not captured,Not captured,Not captured,Not captured,1505 W. Springfield,,St. James,Missouri,65559,573-690-2105,573-690-2105,Not captured,Not captured,rebecca.uffmann@gmail.com,Not captured,701937512,,Not captured,Not captured,Not captured,Not captured,Not captured,Not captured,