EE Transaction Type,Dependent Transaction Type,Effective Date,EE Signature,EE Signature Date,Control,Suffix,Account,Plan Number,Plan Name,Claim Office,Network ID Number,Customer Code,EE SSN,Dependent SSN,Dependent Relationship,Last Name,First Name,Middle Initial,DOB,Gender,Ethnicity,PCP/PCD,PCP/PCD Current Patient,Provider Cap Office Number,COB,Dep Student Indicator,Dep OOA Indicator,EE Prior Coverage Indicator,EE Late Entrant,EE Language Indicator,Hire Date,Earnings,Earnings Frequency,Beneficiary (Last Name First Name MI),Beneficiary Relationship,Continuation of Coverage Expiration Date,Continuation of Coverage Event Date,Continuation of Coverage Length of Coverage,Work Location Zip Code,Street Address Line 1,Street Address Line 2,City,State,Zip Code,Home Phone Number,Work Phone Number,Accept Code,Evidence Code,EE Email Address,Communication Disability Code,EE Alternate ID,Dep Alternate ID,Old Control,Old Suffix,Old Account,New Control,New Suffix,New Account,
Not captured,Not captured,06/28/2019,Not captured,Not captured,863949,020,00072,ARS-01-0051118,Beacon International,Not captured,Not captured,Not captured,,,,Hilferty,Brenna,J,11/25/1992,female,Not captured,Not captured,Not captured,Not captured,Not captured,Not captured,Not captured,Not captured,Not captured,Not captured,Not captured,Not captured,Not captured,,,Not captured,Not captured,Not captured,Not captured,3829 Calvert Street NW,,Washington,Dist. of Columbia,20007,,,Not captured,Not captured,joanne.hilferty@gmail.com,Not captured,701937680,,Not captured,Not captured,Not captured,Not captured,Not captured,Not captured,
Not captured,Not captured,06/28/2019,Not captured,Not captured,863949,020,00072,ARS-01-0051117,Beacon International,Not captured,Not captured,Not captured,,,,Samuels,Rhiannon,,05/27/1991,female,Not captured,Not captured,Not captured,Not captured,Not captured,Not captured,Not captured,Not captured,Not captured,Not captured,Not captured,Not captured,Not captured,,,Not captured,Not captured,Not captured,Not captured,2178 Grist Mill Dr SW,,Concord,North Carolina,28025,,,Not captured,Not captured,andrewjacobsamuels@gmail.com,Not captured,701937679,,Not captured,Not captured,Not captured,Not captured,Not captured,Not captured,
Not captured,Not captured,06/28/2019,Not captured,Not captured,863949,020,00072,ARS-01-0051116,Beacon International,Not captured,Not captured,Not captured,,,,Samuels,Andrew,,11/21/1990,male,Not captured,Not captured,Not captured,Not captured,Not captured,Not captured,Not captured,Not captured,Not captured,Not captured,Not captured,Not captured,Not captured,,,Not captured,Not captured,Not captured,Not captured,2178 Grist Mill Dr SW,,Concord,North Carolina,28025,,,Not captured,Not captured,andrewjacobsamuels@gmail.com,Not captured,701937678,,Not captured,Not captured,Not captured,Not captured,Not captured,Not captured,
Not captured,Not captured,06/28/2019,Not captured,Not captured,863949,020,00072,ARS-01-0051115,Beacon International,Not captured,Not captured,Not captured,,,,Schneeberger,Aaron,P,06/23/1987,male,Not captured,Not captured,Not captured,Not captured,Not captured,Not captured,Not captured,Not captured,Not captured,Not captured,Not captured,Not captured,Not captured,,,Not captured,Not captured,Not captured,Not captured,618 Ocean Parkway,,Brooklyn,New York,11218,,,Not captured,Not captured,aa.schnee@gmail.com,Not captured,701937662,,Not captured,Not captured,Not captured,Not captured,Not captured,Not captured,
Not captured,Not captured,06/28/2019,Not captured,Not captured,863949,020,00072,ARS-01-0051112,Beacon International,Not captured,Not captured,Not captured,,,,Newman,Jonathan,M,05/06/1976,male,Not captured,Not captured,Not captured,Not captured,Not captured,Not captured,Not captured,Not captured,Not captured,Not captured,Not captured,Not captured,Not captured,,,Not captured,Not captured,Not captured,Not captured,846 S. Barnes Ave,,Springfield,Missouri,65802,,,Not captured,Not captured,jonathan.newman@gmail.com,Not captured,701937658,,Not captured,Not captured,Not captured,Not captured,Not captured,Not captured,
Not captured,Not captured,06/28/2019,Not captured,Not captured,863949,020,00072,ARS-01-0051108,Beacon International,Not captured,Not captured,Not captured,,,,Frolick,Samuel,,03/09/1992,male,Not captured,Not captured,Not captured,Not captured,Not captured,Not captured,Not captured,Not captured,Not captured,Not captured,Not captured,Not captured,Not captured,,,Not captured,Not captured,Not captured,Not captured,1445 S Highbush Ave,,Fayetteville,Arkansas,72701,,,Not captured,Not captured,katebenfer112@gmail.com,Not captured,701937639,,Not captured,Not captured,Not captured,Not captured,Not captured,Not captured,
Not captured,Not captured,06/28/2019,Not captured,Not captured,863949,020,00072,ARS-01-0051107,Beacon International,Not captured,Not captured,Not captured,,,,Frolick,Katherine,,10/08/1993,female,Not captured,Not captured,Not captured,Not captured,Not captured,Not captured,Not captured,Not captured,Not captured,Not captured,Not captured,Not captured,Not captured,,,Not captured,Not captured,Not captured,Not captured,1445 S Highbush Ave,,Fayetteville,Arkansas,72701,,,Not captured,Not captured,katebenfer112@gmail.com,Not captured,701937638,,Not captured,Not captured,Not captured,Not captured,Not captured,Not captured,
Not captured,Not captured,06/28/2019,Not captured,Not captured,863949,020,00072,ARS-01-0051106,Beacon International,Not captured,Not captured,Not captured,,,,Griffin,Rachel,,11/23/1981,female,Not captured,Not captured,Not captured,Not captured,Not captured,Not captured,Not captured,Not captured,Not captured,Not captured,Not captured,Not captured,Not captured,James O. Griffin Jr.,Father,Not captured,Not captured,Not captured,Not captured,5167 Poinsetta Ave,,Winter Park,Florida,32792,3216950281,,Not captured,Not captured,barb_micheals@wycliffe.org,Not captured,701937637,,Not captured,Not captured,Not captured,Not captured,Not captured,Not captured,
Not captured,Not captured,06/27/2019,Not captured,Not captured,863949,020,00072,ARS-01-0051099,Beacon International,Not captured,Not captured,Not captured,,,,Yee,Caleb,W,09/28/2002,male,Not captured,Not captured,Not captured,Not captured,Not captured,Not captured,Not captured,Not captured,Not captured,Not captured,Not captured,Not captured,Not captured,,,Not captured,Not captured,Not captured,Not captured,118 Lexington Rd,,Lincoln,Massachusetts,01773,,,Not captured,Not captured,johnyeemd@hotmail.com,Not captured,701937597,,Not captured,Not captured,Not captured,Not captured,Not captured,Not captured,
Not captured,Not captured,06/27/2019,Not captured,Not captured,863949,020,00072,ARS-04-0050950,Enhanced America,Not captured,Not captured,Not captured,Passport(15-177-0385),,,Stieduhar,Bradley,,05/29/2000,male,Not captured,Not captured,Not captured,Not captured,Not captured,Not captured,Not captured,Not captured,Not captured,Not captured,Not captured,Not captured,Not captured,,,Not captured,Not captured,Not captured,Not captured,7917 W Harvard Dr.,,Lakewood,Colorado,80227,303-905-3947,,Not captured,Not captured,bardownmom@gmail.com,Not captured,701937282,,Not captured,Not captured,Not captured,Not captured,Not captured,Not captured,
Not captured,Not captured,06/27/2019,Not captured,Not captured,863949,020,00072,ARS-01-0051095,Beacon International,Not captured,Not captured,Not captured,,,,Sanon,Evelyne,A,05/20/1966,male,Not captured,Not captured,Not captured,Not captured,Not captured,Not captured,Not captured,Not captured,Not captured,Not captured,Not captured,Not captured,Not captured,MIPAH,mipah,Not captured,Not captured,Not captured,Not captured,97 rue villate,,Petion-Ville,, HT6123,(954) 2006927,,Not captured,Not captured,agxa@live.com,Not captured,701937593,,Not captured,Not captured,Not captured,Not captured,Not captured,Not captured,
Not captured,Not captured,06/27/2019,Not captured,Not captured,863949,020,00072,ARS-01-0051094,Beacon International,Not captured,Not captured,Not captured,,,,Marcius,shammiah,,04/14/2016,female,Not captured,Not captured,Not captured,Not captured,Not captured,Not captured,Not captured,Not captured,Not captured,Not captured,Not captured,Not captured,Not captured,MIPAH,mipah,Not captured,Not captured,Not captured,Not captured,97 rue villate,,Petion-Ville,, HT6123,(954) 2006927,,Not captured,Not captured,agxa@live.com,Not captured,701937592,,Not captured,Not captured,Not captured,Not captured,Not captured,Not captured,
Not captured,Not captured,06/27/2019,Not captured,Not captured,863949,020,00072,ARS-01-0051093,Beacon International,Not captured,Not captured,Not captured,,,,Marcius,Shammuah,,02/06/2012,female,Not captured,Not captured,Not captured,Not captured,Not captured,Not captured,Not captured,Not captured,Not captured,Not captured,Not captured,Not captured,Not captured,MIPAH,mipah,Not captured,Not captured,Not captured,Not captured,97 rue villate,,Petion-Ville,, HT6123,(954) 2006927,,Not captured,Not captured,agxa@live.com,Not captured,701937591,,Not captured,Not captured,Not captured,Not captured,Not captured,Not captured,
Not captured,Not captured,06/27/2019,Not captured,Not captured,863949,020,00072,ARS-01-0051092,Beacon International,Not captured,Not captured,Not captured,,,,Demetrius,Marie,,07/22/1956,female,Not captured,Not captured,Not captured,Not captured,Not captured,Not captured,Not captured,Not captured,Not captured,Not captured,Not captured,Not captured,Not captured,MIPAH,mipah,Not captured,Not captured,Not captured,Not captured,97 rue villate,,Petion-Ville,, HT6123,(954) 2006927,,Not captured,Not captured,agxa@live.com,Not captured,701937590,,Not captured,Not captured,Not captured,Not captured,Not captured,Not captured,
Not captured,Not captured,06/27/2019,Not captured,Not captured,863949,020,00072,ARS-01-0051091,Beacon International,Not captured,Not captured,Not captured,Passport(PP4292766),,,jean,olga,,04/21/1968,female,Not captured,Not captured,Not captured,Not captured,Not captured,Not captured,Not captured,Not captured,Not captured,Not captured,Not captured,Not captured,Not captured,MIPAH,mipah,Not captured,Not captured,Not captured,Not captured,97 rue villate,,Petion-Ville,, HT6123,(954) 2006927,,Not captured,Not captured,agxa@live.com,Not captured,701937589,,Not captured,Not captured,Not captured,Not captured,Not captured,Not captured,
Not captured,Not captured,06/27/2019,Not captured,Not captured,863949,020,00072,ARS-01-0051089,Beacon International,Not captured,Not captured,Not captured,,,,MARCIUS,MARIE,A,01/12/1988,female,Not captured,Not captured,Not captured,Not captured,Not captured,Not captured,Not captured,Not captured,Not captured,Not captured,Not captured,Not captured,Not captured,mipah,mipah,Not captured,Not captured,Not captured,Not captured,97 rue villate,,pETION-VILLE,Ouest,ht6234,(954) 2006927,,Not captured,Not captured,agxa@live.com,Not captured,701937587,,Not captured,Not captured,Not captured,Not captured,Not captured,Not captured,
Not captured,Not captured,06/27/2019,Not captured,Not captured,863949,020,00072,ARS-01-0051088,Beacon International,Not captured,Not captured,Not captured,,,,NORE MANIGA,MARYVONNE,,07/02/1975,female,Not captured,Not captured,Not captured,Not captured,Not captured,Not captured,Not captured,Not captured,Not captured,Not captured,Not captured,Not captured,Not captured,mipah,mipah,Not captured,Not captured,Not captured,Not captured,97 rue villate,,pETION-VILLE,Ouest,ht6234,(954) 2006927,,Not captured,Not captured,agxa@live.com,Not captured,701937586,,Not captured,Not captured,Not captured,Not captured,Not captured,Not captured,
Not captured,Not captured,06/27/2019,Not captured,Not captured,863949,020,00072,ARS-01-0051087,Beacon International,Not captured,Not captured,Not captured,,,,LOUISCAS,SHERLENTY,,04/03/2011,female,Not captured,Not captured,Not captured,Not captured,Not captured,Not captured,Not captured,Not captured,Not captured,Not captured,Not captured,Not captured,Not captured,mipah,mipah,Not captured,Not captured,Not captured,Not captured,97 rue villate,,pETION-VILLE,Ouest,ht6234,(954) 2006927,,Not captured,Not captured,agxa@live.com,Not captured,701937585,,Not captured,Not captured,Not captured,Not captured,Not captured,Not captured,
Not captured,Not captured,06/27/2019,Not captured,Not captured,863949,020,00072,ARS-01-0051086,Beacon International,Not captured,Not captured,Not captured,,,,LOUICAS,SHERLY,,09/20/1980,female,Not captured,Not captured,Not captured,Not captured,Not captured,Not captured,Not captured,Not captured,Not captured,Not captured,Not captured,Not captured,Not captured,mipah,mipah,Not captured,Not captured,Not captured,Not captured,97 rue villate,,pETION-VILLE,Ouest,ht6234,(954) 2006927,,Not captured,Not captured,agxa@live.com,Not captured,701937584,,Not captured,Not captured,Not captured,Not captured,Not captured,Not captured,
Not captured,Not captured,06/27/2019,Not captured,Not captured,863949,020,00072,ARS-01-0051085,Beacon International,Not captured,Not captured,Not captured,,,,JOSEPH,MINONDE,,05/31/1976,female,Not captured,Not captured,Not captured,Not captured,Not captured,Not captured,Not captured,Not captured,Not captured,Not captured,Not captured,Not captured,Not captured,mipah,mipah,Not captured,Not captured,Not captured,Not captured,97 rue villate,,pETION-VILLE,Ouest,ht6234,(954) 2006927,,Not captured,Not captured,agxa@live.com,Not captured,701937583,,Not captured,Not captured,Not captured,Not captured,Not captured,Not captured,
Not captured,Not captured,06/27/2019,Not captured,Not captured,863949,020,00072,ARS-01-0051084,Beacon International,Not captured,Not captured,Not captured,,,, JOISSAINT, MILOUSE,,11/12/1972,female,Not captured,Not captured,Not captured,Not captured,Not captured,Not captured,Not captured,Not captured,Not captured,Not captured,Not captured,Not captured,Not captured,mipah,mipah,Not captured,Not captured,Not captured,Not captured,97 rue villate,,pETION-VILLE,Ouest,ht6234,(954) 2006927,,Not captured,Not captured,agxa@live.com,Not captured,701937582,,Not captured,Not captured,Not captured,Not captured,Not captured,Not captured,
Not captured,Not captured,06/27/2019,Not captured,Not captured,863949,020,00072,ARS-01-0051083,Beacon International,Not captured,Not captured,Not captured,,,, JEAN FRANCOIS, JEANITE,,02/04/1983,female,Not captured,Not captured,Not captured,Not captured,Not captured,Not captured,Not captured,Not captured,Not captured,Not captured,Not captured,Not captured,Not captured,mipah,mipah,Not captured,Not captured,Not captured,Not captured,97 rue villate,,pETION-VILLE,Ouest,ht6234,(954) 2006927,,Not captured,Not captured,agxa@live.com,Not captured,701937581,,Not captured,Not captured,Not captured,Not captured,Not captured,Not captured,
Not captured,Not captured,06/27/2019,Not captured,Not captured,863949,020,00072,ARS-01-0051082,Beacon International,Not captured,Not captured,Not captured,,,,XTRAT,JEANNINE,,05/25/1970,female,Not captured,Not captured,Not captured,Not captured,Not captured,Not captured,Not captured,Not captured,Not captured,Not captured,Not captured,Not captured,Not captured,mipah,mipah,Not captured,Not captured,Not captured,Not captured,97 rue villate,,pETION-VILLE,Ouest,ht6234,(954) 2006927,,Not captured,Not captured,agxa@live.com,Not captured,701937580,,Not captured,Not captured,Not captured,Not captured,Not captured,Not captured,
Not captured,Not captured,06/27/2019,Not captured,Not captured,863949,020,00072,ARS-01-0051081,Beacon International,Not captured,Not captured,Not captured,,,,extra,venette,a,01/21/1985,female,Not captured,Not captured,Not captured,Not captured,Not captured,Not captured,Not captured,Not captured,Not captured,Not captured,Not captured,Not captured,Not captured,mipah,mipah,Not captured,Not captured,Not captured,Not captured,97 rue villate,,pETION-VILLE,Ouest,ht6234,(954) 2006927,,Not captured,Not captured,agxa@live.com,Not captured,701937579,,Not captured,Not captured,Not captured,Not captured,Not captured,Not captured,
Not captured,Not captured,06/27/2019,Not captured,Not captured,863949,020,00072,ARS-01-0051080,Beacon International,Not captured,Not captured,Not captured,,,,Duverny,Nadega,S,12/18/1981,female,Not captured,Not captured,Not captured,Not captured,Not captured,Not captured,Not captured,Not captured,Not captured,Not captured,Not captured,Not captured,Not captured,mipah,mipah,Not captured,Not captured,Not captured,Not captured,97 rue villate,,pETION-VILLE,Ouest,ht6234,(954) 2006927,,Not captured,Not captured,agxa@live.com,Not captured,701937578,,Not captured,Not captured,Not captured,Not captured,Not captured,Not captured,
Not captured,Not captured,06/27/2019,Not captured,Not captured,863949,020,00072,ARS-01-0051079,Beacon International,Not captured,Not captured,Not captured,,,,Dorvilus,Farah,,06/25/1985,female,Not captured,Not captured,Not captured,Not captured,Not captured,Not captured,Not captured,Not captured,Not captured,Not captured,Not captured,Not captured,Not captured,mipah,mipah,Not captured,Not captured,Not captured,Not captured,97 rue villate,,pETION-VILLE,Ouest,ht6234,(954) 2006927,,Not captured,Not captured,agxa@live.com,Not captured,701937577,,Not captured,Not captured,Not captured,Not captured,Not captured,Not captured,
Not captured,Not captured,06/27/2019,Not captured,Not captured,863949,020,00072,ARS-01-0051078,Beacon International,Not captured,Not captured,Not captured,Passport(TB4446691),,,Athis,Sonette,,02/02/1982,female,Not captured,Not captured,Not captured,Not captured,Not captured,Not captured,Not captured,Not captured,Not captured,Not captured,Not captured,Not captured,Not captured,mipah,mipah,Not captured,Not captured,Not captured,Not captured,97 rue villate,,pETION-VILLE,Ouest,ht6234,(954) 2006927,,Not captured,Not captured,agxa@live.com,Not captured,701937576,,Not captured,Not captured,Not captured,Not captured,Not captured,Not captured,
Not captured,Not captured,06/27/2019,Not captured,Not captured,863949,020,00072,OVI-28-0051073,OverseasCare Visitors Insurance Plan,Not captured,Not captured,Not captured,Passport(EE5371202),,,Zhang,Hongyun,,08/19/1964,female,Not captured,Not captured,Not captured,Not captured,Not captured,Not captured,Not captured,Not captured,Not captured,Not captured,Not captured,Not captured,Not captured,Shuhua Liu,Mother,Not captured,Not captured,Not captured,Not captured,100 Grand Ln,,Foster City,California,94404,6504764999,,Not captured,Not captured,boxinjiang@gmail.com,Not captured,701937571,,Not captured,Not captured,Not captured,Not captured,Not captured,Not captured,
Not captured,Not captured,06/27/2019,Not captured,Not captured,863949,020,00072,ARS-01-0051071,Beacon International,Not captured,Not captured,Not captured,,,,Kim,Suil,,12/12/1989,male,Not captured,Not captured,Not captured,Not captured,Not captured,Not captured,Not captured,Not captured,Not captured,Not captured,Not captured,Not captured,Not captured,,,Not captured,Not captured,Not captured,Not captured,2107 Acklen Ave Apt 2,,Nashville,,37212,,,Not captured,Not captured,jeusksy@gmail.com,Not captured,701937569,,Not captured,Not captured,Not captured,Not captured,Not captured,Not captured,
Not captured,Not captured,06/27/2019,Not captured,Not captured,863949,020,00072,ARS-01-0051068,Beacon International,Not captured,Not captured,Not captured,,,,Ko,Dami,,01/20/1985,female,Not captured,Not captured,Not captured,Not captured,Not captured,Not captured,Not captured,Not captured,Not captured,Not captured,Not captured,Not captured,Not captured,,,Not captured,Not captured,Not captured,Not captured,5025 Hillsboro Pike Apt 15K,,Nashville,Tennessee,37215,,,Not captured,Not captured,albright2323@gmail.com,Not captured,701937545,,Not captured,Not captured,Not captured,Not captured,Not captured,Not captured,
Not captured,Not captured,06/27/2019,Not captured,Not captured,863949,020,00072,ARS-01-0051067,Beacon International,Not captured,Not captured,Not captured,,,,Bridges,Celia,M,06/21/1951,female,Not captured,Not captured,Not captured,Not captured,Not captured,Not captured,Not captured,Not captured,Not captured,Not captured,Not captured,Not captured,Not captured,,,Not captured,Not captured,Not captured,Not captured,2425 Manchester Rd,,Ann Arbor,Michigan,48104,,,Not captured,Not captured,celia.bridges@gmail.com,Not captured,701937544,,Not captured,Not captured,Not captured,Not captured,Not captured,Not captured,
Not captured,Not captured,06/27/2019,Not captured,Not captured,863949,020,00072,ARS-01-0051066,Beacon International,Not captured,Not captured,Not captured,,,,Ghorashy,Farzeen,,08/07/1993,male,Not captured,Not captured,Not captured,Not captured,Not captured,Not captured,Not captured,Not captured,Not captured,Not captured,Not captured,Not captured,Not captured,,,Not captured,Not captured,Not captured,Not captured,11 West 8th Street,,New York,New York,10011,,,Not captured,Not captured,farzeen.ghorashy@gmail.com,Not captured,701937543,,Not captured,Not captured,Not captured,Not captured,Not captured,Not captured,
Not captured,Not captured,06/28/2019,Not captured,Not captured,863949,020,00072,OVI-28-0051065,OverseasCare Visitors Insurance Plan,Not captured,Not captured,Not captured,,,,Garcia,Bernarda,,04/11/1949,female,Not captured,Not captured,Not captured,Not captured,Not captured,Not captured,Not captured,Not captured,Not captured,Not captured,Not captured,Not captured,Not captured,Claudia,Daugther,Not captured,Not captured,Not captured,Not captured,1303 Town Moor ct,,Spring,Texas,77379,8328759636,8328759636,Not captured,Not captured,claudia@londonos.com,Not captured,701937542,,Not captured,Not captured,Not captured,Not captured,Not captured,Not captured,
Not captured,Not captured,06/28/2019,Not captured,Not captured,863949,020,00072,ARS-01-0051063,Beacon International,Not captured,Not captured,Not captured,Passport(K0424662),,,HABTE,MICHAEL,SEMERE,05/01/1993,male,Not captured,Not captured,Not captured,Not captured,Not captured,Not captured,Not captured,Not captured,Not captured,Not captured,Not captured,Not captured,Not captured,,,Not captured,Not captured,Not captured,Not captured,denicapi12@gmail.com,,ASMARA,Central (Maekel),ASMARA,5448975846,5448965478,Not captured,Not captured,denicapi12@gmail.com,Not captured,701937540,,Not captured,Not captured,Not captured,Not captured,Not captured,Not captured,
Not captured,Not captured,06/27/2019,Not captured,Not captured,863949,020,00072,ARS-01-0051060,Beacon International,Not captured,Not captured,Not captured,,,,Morrissey,Dan,,02/06/1969,male,Not captured,Not captured,Not captured,Not captured,Not captured,Not captured,Not captured,Not captured,Not captured,Not captured,Not captured,Not captured,Not captured,,,Not captured,Not captured,Not captured,Not captured,1249 Westport Ridge,,Crystal Lake,Illinois,60014,,,Not captured,Not captured,morrissey1249@comcast.net,Not captured,701937537,,Not captured,Not captured,Not captured,Not captured,Not captured,Not captured,
Not captured,Not captured,06/27/2019,Not captured,Not captured,863949,020,00072,ARS-01-0051059,Beacon International,Not captured,Not captured,Not captured,,,,Sun,Christine,,04/25/1957,female,Not captured,Not captured,Not captured,Not captured,Not captured,Not captured,Not captured,Not captured,Not captured,Not captured,Not captured,Not captured,Not captured,,,Not captured,Not captured,Not captured,Not captured,332 Funston Ave,,San Francisco,California,94118,,,Not captured,Not captured,cbmsun@yahoo.com,Not captured,701937536,,Not captured,Not captured,Not captured,Not captured,Not captured,Not captured,