EE Transaction Type,Dependent Transaction Type,Effective Date,EE Signature,EE Signature Date,Control,Suffix,Account,Plan Number,Plan Name,Claim Office,Network ID Number,Customer Code,EE SSN,Dependent SSN,Dependent Relationship,Last Name,First Name,Middle Initial,DOB,Gender,Ethnicity,PCP/PCD,PCP/PCD Current Patient,Provider Cap Office Number,COB,Dep Student Indicator,Dep OOA Indicator,EE Prior Coverage Indicator,EE Late Entrant,EE Language Indicator,Hire Date,Earnings,Earnings Frequency,Beneficiary (Last Name First Name MI),Beneficiary Relationship,Continuation of Coverage Expiration Date,Continuation of Coverage Event Date,Continuation of Coverage Length of Coverage,Work Location Zip Code,Street Address Line 1,Street Address Line 2,City,State,Zip Code,Home Phone Number,Work Phone Number,Accept Code,Evidence Code,EE Email Address,Communication Disability Code,EE Alternate ID,Dep Alternate ID,Old Control,Old Suffix,Old Account,New Control,New Suffix,New Account,
Not captured,Not captured,06/25/2019,Not captured,Not captured,863949,020,00072,ARS-01-0051029,Beacon International,Not captured,Not captured,Not captured,,,,Langdon,Olivia,,04/30/1990,female,Not captured,Not captured,Not captured,Not captured,Not captured,Not captured,Not captured,Not captured,Not captured,Not captured,Not captured,Not captured,Not captured,,,Not captured,Not captured,Not captured,Not captured,7076 Raleigh Rd.,,Benson,North Carolina,27504,,,Not captured,Not captured,rsutkay@gmail.com,Not captured,701937505,,Not captured,Not captured,Not captured,Not captured,Not captured,Not captured,
Not captured,Not captured,06/25/2019,Not captured,Not captured,863949,020,00072,ARS-01-0051028,Beacon International,Not captured,Not captured,Not captured,,,,Sutkay,Robert,,06/26/1985,male,Not captured,Not captured,Not captured,Not captured,Not captured,Not captured,Not captured,Not captured,Not captured,Not captured,Not captured,Not captured,Not captured,,,Not captured,Not captured,Not captured,Not captured,7076 Raleigh Rd.,,Benson,North Carolina,27504,,,Not captured,Not captured,rsutkay@gmail.com,Not captured,701937504,,Not captured,Not captured,Not captured,Not captured,Not captured,Not captured,
Not captured,Not captured,06/25/2019,Not captured,Not captured,863949,020,00072,ARS-01-0051023,Beacon International,Not captured,Not captured,Not captured,,,,Kvetenadze,Tea,E,05/02/1997,female,Not captured,Not captured,Not captured,Not captured,Not captured,Not captured,Not captured,Not captured,Not captured,Not captured,Not captured,Not captured,Not captured,,,Not captured,Not captured,Not captured,Not captured,116 Pinehurst Avenue,,New York,New York,10033,,,Not captured,Not captured,teakve@gmail.com,Not captured,701937480,,Not captured,Not captured,Not captured,Not captured,Not captured,Not captured,
Not captured,Not captured,06/25/2019,Not captured,Not captured,863949,020,00072,ARS-02-0051021,Beacon America,Not captured,Not captured,Not captured,,,,FriedmanWeingarten,Rivka,,01/10/1998,female,Not captured,Not captured,Not captured,Not captured,Not captured,Not captured,Not captured,Not captured,Not captured,Not captured,Not captured,Not captured,Not captured,,,Not captured,Not captured,Not captured,Not captured,151 Bates Dr.,,Monsey,New York,10952,845-422-0040,,Not captured,Not captured,rivkeefriedman@gmail.com,Not captured,701937478,,Not captured,Not captured,Not captured,Not captured,Not captured,Not captured,
Not captured,Not captured,06/25/2019,Not captured,Not captured,863949,020,00072,ARS-02-0051020,Beacon America,Not captured,Not captured,Not captured,,,,Weingarten,Yechiel ,G,05/17/1995,male,Not captured,Not captured,Not captured,Not captured,Not captured,Not captured,Not captured,Not captured,Not captured,Not captured,Not captured,Not captured,Not captured,,,Not captured,Not captured,Not captured,Not captured,151 Bates Dr.,,Monsey,New York,10952,845-422-0040,,Not captured,Not captured,rivkeefriedman@gmail.com,Not captured,701937477,,Not captured,Not captured,Not captured,Not captured,Not captured,Not captured,
Not captured,Not captured,06/25/2019,Not captured,Not captured,863949,020,00072,ARS-01-0051019,Beacon International,Not captured,Not captured,Not captured,,,,REAM-RODRIGUEZ,ELENA,,07/14/1991,female,Not captured,Not captured,Not captured,Not captured,Not captured,Not captured,Not captured,Not captured,Not captured,Not captured,Not captured,Not captured,Not captured,,,Not captured,Not captured,Not captured,Not captured,6 CHEYENNE RD,,PEPPERELL,Massachusetts,01463,,,Not captured,Not captured,ereamrod@gmail.com,Not captured,701937476,,Not captured,Not captured,Not captured,Not captured,Not captured,Not captured,
Not captured,Not captured,06/25/2019,Not captured,Not captured,863949,020,00072,ARS-01-0051018,Beacon International,Not captured,Not captured,Not captured,,,,LUNN,RYAN,,03/03/1989,male,Not captured,Not captured,Not captured,Not captured,Not captured,Not captured,Not captured,Not captured,Not captured,Not captured,Not captured,Not captured,Not captured,,,Not captured,Not captured,Not captured,Not captured,6 CHEYENNE RD,,PEPPERELL,Massachusetts,01463,,,Not captured,Not captured,ereamrod@gmail.com,Not captured,701937475,,Not captured,Not captured,Not captured,Not captured,Not captured,Not captured,
Not captured,Not captured,06/25/2019,Not captured,Not captured,863949,020,00072,ARS-04-0050910,Enhanced America,Not captured,Not captured,Not captured,Passport(GA361722),,,Dunham,Anne,,01/20/1961,female,Not captured,Not captured,Not captured,Not captured,Not captured,Not captured,Not captured,Not captured,Not captured,Not captured,Not captured,Not captured,Not captured,,,Not captured,Not captured,Not captured,Not captured,1434 Binbrook Road,,Binbrook,Ontario,L0R 1C0,289-887-2378,,Not captured,Not captured,adunham@crandun.com,Not captured,701937161,,Not captured,Not captured,Not captured,Not captured,Not captured,Not captured,
Not captured,Not captured,06/25/2019,Not captured,Not captured,863949,020,00072,ARS-01-0051017,Beacon International,Not captured,Not captured,Not captured,,,,Ortiz-de-Horta,Ma,G,06/06/1965,female,Not captured,Not captured,Not captured,Not captured,Not captured,Not captured,Not captured,Not captured,Not captured,Not captured,Not captured,Not captured,Not captured,,,Not captured,Not captured,Not captured,Not captured,639 Kings Center AVe,,North Las Vegas,Nevada,89032-1160,,,Not captured,Not captured,lupitaortiz_mendoza@hotmail.com,Not captured,701937457,,Not captured,Not captured,Not captured,Not captured,Not captured,Not captured,
Not captured,Not captured,06/25/2019,Not captured,Not captured,863949,020,00072,ARS-01-0051014,Beacon International,Not captured,Not captured,Not captured,,,,Shanahan,Tyler,K,07/20/2000,male,Not captured,Not captured,Not captured,Not captured,Not captured,Not captured,Not captured,Not captured,Not captured,Not captured,Not captured,Not captured,Not captured,,,Not captured,Not captured,Not captured,Not captured,7835 SE 40th St,,Mercer Island,Washington,98040,,,Not captured,Not captured,john.t.shanahan@boeing.com,Not captured,701937454,,Not captured,Not captured,Not captured,Not captured,Not captured,Not captured,
Not captured,Not captured,06/25/2019,Not captured,Not captured,863949,020,00072,ARS-02-0051013,Beacon America,Not captured,Not captured,Not captured,,,,Velasquez,Claudia ,,04/01/1972,female,Not captured,Not captured,Not captured,Not captured,Not captured,Not captured,Not captured,Not captured,Not captured,Not captured,Not captured,Not captured,Not captured,CLAUDIA VELASQUEZ,ESPOSA,Not captured,Not captured,Not captured,Not captured,CARRETERA NACIONAL VIA LA TOSCANA URB. SAN MIGUEL PARCELA 256,,Maturin,Monagas,6201,+584143827210,,Not captured,Not captured,csvc04@gmail.com,Not captured,701937453,,Not captured,Not captured,Not captured,Not captured,Not captured,Not captured,
Not captured,Not captured,06/25/2019,Not captured,Not captured,863949,020,00072,ARS-02-0051012,Beacon America,Not captured,Not captured,Not captured,Passport(9902803),,,Tepedino,Carlos,,07/24/1969,male,Not captured,Not captured,Not captured,Not captured,Not captured,Not captured,Not captured,Not captured,Not captured,Not captured,Not captured,Not captured,Not captured,CLAUDIA VELASQUEZ,ESPOSA,Not captured,Not captured,Not captured,Not captured,CARRETERA NACIONAL VIA LA TOSCANA URB. SAN MIGUEL PARCELA 256,,Maturin,Monagas,6201,+584143827210,,Not captured,Not captured,csvc04@gmail.com,Not captured,701937452,,Not captured,Not captured,Not captured,Not captured,Not captured,Not captured,
Not captured,Not captured,06/24/2019,Not captured,Not captured,863949,020,00072,ARS-01-0051005,Beacon International,Not captured,Not captured,Not captured,,,,Chrapusta,Jakub,M,08/29/2000,male,Not captured,Not captured,Not captured,Not captured,Not captured,Not captured,Not captured,Not captured,Not captured,Not captured,Not captured,Not captured,Not captured,,,Not captured,Not captured,Not captured,Not captured,947 Cumberland Ct AA2,,Roselle,Illinois,60172,,,Not captured,Not captured,jchrapusta82@gmail.com,Not captured,701937445,,Not captured,Not captured,Not captured,Not captured,Not captured,Not captured,
Not captured,Not captured,06/24/2019,Not captured,Not captured,863949,020,00072,ARS-01-0051004,Beacon International,Not captured,Not captured,Not captured,,,,Chrapusta,Jan,J,10/11/1998,male,Not captured,Not captured,Not captured,Not captured,Not captured,Not captured,Not captured,Not captured,Not captured,Not captured,Not captured,Not captured,Not captured,,,Not captured,Not captured,Not captured,Not captured,947 Cumberland Ct AA2,,Roselle,Illinois,60172,,,Not captured,Not captured,jchrapusta82@gmail.com,Not captured,701937444,,Not captured,Not captured,Not captured,Not captured,Not captured,Not captured,
Not captured,Not captured,06/25/2019,Not captured,Not captured,863949,020,00072,ARS-02-0051000,Beacon America,Not captured,Not captured,Not captured,,,,horowitz,Meir,,08/05/2016,male,Not captured,Not captured,Not captured,Not captured,Not captured,Not captured,Not captured,Not captured,Not captured,Not captured,Not captured,Not captured,Not captured,,,Not captured,Not captured,Not captured,Not captured,406,,Lakewood,New Jersey,08701,416-782-4511,,Not captured,Not captured,nisihorowitz@gmail.com,Not captured,701937403,,Not captured,Not captured,Not captured,Not captured,Not captured,Not captured,
Not captured,Not captured,06/25/2019,Not captured,Not captured,863949,020,00072,ARS-02-0050999,Beacon America,Not captured,Not captured,Not captured,,,,horowitz,Binyomin,,04/20/2018,male,Not captured,Not captured,Not captured,Not captured,Not captured,Not captured,Not captured,Not captured,Not captured,Not captured,Not captured,Not captured,Not captured,,,Not captured,Not captured,Not captured,Not captured,406,,Lakewood,New Jersey,08701,416-782-4511,,Not captured,Not captured,nisihorowitz@gmail.com,Not captured,701937402,,Not captured,Not captured,Not captured,Not captured,Not captured,Not captured,
Not captured,Not captured,06/25/2019,Not captured,Not captured,863949,020,00072,ARS-01-0050995,Beacon International,Not captured,Not captured,Not captured,,,,Miller,Gibson,,11/03/2008,male,Not captured,Not captured,Not captured,Not captured,Not captured,Not captured,Not captured,Not captured,Not captured,Not captured,Not captured,Not captured,Not captured,,,Not captured,Not captured,Not captured,Not captured,11718 RobinLynn Ln,,Louisville,Kentucky,40243,502-664-5793,,Not captured,Not captured,rmiller.us@gmail.com,Not captured,701937398,,Not captured,Not captured,Not captured,Not captured,Not captured,Not captured,
Not captured,Not captured,06/25/2019,Not captured,Not captured,863949,020,00072,ARS-01-0050994,Beacon International,Not captured,Not captured,Not captured,,,,Miller,Ryan,,01/04/1977,male,Not captured,Not captured,Not captured,Not captured,Not captured,Not captured,Not captured,Not captured,Not captured,Not captured,Not captured,Not captured,Not captured,,,Not captured,Not captured,Not captured,Not captured,11718 RobinLynn Ln,,Louisville,Kentucky,40243,502-664-5793,,Not captured,Not captured,rmiller.us@gmail.com,Not captured,701937397,,Not captured,Not captured,Not captured,Not captured,Not captured,Not captured,
Not captured,Not captured,06/24/2019,Not captured,Not captured,863949,020,00072,ARS-02-0050991,Beacon America,Not captured,Not captured,Not captured,,,,Fletcher,Lillie,,12/04/1943,female,Not captured,Not captured,Not captured,Not captured,Not captured,Not captured,Not captured,Not captured,Not captured,Not captured,Not captured,Not captured,Not captured,,,Not captured,Not captured,Not captured,Not captured,7300,,Paradise Valley,Arizona,85253,,,Not captured,Not captured,lsuefletcher@gmail.com,Not captured,701937393,,Not captured,Not captured,Not captured,Not captured,Not captured,Not captured,
Not captured,Not captured,06/24/2019,Not captured,Not captured,863949,020,00072,ARS-02-0050990,Beacon America,Not captured,Not captured,Not captured,,,,koh,hayden,j,06/09/2016,male,Not captured,Not captured,Not captured,Not captured,Not captured,Not captured,Not captured,Not captured,Not captured,Not captured,Not captured,Not captured,Not captured,,,Not captured,Not captured,Not captured,Not captured,72 E EDSALL BLVD,,PALISADES PARK,New Jersey,07650,,,Not captured,Not captured,wsop3419@hotmail.com,Not captured,701937370,,Not captured,Not captured,Not captured,Not captured,Not captured,Not captured,
Not captured,Not captured,06/24/2019,Not captured,Not captured,863949,020,00072,ARS-02-0050989,Beacon America,Not captured,Not captured,Not captured,,,,kang,emma,a,02/20/1985,female,Not captured,Not captured,Not captured,Not captured,Not captured,Not captured,Not captured,Not captured,Not captured,Not captured,Not captured,Not captured,Not captured,,,Not captured,Not captured,Not captured,Not captured,72 E EDSALL BLVD,,PALISADES PARK,New Jersey,07650,,,Not captured,Not captured,wsop3419@hotmail.com,Not captured,701937369,,Not captured,Not captured,Not captured,Not captured,Not captured,Not captured,
Not captured,Not captured,06/24/2019,Not captured,Not captured,863949,020,00072,ARS-01-0050987,Beacon International,Not captured,Not captured,Not captured,Passport(P123),,,Robinson ,carlos,,12/27/1972,male,Not captured,Not captured,Not captured,Not captured,Not captured,Not captured,Not captured,Not captured,Not captured,Not captured,Not captured,Not captured,Not captured,carlos,carlos,Not captured,Not captured,Not captured,Not captured,5218 S east street,,Indianapolis,Indiana,46203,3176446291,,Not captured,Not captured,Carlos@azimuthrisk.com,Not captured,701937367,,Not captured,Not captured,Not captured,Not captured,Not captured,Not captured,
Not captured,Not captured,06/24/2019,Not captured,Not captured,863949,020,00072,ARS-02-0050985,Beacon America,Not captured,Not captured,Not captured,Passport(GA359640),,,Mahdavinia,Mehdi ,,12/11/1942,male,Not captured,Not captured,Not captured,Not captured,Not captured,Not captured,Not captured,Not captured,Not captured,Not captured,Not captured,Not captured,Not captured,,,Not captured,Not captured,Not captured,Not captured,802 S. Maria Ct.,,Bloomington,Indiana,47401,8123552595,,Not captured,Not captured,mmahdavinia@alumni.utaranto.ca,Not captured,701937365,,Not captured,Not captured,Not captured,Not captured,Not captured,Not captured,
Not captured,Not captured,06/25/2019,Not captured,Not captured,863949,020,00072,ARS-01-0050984,Beacon International,Not captured,Not captured,Not captured,,,,Robinson ,Carlos,,12/27/1972,male,Not captured,Not captured,Not captured,Not captured,Not captured,Not captured,Not captured,Not captured,Not captured,Not captured,Not captured,Not captured,Not captured,,,Not captured,Not captured,Not captured,Not captured,5218 S East street,,Indianapolis,Indiana,46227,3176446291,,Not captured,Not captured,Carlos@azimuthrisk.com,Not captured,701937364,,Not captured,Not captured,Not captured,Not captured,Not captured,Not captured,
Not captured,Not captured,06/24/2019,Not captured,Not captured,863949,020,00072,ARS-01-0050974,Beacon International,Not captured,Not captured,Not captured,,,,Kurtz,Carrie,,11/10/1979,female,Not captured,Not captured,Not captured,Not captured,Not captured,Not captured,Not captured,Not captured,Not captured,Not captured,Not captured,Not captured,Not captured,Noah Kurtz,Son,Not captured,Not captured,Not captured,Not captured,2510 W Wood St,,Paris,Tennessee,38242,7314077706,,Not captured,Not captured,ParisFirstUPC@icloud.com,Not captured,701937354,,Not captured,Not captured,Not captured,Not captured,Not captured,Not captured,
Not captured,Not captured,06/24/2019,Not captured,Not captured,863949,020,00072,ARS-01-0050973,Beacon International,Not captured,Not captured,Not captured,,,,Kurtz,Mark,,03/27/1979,male,Not captured,Not captured,Not captured,Not captured,Not captured,Not captured,Not captured,Not captured,Not captured,Not captured,Not captured,Not captured,Not captured,Noah Kurtz,Son,Not captured,Not captured,Not captured,Not captured,2510 W Wood St,,Paris,Tennessee,38242,7314077706,,Not captured,Not captured,ParisFirstUPC@icloud.com,Not captured,701937353,,Not captured,Not captured,Not captured,Not captured,Not captured,Not captured,
Not captured,Not captured,06/24/2019,Not captured,Not captured,863949,020,00072,ARS-01-0050942,Beacon International,Not captured,Not captured,Not captured,,,,Geldzahler,David,,11/03/1986,male,Not captured,Not captured,Not captured,Not captured,Not captured,Not captured,Not captured,Not captured,Not captured,Not captured,Not captured,Not captured,Not captured,,,Not captured,Not captured,Not captured,Not captured,1420 56th Street,,Brooklyn,New York,11219,,,Not captured,Not captured,davgeld@gmail.com,Not captured,701937223,,Not captured,Not captured,Not captured,Not captured,Not captured,Not captured,
Not captured,Not captured,06/24/2019,Not captured,Not captured,863949,020,00072,ARS-01-0050921,Beacon International,Not captured,Not captured,Not captured,,,,Geldzahler,Yisroel,M,06/05/1989,male,Not captured,Not captured,Not captured,Not captured,Not captured,Not captured,Not captured,Not captured,Not captured,Not captured,Not captured,Not captured,Not captured,,,Not captured,Not captured,Not captured,Not captured,207 First Street,,Lakewood,New Jersey,08701,,,Not captured,Not captured,yisgeld@gmail.com,Not captured,701937174,,Not captured,Not captured,Not captured,Not captured,Not captured,Not captured,
Not captured,Not captured,06/24/2019,Not captured,Not captured,863949,020,00072,ARS-02-0050740,Beacon America,Not captured,Not captured,Not captured,,,,Rangel Beltran,Maria Salome,,05/31/2014,female,Not captured,Not captured,Not captured,Not captured,Not captured,Not captured,Not captured,Not captured,Not captured,Not captured,Not captured,Not captured,Not captured,estate,na,Not captured,Not captured,Not captured,Not captured,National Center for State Courts,,Bogota,Distrito Capltal de Santa Fe de Bogot&atilde;,na,5714898640 114,,Not captured,Not captured,yrodriguez@ncsc.co,Not captured,701936695,,Not captured,Not captured,Not captured,Not captured,Not captured,Not captured,
Not captured,Not captured,06/24/2019,Not captured,Not captured,863949,020,00072,ARS-02-0050739,Beacon America,Not captured,Not captured,Not captured,Passport(na),,,Beltran Tellez,Ibette Ximena,,01/23/1992,female,Not captured,Not captured,Not captured,Not captured,Not captured,Not captured,Not captured,Not captured,Not captured,Not captured,Not captured,Not captured,Not captured,estate,na,Not captured,Not captured,Not captured,Not captured,National Center for State Courts,,Bogota,Distrito Capltal de Santa Fe de Bogot&atilde;,na,5714898640 114,,Not captured,Not captured,yrodriguez@ncsc.co,Not captured,701936694,,Not captured,Not captured,Not captured,Not captured,Not captured,Not captured,
Not captured,Not captured,06/24/2019,Not captured,Not captured,863949,020,00072,ARS-02-0050738,Beacon America,Not captured,Not captured,Not captured,Passport(na),,,Rangel Torres,Jeifrison Johan,,10/11/1984,male,Not captured,Not captured,Not captured,Not captured,Not captured,Not captured,Not captured,Not captured,Not captured,Not captured,Not captured,Not captured,Not captured,estate,na,Not captured,Not captured,Not captured,Not captured,National Center for State Courts,,Bogota,Distrito Capltal de Santa Fe de Bogot&atilde;,na,5714898640 114,,Not captured,Not captured,yrodriguez@ncsc.co,Not captured,701936693,,Not captured,Not captured,Not captured,Not captured,Not captured,Not captured,
Not captured,Not captured,06/24/2019,Not captured,Not captured,863949,020,00072,ARS-02-0050737,Beacon America,Not captured,Not captured,Not captured,,,,Moreno Bazante,Juliana Valeria,,03/13/2008,female,Not captured,Not captured,Not captured,Not captured,Not captured,Not captured,Not captured,Not captured,Not captured,Not captured,Not captured,Not captured,Not captured,estate,na,Not captured,Not captured,Not captured,Not captured,National Center for State Courts,,Bogota,Distrito Capltal de Santa Fe de Bogot&atilde;,na,5714898640 114,,Not captured,Not captured,yrodriguez@ncsc.co,Not captured,701936692,,Not captured,Not captured,Not captured,Not captured,Not captured,Not captured,
Not captured,Not captured,06/24/2019,Not captured,Not captured,863949,020,00072,ARS-02-0050736,Beacon America,Not captured,Not captured,Not captured,,,,Moreno Bazante,Jacobo,,03/10/2018,male,Not captured,Not captured,Not captured,Not captured,Not captured,Not captured,Not captured,Not captured,Not captured,Not captured,Not captured,Not captured,Not captured,estate,na,Not captured,Not captured,Not captured,Not captured,National Center for State Courts,,Bogota,Distrito Capltal de Santa Fe de Bogot&atilde;,na,5714898640 114,,Not captured,Not captured,yrodriguez@ncsc.co,Not captured,701936691,,Not captured,Not captured,Not captured,Not captured,Not captured,Not captured,
Not captured,Not captured,06/24/2019,Not captured,Not captured,863949,020,00072,ARS-02-0050735,Beacon America,Not captured,Not captured,Not captured,Passport(na),,,Bazante Silva,Ana Fernanda,,11/25/1985,female,Not captured,Not captured,Not captured,Not captured,Not captured,Not captured,Not captured,Not captured,Not captured,Not captured,Not captured,Not captured,Not captured,estate,na,Not captured,Not captured,Not captured,Not captured,National Center for State Courts,,Bogota,Distrito Capltal de Santa Fe de Bogot&atilde;,na,5714898640 114,,Not captured,Not captured,yrodriguez@ncsc.co,Not captured,701936690,,Not captured,Not captured,Not captured,Not captured,Not captured,Not captured,
Not captured,Not captured,06/24/2019,Not captured,Not captured,863949,020,00072,ARS-02-0050731,Beacon America,Not captured,Not captured,Not captured,Passport(na),,,Moreno Pulido,Cristian Camilo,,05/31/1984,male,Not captured,Not captured,Not captured,Not captured,Not captured,Not captured,Not captured,Not captured,Not captured,Not captured,Not captured,Not captured,Not captured,estate,na,Not captured,Not captured,Not captured,Not captured,National Center for State Courts,,Bogota,Distrito Capltal de Santa Fe de Bogot&atilde;,na,5714898640 114,,Not captured,Not captured,yrodriguez@ncsc.co,Not captured,701936686,,Not captured,Not captured,Not captured,Not captured,Not captured,Not captured,
Not captured,Not captured,06/25/2019,Not captured,Not captured,863949,020,00072,ARS-01-0050558,Beacon International,Not captured,Not captured,Not captured,,,,Halverson,Janet,,11/22/1964,female,Not captured,Not captured,Not captured,Not captured,Not captured,Not captured,Not captured,Not captured,Not captured,Not captured,Not captured,Not captured,Not captured,Claudia Halverson,sister,Not captured,Not captured,Not captured,Not captured,533 Pinebrook Dr.,,Bolingbrook,Illinois,60490,6308427343,,Not captured,Not captured,janhal3710@gmail.com,Not captured,701936271,,Not captured,Not captured,Not captured,Not captured,Not captured,Not captured,