EE Transaction Type,Dependent Transaction Type,Effective Date,EE Signature,EE Signature Date,Control,Suffix,Account,Plan Number,Plan Name,Claim Office,Network ID Number,Customer Code,EE SSN,Dependent SSN,Dependent Relationship,Last Name,First Name,Middle Initial,DOB,Gender,Ethnicity,PCP/PCD,PCP/PCD Current Patient,Provider Cap Office Number,COB,Dep Student Indicator,Dep OOA Indicator,EE Prior Coverage Indicator,EE Late Entrant,EE Language Indicator,Hire Date,Earnings,Earnings Frequency,Beneficiary (Last Name First Name MI),Beneficiary Relationship,Continuation of Coverage Expiration Date,Continuation of Coverage Event Date,Continuation of Coverage Length of Coverage,Work Location Zip Code,Street Address Line 1,Street Address Line 2,City,State,Zip Code,Home Phone Number,Work Phone Number,Accept Code,Evidence Code,EE Email Address,Communication Disability Code,EE Alternate ID,Dep Alternate ID,Old Control,Old Suffix,Old Account,New Control,New Suffix,New Account,
Not captured,Not captured,06/24/2019,Not captured,Not captured,863949,020,00072,ARS-01-0051005,Beacon International,Not captured,Not captured,Not captured,,,,Chrapusta,Jakub,M,08/29/2000,male,Not captured,Not captured,Not captured,Not captured,Not captured,Not captured,Not captured,Not captured,Not captured,Not captured,Not captured,Not captured,Not captured,,,Not captured,Not captured,Not captured,Not captured,947 Cumberland Ct AA2,,Roselle,Illinois,60172,,,Not captured,Not captured,jchrapusta82@gmail.com,Not captured,701937445,,Not captured,Not captured,Not captured,Not captured,Not captured,Not captured,
Not captured,Not captured,06/24/2019,Not captured,Not captured,863949,020,00072,ARS-01-0051004,Beacon International,Not captured,Not captured,Not captured,,,,Chrapusta,Jan,J,10/11/1998,male,Not captured,Not captured,Not captured,Not captured,Not captured,Not captured,Not captured,Not captured,Not captured,Not captured,Not captured,Not captured,Not captured,,,Not captured,Not captured,Not captured,Not captured,947 Cumberland Ct AA2,,Roselle,Illinois,60172,,,Not captured,Not captured,jchrapusta82@gmail.com,Not captured,701937444,,Not captured,Not captured,Not captured,Not captured,Not captured,Not captured,
Not captured,Not captured,06/24/2019,Not captured,Not captured,863949,020,00072,ARS-02-0050991,Beacon America,Not captured,Not captured,Not captured,,,,Fletcher,Lillie,,12/04/1943,female,Not captured,Not captured,Not captured,Not captured,Not captured,Not captured,Not captured,Not captured,Not captured,Not captured,Not captured,Not captured,Not captured,,,Not captured,Not captured,Not captured,Not captured,7300,,Paradise Valley,Arizona,85253,,,Not captured,Not captured,lsuefletcher@gmail.com,Not captured,701937393,,Not captured,Not captured,Not captured,Not captured,Not captured,Not captured,
Not captured,Not captured,06/24/2019,Not captured,Not captured,863949,020,00072,ARS-02-0050990,Beacon America,Not captured,Not captured,Not captured,,,,koh,hayden,j,06/09/2016,male,Not captured,Not captured,Not captured,Not captured,Not captured,Not captured,Not captured,Not captured,Not captured,Not captured,Not captured,Not captured,Not captured,,,Not captured,Not captured,Not captured,Not captured,72 E EDSALL BLVD,,PALISADES PARK,New Jersey,07650,,,Not captured,Not captured,wsop3419@hotmail.com,Not captured,701937370,,Not captured,Not captured,Not captured,Not captured,Not captured,Not captured,
Not captured,Not captured,06/24/2019,Not captured,Not captured,863949,020,00072,ARS-02-0050989,Beacon America,Not captured,Not captured,Not captured,,,,kang,emma,a,02/20/1985,female,Not captured,Not captured,Not captured,Not captured,Not captured,Not captured,Not captured,Not captured,Not captured,Not captured,Not captured,Not captured,Not captured,,,Not captured,Not captured,Not captured,Not captured,72 E EDSALL BLVD,,PALISADES PARK,New Jersey,07650,,,Not captured,Not captured,wsop3419@hotmail.com,Not captured,701937369,,Not captured,Not captured,Not captured,Not captured,Not captured,Not captured,
Not captured,Not captured,06/24/2019,Not captured,Not captured,863949,020,00072,ARS-01-0050987,Beacon International,Not captured,Not captured,Not captured,Passport(P123),,,Robinson ,carlos,,12/27/1972,male,Not captured,Not captured,Not captured,Not captured,Not captured,Not captured,Not captured,Not captured,Not captured,Not captured,Not captured,Not captured,Not captured,carlos,carlos,Not captured,Not captured,Not captured,Not captured,5218 S east street,,Indianapolis,Indiana,46203,3176446291,,Not captured,Not captured,Carlos@azimuthrisk.com,Not captured,701937367,,Not captured,Not captured,Not captured,Not captured,Not captured,Not captured,
Not captured,Not captured,06/20/2019,Not captured,Not captured,863949,020,00072,ARS-02-0050986,Beacon America,Not captured,Not captured,Not captured,Passport(n/a),,,Mahdavi,Sedigheh,,03/22/1957,female,Not captured,Not captured,Not captured,Not captured,Not captured,Not captured,Not captured,Not captured,Not captured,Not captured,Not captured,Not captured,Not captured,,,Not captured,Not captured,Not captured,Not captured,802 S. Maria Ct.,,Bloomington,Indiana,47401 ,8123552595,,Not captured,Not captured,mmahdavinia@alumni.utaranto.ca,Not captured,701937366,,Not captured,Not captured,Not captured,Not captured,Not captured,Not captured,
Not captured,Not captured,06/24/2019,Not captured,Not captured,863949,020,00072,ARS-02-0050985,Beacon America,Not captured,Not captured,Not captured,Passport(GA359640),,,Mahdavinia,Mehdi ,,12/11/1942,male,Not captured,Not captured,Not captured,Not captured,Not captured,Not captured,Not captured,Not captured,Not captured,Not captured,Not captured,Not captured,Not captured,,,Not captured,Not captured,Not captured,Not captured,802 S. Maria Ct.,,Bloomington,Indiana,47401,8123552595,,Not captured,Not captured,mmahdavinia@alumni.utaranto.ca,Not captured,701937365,,Not captured,Not captured,Not captured,Not captured,Not captured,Not captured,
Not captured,Not captured,06/21/2019,Not captured,Not captured,863949,020,00072,ARS-01-0050983,Beacon International,Not captured,Not captured,Not captured,,,,Willemsens Kastrup,Joaquim,F,09/21/2004,male,Not captured,Not captured,Not captured,Not captured,Not captured,Not captured,Not captured,Not captured,Not captured,Not captured,Not captured,Not captured,Not captured,,,Not captured,Not captured,Not captured,Not captured,13620 Batten Rd Ne,,Duvall,Washington,98019,,,Not captured,Not captured,ana.c.marroquim@gmail.com,Not captured,701937363,,Not captured,Not captured,Not captured,Not captured,Not captured,Not captured,
Not captured,Not captured,06/21/2019,Not captured,Not captured,863949,020,00072,ARS-01-0050982,Beacon International,Not captured,Not captured,Not captured,,,,Sadowski,Bradley,G,01/19/1985,male,Not captured,Not captured,Not captured,Not captured,Not captured,Not captured,Not captured,Not captured,Not captured,Not captured,Not captured,Not captured,Not captured,,,Not captured,Not captured,Not captured,Not captured,465 N Green Street,,Chicago,Illinois,60642,,,Not captured,Not captured,bradleysadowski@gmail.com,Not captured,701937362,,Not captured,Not captured,Not captured,Not captured,Not captured,Not captured,
Not captured,Not captured,06/21/2019,Not captured,Not captured,863949,020,00072,ARS-03-0050917,Essential America,Not captured,Not captured,Not captured,Passport(n/a),,,Insuasti,Christy,,05/24/2019,female,Not captured,Not captured,Not captured,Not captured,Not captured,Not captured,Not captured,Not captured,Not captured,Not captured,Not captured,Not captured,Not captured,,,Not captured,Not captured,Not captured,Not captured,11374 Arrowhead Drive,,South Lyon,Michigan,48178,248-207-7120,,Not captured,Not captured,service@azimuthrisk.com,Not captured,701937170,,Not captured,Not captured,Not captured,Not captured,Not captured,Not captured,
Not captured,Not captured,06/24/2019,Not captured,Not captured,863949,020,00072,ARS-01-0050974,Beacon International,Not captured,Not captured,Not captured,,,,Kurtz,Carrie,,11/10/1979,female,Not captured,Not captured,Not captured,Not captured,Not captured,Not captured,Not captured,Not captured,Not captured,Not captured,Not captured,Not captured,Not captured,Noah Kurtz,Son,Not captured,Not captured,Not captured,Not captured,2510 W Wood St,,Paris,Tennessee,38242,7314077706,,Not captured,Not captured,ParisFirstUPC@icloud.com,Not captured,701937354,,Not captured,Not captured,Not captured,Not captured,Not captured,Not captured,
Not captured,Not captured,06/24/2019,Not captured,Not captured,863949,020,00072,ARS-01-0050973,Beacon International,Not captured,Not captured,Not captured,,,,Kurtz,Mark,,03/27/1979,male,Not captured,Not captured,Not captured,Not captured,Not captured,Not captured,Not captured,Not captured,Not captured,Not captured,Not captured,Not captured,Not captured,Noah Kurtz,Son,Not captured,Not captured,Not captured,Not captured,2510 W Wood St,,Paris,Tennessee,38242,7314077706,,Not captured,Not captured,ParisFirstUPC@icloud.com,Not captured,701937353,,Not captured,Not captured,Not captured,Not captured,Not captured,Not captured,
Not captured,Not captured,06/22/2019,Not captured,Not captured,863949,020,00072,ARS-02-0050972,Beacon America,Not captured,Not captured,Not captured,,,,Allen,Gregory,j,03/19/1998,male,Not captured,Not captured,Not captured,Not captured,Not captured,Not captured,Not captured,Not captured,Not captured,Not captured,Not captured,Not captured,Not captured,,,Not captured,Not captured,Not captured,Not captured,1130 Graystone Crossing,,Alpharetta,Georgia,30005,6786877173,6786877173,Not captured,Not captured,gnetallen@gmail.com,Not captured,701937342,,Not captured,Not captured,Not captured,Not captured,Not captured,Not captured,
Not captured,Not captured,06/22/2019,Not captured,Not captured,863949,020,00072,ARS-02-0050971,Beacon America,Not captured,Not captured,Not captured,Passport(546263572),,,Allen,Nigel,D,02/24/1960,male,Not captured,Not captured,Not captured,Not captured,Not captured,Not captured,Not captured,Not captured,Not captured,Not captured,Not captured,Not captured,Not captured,,,Not captured,Not captured,Not captured,Not captured,1130 Graystone Crossing,,Alpharetta,Georgia,30005,6786877173,6786877173,Not captured,Not captured,gnetallen@gmail.com,Not captured,701937341,,Not captured,Not captured,Not captured,Not captured,Not captured,Not captured,
Not captured,Not captured,06/21/2019,Not captured,Not captured,863949,020,00072,ARS-01-0050959,Beacon International,Not captured,Not captured,Not captured,,,,Wirkus,James,,11/10/1959,male,Not captured,Not captured,Not captured,Not captured,Not captured,Not captured,Not captured,Not captured,Not captured,Not captured,Not captured,Not captured,Not captured,,,Not captured,Not captured,Not captured,Not captured,110 Aspen Lane,,Park City,Utah,84098,,,Not captured,Not captured,james.wirkus@comcast.net,Not captured,701937314,,Not captured,Not captured,Not captured,Not captured,Not captured,Not captured,
Not captured,Not captured,06/21/2019,Not captured,Not captured,863949,020,00072,ARS-01-0050958,Beacon International,Not captured,Not captured,Not captured,,,,Marcarelli,Dolly,K,11/08/1968,female,Not captured,Not captured,Not captured,Not captured,Not captured,Not captured,Not captured,Not captured,Not captured,Not captured,Not captured,Not captured,Not captured,,,Not captured,Not captured,Not captured,Not captured,1420 Stratton Avenue,,Nashville,Tennessee,37206,,,Not captured,Not captured,dkmarcarelli@gmail.com,Not captured,701937313,,Not captured,Not captured,Not captured,Not captured,Not captured,Not captured,
Not captured,Not captured,06/21/2019,Not captured,Not captured,863949,020,00072,ARS-01-0050957,Beacon International,Not captured,Not captured,Not captured,,,,Marcarelli,John,C,03/04/1968,male,Not captured,Not captured,Not captured,Not captured,Not captured,Not captured,Not captured,Not captured,Not captured,Not captured,Not captured,Not captured,Not captured,,,Not captured,Not captured,Not captured,Not captured,1420 Stratton Avenue,,Nashville,Tennessee,37206,,,Not captured,Not captured,dkmarcarelli@gmail.com,Not captured,701937312,,Not captured,Not captured,Not captured,Not captured,Not captured,Not captured,
Not captured,Not captured,06/21/2019,Not captured,Not captured,863949,020,00072,ARS-02-0050956,Beacon America,Not captured,Not captured,Not captured,,,,Toettcher,Jeremy,,02/11/1980,male,Not captured,Not captured,Not captured,Not captured,Not captured,Not captured,Not captured,Not captured,Not captured,Not captured,Not captured,Not captured,Not captured,,,Not captured,Not captured,Not captured,Not captured,276 5th Ave,,San Francisco,,94118,,,Not captured,Not captured,Jtoettcher@intrepid-spirits.com,Not captured,701937311,,Not captured,Not captured,Not captured,Not captured,Not captured,Not captured,
Not captured,Not captured,06/21/2019,Not captured,Not captured,863949,020,00072,ARS-01-0050955,Beacon International,Not captured,Not captured,Not captured,,,,Schaffer,Eric,s,04/23/1987,male,Not captured,Not captured,Not captured,Not captured,Not captured,Not captured,Not captured,Not captured,Not captured,Not captured,Not captured,Not captured,Not captured,,,Not captured,Not captured,Not captured,Not captured,8046 N 2nd Drive,,Phoenix,New York,85021,,,Not captured,Not captured,eschaff23@gmail.com,Not captured,701937310,,Not captured,Not captured,Not captured,Not captured,Not captured,Not captured,
Not captured,Not captured,06/21/2019,Not captured,Not captured,863949,020,00072,ARS-01-0050954,Beacon International,Not captured,Not captured,Not captured,,,,Poon,Shou Yi,,11/30/1984,male,Not captured,Not captured,Not captured,Not captured,Not captured,Not captured,Not captured,Not captured,Not captured,Not captured,Not captured,Not captured,Not captured,,,Not captured,Not captured,Not captured,Not captured,16901 NE 99th Ct,,Redmond,Washington,98052,,,Not captured,Not captured,poonshouyi@gmail.com,Not captured,701937309,,Not captured,Not captured,Not captured,Not captured,Not captured,Not captured,
Not captured,Not captured,06/21/2019,Not captured,Not captured,863949,020,00072,ARS-02-0050953,Beacon America,Not captured,Not captured,Not captured,,,,Alharbi,Norah,,03/29/1964,female,Not captured,Not captured,Not captured,Not captured,Not captured,Not captured,Not captured,Not captured,Not captured,Not captured,Not captured,Not captured,Not captured,,,Not captured,Not captured,Not captured,Not captured,4000 presidential blvd,,Philadelphia,,19131,,,Not captured,Not captured,ifnona@hotmail.com,Not captured,701937308,,Not captured,Not captured,Not captured,Not captured,Not captured,Not captured,
Not captured,Not captured,06/21/2019,Not captured,Not captured,863949,020,00072,ARS-01-0050952,Beacon International,Not captured,Not captured,Not captured,,,,Katz,Harley,,10/02/1990,male,Not captured,Not captured,Not captured,Not captured,Not captured,Not captured,Not captured,Not captured,Not captured,Not captured,Not captured,Not captured,Not captured,,,Not captured,Not captured,Not captured,Not captured,274 Collingwood Street,,San Francisco,California,94114,,,Not captured,Not captured,harley@probablygenetic.com,Not captured,701937307,,Not captured,Not captured,Not captured,Not captured,Not captured,Not captured,
Not captured,Not captured,06/23/2019,Not captured,Not captured,863949,020,00072,OVI-28-0050946,OverseasCare Visitors Insurance Plan,Not captured,Not captured,Not captured,Passport(p2980459),,,Nayyar,Masha,,10/04/2011,male,Not captured,Not captured,Not captured,Not captured,Not captured,Not captured,Not captured,Not captured,Not captured,Not captured,Not captured,Not captured,Not captured,Meena Nayyar,Mother,Not captured,Not captured,Not captured,Not captured,A 301 Hindon Apartments,,New Delhi,Delhi,110096,8447494665,,Not captured,Not captured,karan.nayyar.my@gmail.com,Not captured,701937232,,Not captured,Not captured,Not captured,Not captured,Not captured,Not captured,
Not captured,Not captured,06/23/2019,Not captured,Not captured,863949,020,00072,OVI-28-0050945,OverseasCare Visitors Insurance Plan,Not captured,Not captured,Not captured,Passport(p2980459),,,Nayyar,Mannansh,,09/19/2006,male,Not captured,Not captured,Not captured,Not captured,Not captured,Not captured,Not captured,Not captured,Not captured,Not captured,Not captured,Not captured,Not captured,Meena Nayyar,Mother,Not captured,Not captured,Not captured,Not captured,A 301 Hindon Apartments,,New Delhi,Delhi,110096,8447494665,,Not captured,Not captured,karan.nayyar.my@gmail.com,Not captured,701937231,,Not captured,Not captured,Not captured,Not captured,Not captured,Not captured,
Not captured,Not captured,06/23/2019,Not captured,Not captured,863949,020,00072,OVI-28-0050944,OverseasCare Visitors Insurance Plan,Not captured,Not captured,Not captured,Passport(p2980459),,,Nayyar,Harneet,,06/16/1980,female,Not captured,Not captured,Not captured,Not captured,Not captured,Not captured,Not captured,Not captured,Not captured,Not captured,Not captured,Not captured,Not captured,Meena Nayyar,Mother,Not captured,Not captured,Not captured,Not captured,A 301 Hindon Apartments,,New Delhi,Delhi,110096,8447494665,,Not captured,Not captured,karan.nayyar.my@gmail.com,Not captured,701937230,,Not captured,Not captured,Not captured,Not captured,Not captured,Not captured,
Not captured,Not captured,06/23/2019,Not captured,Not captured,863949,020,00072,OVI-28-0050943,OverseasCare Visitors Insurance Plan,Not captured,Not captured,Not captured,Passport(p2980459),,,Nayyar,Karan,,08/23/1980,male,Not captured,Not captured,Not captured,Not captured,Not captured,Not captured,Not captured,Not captured,Not captured,Not captured,Not captured,Not captured,Not captured,Meena Nayyar,Mother,Not captured,Not captured,Not captured,Not captured,A 301 Hindon Apartments,,New Delhi,Delhi,110096,8447494665,,Not captured,Not captured,karan.nayyar.my@gmail.com,Not captured,701937229,,Not captured,Not captured,Not captured,Not captured,Not captured,Not captured,
Not captured,Not captured,06/24/2019,Not captured,Not captured,863949,020,00072,ARS-01-0050942,Beacon International,Not captured,Not captured,Not captured,,,,Geldzahler,David,,11/03/1986,male,Not captured,Not captured,Not captured,Not captured,Not captured,Not captured,Not captured,Not captured,Not captured,Not captured,Not captured,Not captured,Not captured,,,Not captured,Not captured,Not captured,Not captured,1420 56th Street,,Brooklyn,New York,11219,,,Not captured,Not captured,davgeld@gmail.com,Not captured,701937223,,Not captured,Not captured,Not captured,Not captured,Not captured,Not captured,
Not captured,Not captured,06/20/2019,Not captured,Not captured,863949,020,00072,ARS-02-0050941,Beacon America,Not captured,Not captured,Not captured,,,,Zinda,Mary Anne,,12/30/1997,female,Not captured,Not captured,Not captured,Not captured,Not captured,Not captured,Not captured,Not captured,Not captured,Not captured,Not captured,Not captured,Not captured,,,Not captured,Not captured,Not captured,Not captured,515 Maple Ln,,Sewickley,,15143,,,Not captured,Not captured,howardb@rmu.edu,Not captured,701937222,,Not captured,Not captured,Not captured,Not captured,Not captured,Not captured,
Not captured,Not captured,06/20/2019,Not captured,Not captured,863949,020,00072,ARS-02-0050940,Beacon America,Not captured,Not captured,Not captured,,,,Mitchell,Jon-Benay,,01/09/1999,female,Not captured,Not captured,Not captured,Not captured,Not captured,Not captured,Not captured,Not captured,Not captured,Not captured,Not captured,Not captured,Not captured,,,Not captured,Not captured,Not captured,Not captured,515 Maple Ln,,Sewickley,,15143,,,Not captured,Not captured,howardb@rmu.edu,Not captured,701937221,,Not captured,Not captured,Not captured,Not captured,Not captured,Not captured,
Not captured,Not captured,06/20/2019,Not captured,Not captured,863949,020,00072,ARS-02-0050939,Beacon America,Not captured,Not captured,Not captured,,,,Mgqobele,Sinazo,,02/04/1997,female,Not captured,Not captured,Not captured,Not captured,Not captured,Not captured,Not captured,Not captured,Not captured,Not captured,Not captured,Not captured,Not captured,,,Not captured,Not captured,Not captured,Not captured,515 Maple Ln,,Sewickley,,15143,,,Not captured,Not captured,howardb@rmu.edu,Not captured,701937220,,Not captured,Not captured,Not captured,Not captured,Not captured,Not captured,
Not captured,Not captured,06/20/2019,Not captured,Not captured,863949,020,00072,ARS-02-0050938,Beacon America,Not captured,Not captured,Not captured,,,,Mdhluli,Bonolo,,10/19/1999,male,Not captured,Not captured,Not captured,Not captured,Not captured,Not captured,Not captured,Not captured,Not captured,Not captured,Not captured,Not captured,Not captured,,,Not captured,Not captured,Not captured,Not captured,515 Maple Ln,,Sewickley,,15143,,,Not captured,Not captured,howardb@rmu.edu,Not captured,701937219,,Not captured,Not captured,Not captured,Not captured,Not captured,Not captured,
Not captured,Not captured,06/20/2019,Not captured,Not captured,863949,020,00072,ARS-02-0050937,Beacon America,Not captured,Not captured,Not captured,,,,Cwayita,Kweyi,,07/14/1998,female,Not captured,Not captured,Not captured,Not captured,Not captured,Not captured,Not captured,Not captured,Not captured,Not captured,Not captured,Not captured,Not captured,,,Not captured,Not captured,Not captured,Not captured,515 Maple Ln,,Sewickley,,15143,,,Not captured,Not captured,howardb@rmu.edu,Not captured,701937218,,Not captured,Not captured,Not captured,Not captured,Not captured,Not captured,
Not captured,Not captured,06/20/2019,Not captured,Not captured,863949,020,00072,ARS-02-0050936,Beacon America,Not captured,Not captured,Not captured,,,,Coetzee,Rayvern,,03/19/1999,male,Not captured,Not captured,Not captured,Not captured,Not captured,Not captured,Not captured,Not captured,Not captured,Not captured,Not captured,Not captured,Not captured,,,Not captured,Not captured,Not captured,Not captured,515 Maple Ln,,Sewickley,,15143,,,Not captured,Not captured,howardb@rmu.edu,Not captured,701937217,,Not captured,Not captured,Not captured,Not captured,Not captured,Not captured,
Not captured,Not captured,06/20/2019,Not captured,Not captured,863949,020,00072,ARS-03-0050423,Essential America,Not captured,Not captured,Not captured,Passport(566507596),,,Weatherford,Trenton ,Lee,04/01/1988,male,Not captured,Not captured,Not captured,Not captured,Not captured,Not captured,Not captured,Not captured,Not captured,Not captured,Not captured,Not captured,Not captured,,,Not captured,Not captured,Not captured,Not captured,862 Hilltop Dr,,Mineral Wells,Texas,76067,9404689008,,Not captured,Not captured,kellieweatherford@hotmail.com,Not captured,701935851,,Not captured,Not captured,Not captured,Not captured,Not captured,Not captured,
Not captured,Not captured,06/20/2019,Not captured,Not captured,863949,020,00072,ARS-03-0050423,Essential America,Not captured,Not captured,Not captured,,Passport(565900652),Spouse,Weatherford,Kellie,Marie,01/10/1979,female,Not captured,Not captured,Not captured,Not captured,Not captured,Not captured,Not captured,Not captured,Not captured,Not captured,Not captured,Not captured,Not captured,,,Not captured,Not captured,Not captured,Not captured,862 Hilltop Dr,,Mineral Wells,Texas,76067,9404689008,,Not captured,Not captured,kellieweatherford@hotmail.com,Not captured,,701935852,Not captured,Not captured,Not captured,Not captured,Not captured,Not captured,