EE Transaction Type,Dependent Transaction Type,Effective Date,EE Signature,EE Signature Date,Control,Suffix,Account,Plan Number,Plan Name,Claim Office,Network ID Number,Customer Code,EE SSN,Dependent SSN,Dependent Relationship,Last Name,First Name,Middle Initial,DOB,Gender,Ethnicity,PCP/PCD,PCP/PCD Current Patient,Provider Cap Office Number,COB,Dep Student Indicator,Dep OOA Indicator,EE Prior Coverage Indicator,EE Late Entrant,EE Language Indicator,Hire Date,Earnings,Earnings Frequency,Beneficiary (Last Name First Name MI),Beneficiary Relationship,Continuation of Coverage Expiration Date,Continuation of Coverage Event Date,Continuation of Coverage Length of Coverage,Work Location Zip Code,Street Address Line 1,Street Address Line 2,City,State,Zip Code,Home Phone Number,Work Phone Number,Accept Code,Evidence Code,EE Email Address,Communication Disability Code,EE Alternate ID,Dep Alternate ID,Old Control,Old Suffix,Old Account,New Control,New Suffix,New Account,
Not captured,Not captured,06/19/2019,Not captured,Not captured,863949,020,00072,ARS-02-0050909,Beacon America,Not captured,Not captured,Not captured,,,,malkiel,alex,,02/18/1987,male,Not captured,Not captured,Not captured,Not captured,Not captured,Not captured,Not captured,Not captured,Not captured,Not captured,Not captured,Not captured,Not captured,,,Not captured,Not captured,Not captured,Not captured,kornit 18/2,,nazarith elite,HaZafon,17000,,,Not captured,Not captured,alexma1@walla.com,Not captured,701937160,,Not captured,Not captured,Not captured,Not captured,Not captured,Not captured,
Not captured,Not captured,06/19/2019,Not captured,Not captured,863949,020,00072,ARS-01-0050908,Beacon International,Not captured,Not captured,Not captured,,,,Chandler,Logan,C,06/25/1991,male,Not captured,Not captured,Not captured,Not captured,Not captured,Not captured,Not captured,Not captured,Not captured,Not captured,Not captured,Not captured,Not captured,,,Not captured,Not captured,Not captured,Not captured,188 S Logan St #201,,Denver,Colorado,80209,,,Not captured,Not captured,lchandler224@gmail.com,Not captured,701937159,,Not captured,Not captured,Not captured,Not captured,Not captured,Not captured,
Not captured,Not captured,06/19/2019,Not captured,Not captured,863949,020,00072,ARS-02-0050905,Beacon America,Not captured,Not captured,Not captured,Passport(S8074590),,,Mehrotra,Harish,,01/07/1943,male,Not captured,Not captured,Not captured,Not captured,Not captured,Not captured,Not captured,Not captured,Not captured,Not captured,Not captured,Not captured,Not captured,,,Not captured,Not captured,Not captured,Not captured,290 stonebrier lane,,ALPHARETTA,Georgia,30004,6094892428,,Not captured,Not captured,sanjayrajsoni@gmail.com,Not captured,701937156,,Not captured,Not captured,Not captured,Not captured,Not captured,Not captured,
Not captured,Not captured,06/19/2019,Not captured,Not captured,863949,020,00072,ARS-02-0050904,Beacon America,Not captured,Not captured,Not captured,Passport(S8067377),,,Mehrotra,Mina,,02/24/1951,female,Not captured,Not captured,Not captured,Not captured,Not captured,Not captured,Not captured,Not captured,Not captured,Not captured,Not captured,Not captured,Not captured,,,Not captured,Not captured,Not captured,Not captured,290 stonebrier lane,,ALPHARETTA,Georgia,30004,6094892428,,Not captured,Not captured,roopaliraj@gmail.com,Not captured,701937155,,Not captured,Not captured,Not captured,Not captured,Not captured,Not captured,
Not captured,Not captured,06/18/2019,Not captured,Not captured,863949,020,00072,ARS-02-0050897,Beacon America,Not captured,Not captured,Not captured,Passport(B4628030),,,Duong,Luu,N,08/19/1949,female,Not captured,Not captured,Not captured,Not captured,Not captured,Not captured,Not captured,Not captured,Not captured,Not captured,Not captured,Not captured,Not captured,,,Not captured,Not captured,Not captured,Not captured,692 Joplin St,,Aurora,Colorado,80011,720-635-0658,,Not captured,Not captured,l.duong21@yahoo.com,Not captured,701937147,,Not captured,Not captured,Not captured,Not captured,Not captured,Not captured,
Not captured,Not captured,06/18/2019,Not captured,Not captured,863949,020,00072,ARS-01-0050896,Beacon International,Not captured,Not captured,Not captured,,,,Bahr,Christine,,11/15/1976,female,Not captured,Not captured,Not captured,Not captured,Not captured,Not captured,Not captured,Not captured,Not captured,Not captured,Not captured,Not captured,Not captured,,,Not captured,Not captured,Not captured,Not captured,6152 Aspen Lane,,Gilbert,Minnesota,55741,,,Not captured,Not captured,cbahr@isd2711.org,Not captured,701937146,,Not captured,Not captured,Not captured,Not captured,Not captured,Not captured,
Not captured,Not captured,06/18/2019,Not captured,Not captured,863949,020,00072,ARS-01-0050895,Beacon International,Not captured,Not captured,Not captured,,,,Bahr,Darrin,,05/04/1967,male,Not captured,Not captured,Not captured,Not captured,Not captured,Not captured,Not captured,Not captured,Not captured,Not captured,Not captured,Not captured,Not captured,,,Not captured,Not captured,Not captured,Not captured,6152 Aspen Lane,,Gilbert,Minnesota,55741,,,Not captured,Not captured,cbahr@isd2711.org,Not captured,701937145,,Not captured,Not captured,Not captured,Not captured,Not captured,Not captured,
Not captured,Not captured,06/18/2019,Not captured,Not captured,863949,020,00072,ARS-01-0050894,Beacon International,Not captured,Not captured,Not captured,,,,Lamar,Traci,A,07/08/1959,female,Not captured,Not captured,Not captured,Not captured,Not captured,Not captured,Not captured,Not captured,Not captured,Not captured,Not captured,Not captured,Not captured,,,Not captured,Not captured,Not captured,Not captured,2300 Laurel Valley Way,,Raleigh,North Carolina,27604,,,Not captured,Not captured,traci@lamarfamily.com,Not captured,701937144,,Not captured,Not captured,Not captured,Not captured,Not captured,Not captured,
Not captured,Not captured,06/18/2019,Not captured,Not captured,863949,020,00072,ARS-01-0050893,Beacon International,Not captured,Not captured,Not captured,,,,Thompson,Emily,,12/27/1973,female,Not captured,Not captured,Not captured,Not captured,Not captured,Not captured,Not captured,Not captured,Not captured,Not captured,Not captured,Not captured,Not captured,,,Not captured,Not captured,Not captured,Not captured,1081 Prospect Place,,Brooklyn,New York,11213,,,Not captured,Not captured,emily@emilythompsonflowers.com,Not captured,701937143,,Not captured,Not captured,Not captured,Not captured,Not captured,Not captured,
Not captured,Not captured,06/18/2019,Not captured,Not captured,863949,020,00072,ARS-01-0050892,Beacon International,Not captured,Not captured,Not captured,,,,Kelley,August,,05/26/2014,male,Not captured,Not captured,Not captured,Not captured,Not captured,Not captured,Not captured,Not captured,Not captured,Not captured,Not captured,Not captured,Not captured,,,Not captured,Not captured,Not captured,Not captured,1081 Prospect Place,,Brooklyn,New York,11213,,,Not captured,Not captured,emily@emilythompsonflowers.com,Not captured,701937142,,Not captured,Not captured,Not captured,Not captured,Not captured,Not captured,
Not captured,Not captured,06/18/2019,Not captured,Not captured,863949,020,00072,ARS-02-0050891,Beacon America,Not captured,Not captured,Not captured,Passport(SC2267809),,,C,Ruth,BAEZ,01/10/1973,female,Not captured,Not captured,Not captured,Not captured,Not captured,Not captured,Not captured,Not captured,Not captured,Not captured,Not captured,Not captured,Not captured,NURYS SUBERO DE BAEZ,MOTHER,Not captured,Not captured,Not captured,Not captured,CUL DE SAC MADRE CARMEN GONZALEZ RESD. JHONSON I NO. 7,,LAS PRADERAS,SANTO DOMINGO,00000,8098693275,,Not captured,Not captured,BAEZ.RUTH@GMAIL.COM,Not captured,701937141,,Not captured,Not captured,Not captured,Not captured,Not captured,Not captured,
Not captured,Not captured,06/18/2019,Not captured,Not captured,863949,020,00072,ARS-02-0050888,Beacon America,Not captured,Not captured,Not captured,Passport(SC2267809),,,Baez,Ruth,C,01/10/1973,female,Not captured,Not captured,Not captured,Not captured,Not captured,Not captured,Not captured,Not captured,Not captured,Not captured,Not captured,Not captured,Not captured,NURYS SUBERO DE BAEZ,MOTHER,Not captured,Not captured,Not captured,Not captured,,,,,,,,Not captured,Not captured,BAEZ.RUTH@GMAIL.COM,Not captured,701937138,,Not captured,Not captured,Not captured,Not captured,Not captured,Not captured,
Not captured,Not captured,06/18/2019,Not captured,Not captured,863949,020,00072,ARS-01-0050887,Beacon International,Not captured,Not captured,Not captured,,,,Horowitz,Esther,,03/12/1981,female,Not captured,Not captured,Not captured,Not captured,Not captured,Not captured,Not captured,Not captured,Not captured,Not captured,Not captured,Not captured,Not captured,,,Not captured,Not captured,Not captured,Not captured,119 Highgrove Crescent,,Lakewood,New Jersey,08701,,,Not captured,Not captured,estherhor@verizon.net,Not captured,701937137,,Not captured,Not captured,Not captured,Not captured,Not captured,Not captured,
Not captured,Not captured,06/18/2019,Not captured,Not captured,863949,020,00072,ARS-01-0050886,Beacon International,Not captured,Not captured,Not captured,,,,Horowitz,Mendy,,11/06/1980,male,Not captured,Not captured,Not captured,Not captured,Not captured,Not captured,Not captured,Not captured,Not captured,Not captured,Not captured,Not captured,Not captured,,,Not captured,Not captured,Not captured,Not captured,119 Highgrove Crescent,,Lakewood,New Jersey,08701,,,Not captured,Not captured,estherhor@verizon.net,Not captured,701937136,,Not captured,Not captured,Not captured,Not captured,Not captured,Not captured,
Not captured,Not captured,06/18/2019,Not captured,Not captured,863949,020,00072,ARS-01-0050884,Beacon International,Not captured,Not captured,Not captured,,,,RUSCHELAU,Susanne,M,07/21/1949,female,Not captured,Not captured,Not captured,Not captured,Not captured,Not captured,Not captured,Not captured,Not captured,Not captured,Not captured,Not captured,Not captured,,,Not captured,Not captured,Not captured,Not captured,49 Henfoot road,,Newton,New Jersey,07860,,,Not captured,Not captured,sruschelau@hotmail.com,Not captured,701937134,,Not captured,Not captured,Not captured,Not captured,Not captured,Not captured,
Not captured,Not captured,06/18/2019,Not captured,Not captured,863949,020,00072,ARS-01-0050883,Beacon International,Not captured,Not captured,Not captured,,,,Krause,Kenneth,C,09/17/1941,male,Not captured,Not captured,Not captured,Not captured,Not captured,Not captured,Not captured,Not captured,Not captured,Not captured,Not captured,Not captured,Not captured,,,Not captured,Not captured,Not captured,Not captured,49 Henfoot road,,Newton,New Jersey,07860,,,Not captured,Not captured,hopelaw01@yahoo.com,Not captured,701937133,,Not captured,Not captured,Not captured,Not captured,Not captured,Not captured,
Not captured,Not captured,06/18/2019,Not captured,Not captured,863949,020,00072,ARS-01-0050882,Beacon International,Not captured,Not captured,Not captured,,,,spang,Jared,,08/09/1995,male,Not captured,Not captured,Not captured,Not captured,Not captured,Not captured,Not captured,Not captured,Not captured,Not captured,Not captured,Not captured,Not captured,,,Not captured,Not captured,Not captured,Not captured,20190 argonaut drive,,saratoga,California,95070,,,Not captured,Not captured,cheryl.spang@comcast.net,Not captured,701937132,,Not captured,Not captured,Not captured,Not captured,Not captured,Not captured,
Not captured,Not captured,06/18/2019,Not captured,Not captured,863949,020,00072,ARS-01-0050881,Beacon International,Not captured,Not captured,Not captured,Passport(PE130941),,,Pardo,Maria del Rosario del Carmen,,12/13/1957,female,Not captured,Not captured,Not captured,Not captured,Not captured,Not captured,Not captured,Not captured,Not captured,Not captured,Not captured,Not captured,Not captured,Juan Carlos Pizarro Pardo Pablo Pizarro Pardo Maria Alejandra Pizarro Pardo ,Hijos,Not captured,Not captured,Not captured,Not captured,Carrera 9B N.117A-08,,Bogota,Distrito Capltal de Santa Fe de Bogot&atilde;,0000,3202336730,,Not captured,Not captured,rosspardo@hotmail.com,Not captured,701937090,,Not captured,Not captured,Not captured,Not captured,Not captured,Not captured,
Not captured,Not captured,06/18/2019,Not captured,Not captured,863949,020,00072,ARS-01-0050880,Beacon International,Not captured,Not captured,Not captured,Passport(AQ460837),,,Robledo Pardo,Sylvia del Carmen ,,04/28/1967,female,Not captured,Not captured,Not captured,Not captured,Not captured,Not captured,Not captured,Not captured,Not captured,Not captured,Not captured,Not captured,Not captured,Alfonso Robledo Pardo,Hermano,Not captured,Not captured,Not captured,Not captured,Carrera 1 Este N. 70A -42 Apto 503,,Bogota,Distrito Capltal de Santa Fe de Bogot&atilde;,4006,3202336730,,Not captured,Not captured,robledosylvia@otmail.com,Not captured,701937089,,Not captured,Not captured,Not captured,Not captured,Not captured,Not captured,
Not captured,Not captured,06/17/2019,Not captured,Not captured,863949,020,00072,ARS-01-0050870,Beacon International,Not captured,Not captured,Not captured,,,,Brown,Darroch,C,03/30/1996,male,Not captured,Not captured,Not captured,Not captured,Not captured,Not captured,Not captured,Not captured,Not captured,Not captured,Not captured,Not captured,Not captured,,,Not captured,Not captured,Not captured,Not captured,47 Surrenden Road,,Brighton,,BN1 6PQ,,,Not captured,Not captured,darroch.brown@gmail.com,Not captured,701936999,,Not captured,Not captured,Not captured,Not captured,Not captured,Not captured,
Not captured,Not captured,06/18/2019,Not captured,Not captured,863949,020,00072,ARS-01-0050868,Beacon International,Not captured,Not captured,Not captured,,,,Kolomiyets,Darina,,01/26/1996,female,Not captured,Not captured,Not captured,Not captured,Not captured,Not captured,Not captured,Not captured,Not captured,Not captured,Not captured,Not captured,Not captured,,,Not captured,Not captured,Not captured,Not captured,435 HYLAN BLVD,,STATEN ISLAND,New York,10305,,,Not captured,Not captured,darin4601@gmail.com,Not captured,701936997,,Not captured,Not captured,Not captured,Not captured,Not captured,Not captured,
Not captured,Not captured,06/17/2019,Not captured,Not captured,863949,020,00072,ARS-01-0050867,Beacon International,Not captured,Not captured,Not captured,,,,Camey,Jonah,A,03/11/2013,male,Not captured,Not captured,Not captured,Not captured,Not captured,Not captured,Not captured,Not captured,Not captured,Not captured,Not captured,Not captured,Not captured,,,Not captured,Not captured,Not captured,Not captured,813 Lancaster Dr,,Friendswood,Texas,77546,,,Not captured,Not captured,jacamey1@gmail.com,Not captured,701936996,,Not captured,Not captured,Not captured,Not captured,Not captured,Not captured,
Not captured,Not captured,06/17/2019,Not captured,Not captured,863949,020,00072,ARS-01-0050866,Beacon International,Not captured,Not captured,Not captured,,,,Camey,Lauren,,06/11/1983,female,Not captured,Not captured,Not captured,Not captured,Not captured,Not captured,Not captured,Not captured,Not captured,Not captured,Not captured,Not captured,Not captured,,,Not captured,Not captured,Not captured,Not captured,813 Lancaster Dr,,Friendswood,Texas,77546,,,Not captured,Not captured,jacamey1@gmail.com,Not captured,701936995,,Not captured,Not captured,Not captured,Not captured,Not captured,Not captured,
Not captured,Not captured,06/17/2019,Not captured,Not captured,863949,020,00072,ARS-01-0050865,Beacon International,Not captured,Not captured,Not captured,,,,Camey,Jonathan,,12/18/1983,male,Not captured,Not captured,Not captured,Not captured,Not captured,Not captured,Not captured,Not captured,Not captured,Not captured,Not captured,Not captured,Not captured,,,Not captured,Not captured,Not captured,Not captured,813 Lancaster Dr,,Friendswood,Texas,77546,,,Not captured,Not captured,jacamey1@gmail.com,Not captured,701936994,,Not captured,Not captured,Not captured,Not captured,Not captured,Not captured,
Not captured,Not captured,06/17/2019,Not captured,Not captured,863949,020,00072,ARS-03-0050511,Essential America,Not captured,Not captured,Not captured,Passport(XDA386803),,,Hernandez,Armando,,06/09/1955,male,Not captured,Not captured,Not captured,Not captured,Not captured,Not captured,Not captured,Not captured,Not captured,Not captured,Not captured,Not captured,Not captured,,,Not captured,Not captured,Not captured,Not captured,Caya Bunita #8,,palm beach malnock,terra del sol,0000,17864502201,,Not captured,Not captured,armando.h@grupohelsan.com.ve,Not captured,701936105,,Not captured,Not captured,Not captured,Not captured,Not captured,Not captured,
Not captured,Not captured,06/17/2019,Not captured,Not captured,863949,020,00072,ARS-01-0050864,Beacon International,Not captured,Not captured,Not captured,,,,Muldoon,Kellen,J,10/14/1990,male,Not captured,Not captured,Not captured,Not captured,Not captured,Not captured,Not captured,Not captured,Not captured,Not captured,Not captured,Not captured,Not captured,,,Not captured,Not captured,Not captured,Not captured,11811 W Whitaker Ave,,Greenfield,Wisconsin,53228,,,Not captured,Not captured,kellen@am-ex.com,Not captured,701936993,,Not captured,Not captured,Not captured,Not captured,Not captured,Not captured,
Not captured,Not captured,06/17/2019,Not captured,Not captured,863949,020,00072,ARS-01-0050857,Beacon International,Not captured,Not captured,Not captured,,,,Burrow,Tonia,J,01/19/1982,female,Not captured,Not captured,Not captured,Not captured,Not captured,Not captured,Not captured,Not captured,Not captured,Not captured,Not captured,Not captured,Not captured,,,Not captured,Not captured,Not captured,Not captured,P.O. Box 634,,Girdwood,Alaska,99587,,,Not captured,Not captured,tonia.burrow@gmail.com,Not captured,701936986,,Not captured,Not captured,Not captured,Not captured,Not captured,Not captured,
Not captured,Not captured,06/17/2019,Not captured,Not captured,863949,020,00072,ARS-01-0050856,Beacon International,Not captured,Not captured,Not captured,,,,Williams,Patricia,D,02/10/1941,female,Not captured,Not captured,Not captured,Not captured,Not captured,Not captured,Not captured,Not captured,Not captured,Not captured,Not captured,Not captured,Not captured,,,Not captured,Not captured,Not captured,Not captured,9845 SW Ventura Ct,,Tigard,Oregon,97223,,,Not captured,Not captured,p_d_williams@yahoo.com,Not captured,701936985,,Not captured,Not captured,Not captured,Not captured,Not captured,Not captured,
Not captured,Not captured,06/17/2019,Not captured,Not captured,863949,020,00072,ARS-02-0050773,Beacon America,Not captured,Not captured,Not captured,,,,GAYLE,BARRINGTON,,05/12/1985,male,Not captured,Not captured,Not captured,Not captured,Not captured,Not captured,Not captured,Not captured,Not captured,Not captured,Not captured,Not captured,Not captured,,,Not captured,Not captured,Not captured,Not captured,2425 Wilson Blvd. Suite 350 Virginia V,,Arlington,Virginia,22201,7038415607,,Not captured,Not captured,mhernandez@ncsc.org,Not captured,701936792,,Not captured,Not captured,Not captured,Not captured,Not captured,Not captured,
Not captured,Not captured,06/17/2019,Not captured,Not captured,863949,020,00072,ARS-01-0050680,Beacon International,Not captured,Not captured,Not captured,,,,amstell,simon,m,11/29/1979,male,Not captured,Not captured,Not captured,Not captured,Not captured,Not captured,Not captured,Not captured,Not captured,Not captured,Not captured,Not captured,Not captured,,,Not captured,Not captured,Not captured,Not captured,Flat 3,,London,,NW3 5JY,,,Not captured,Not captured,iamsimonamstell@gmail.com,Not captured,701936578,,Not captured,Not captured,Not captured,Not captured,Not captured,Not captured,
Not captured,Not captured,06/19/2019,Not captured,Not captured,863949,020,00072,OVI-28-0050679,OverseasCare Visitors Insurance Plan,Not captured,Not captured,Not captured,Passport(J5026205),,,Sinha,RENU,,03/18/1954,female,Not captured,Not captured,Not captured,Not captured,Not captured,Not captured,Not captured,Not captured,Not captured,Not captured,Not captured,Not captured,Not captured,SHILPA SINHA,DAUGHTER,Not captured,Not captured,Not captured,Not captured,3154 HERITAGE SPRINGS CT,,San Jose,California,95148,4082213513,,Not captured,Not captured,shilpa.sinha@gmail.com,Not captured,701936577,,Not captured,Not captured,Not captured,Not captured,Not captured,Not captured,
Not captured,Not captured,06/19/2019,Not captured,Not captured,863949,020,00072,ARS-02-0050646,Beacon America,Not captured,Not captured,Not captured,Passport(na),,,Tapiero Cortes,Edisson,,09/09/1982,male,Not captured,Not captured,Not captured,Not captured,Not captured,Not captured,Not captured,Not captured,Not captured,Not captured,Not captured,Not captured,Not captured,estate,na,Not captured,Not captured,Not captured,Not captured,National Center for State Courts,,Bogota,Distrito Capltal de Santa Fe de Bogot&atilde;,na,5714898640 114,,Not captured,Not captured,yrodriguez@ncsc.co,Not captured,701936437,,Not captured,Not captured,Not captured,Not captured,Not captured,Not captured,
Not captured,Not captured,06/19/2019,Not captured,Not captured,863949,020,00072,ARS-02-0050626,Beacon America,Not captured,Not captured,Not captured,Passport(na),,,Figueroa Pena,Victor Amin,,11/13/1983,male,Not captured,Not captured,Not captured,Not captured,Not captured,Not captured,Not captured,Not captured,Not captured,Not captured,Not captured,Not captured,Not captured,estate,na,Not captured,Not captured,Not captured,Not captured,National Center for State Courts,,Bogota,Distrito Capltal de Santa Fe de Bogot&atilde;,na,5714898640 114,,Not captured,Not captured,yrodriguez@ncsc.co,Not captured,701936352,,Not captured,Not captured,Not captured,Not captured,Not captured,Not captured,
Not captured,Not captured,06/19/2019,Not captured,Not captured,863949,020,00072,ARS-02-0050625,Beacon America,Not captured,Not captured,Not captured,Passport(na),,,Mora Ramirez,Sindy Jhoana,,05/16/1988,female,Not captured,Not captured,Not captured,Not captured,Not captured,Not captured,Not captured,Not captured,Not captured,Not captured,Not captured,Not captured,Not captured,estate,na,Not captured,Not captured,Not captured,Not captured,National Center for State Courts,,Bogota,Distrito Capltal de Santa Fe de Bogot&atilde;,na,5714898640 114,,Not captured,Not captured,yrodriguez@ncsc.co,Not captured,701936351,,Not captured,Not captured,Not captured,Not captured,Not captured,Not captured,
Not captured,Not captured,06/19/2019,Not captured,Not captured,863949,020,00072,ARS-02-0050624,Beacon America,Not captured,Not captured,Not captured,Passport(na),,,Rojas Fernandez,Rafael Viley,,06/25/1980,male,Not captured,Not captured,Not captured,Not captured,Not captured,Not captured,Not captured,Not captured,Not captured,Not captured,Not captured,Not captured,Not captured,estate,na,Not captured,Not captured,Not captured,Not captured,National Center for State Courts,,Bogota,Distrito Capltal de Santa Fe de Bogot&atilde;,na,5714898640 114,,Not captured,Not captured,yrodriguez@ncsc.co,Not captured,701936350,,Not captured,Not captured,Not captured,Not captured,Not captured,Not captured,
Not captured,Not captured,06/19/2019,Not captured,Not captured,863949,020,00072,ARS-02-0050623,Beacon America,Not captured,Not captured,Not captured,Passport(na),,,Forero Pacheco,Omar Dario,,12/24/1983,male,Not captured,Not captured,Not captured,Not captured,Not captured,Not captured,Not captured,Not captured,Not captured,Not captured,Not captured,Not captured,Not captured,estate,na,Not captured,Not captured,Not captured,Not captured,National Center for State Courts,,Bogota,Distrito Capltal de Santa Fe de Bogot&atilde;,na,5714898640 114,,Not captured,Not captured,yrodriguez@ncsc.co,Not captured,701936349,,Not captured,Not captured,Not captured,Not captured,Not captured,Not captured,