EE Transaction Type,Dependent Transaction Type,Effective Date,EE Signature,EE Signature Date,Control,Suffix,Account,Plan Number,Plan Name,Claim Office,Network ID Number,Customer Code,EE SSN,Dependent SSN,Dependent Relationship,Last Name,First Name,Middle Initial,DOB,Gender,Ethnicity,PCP/PCD,PCP/PCD Current Patient,Provider Cap Office Number,COB,Dep Student Indicator,Dep OOA Indicator,EE Prior Coverage Indicator,EE Late Entrant,EE Language Indicator,Hire Date,Earnings,Earnings Frequency,Beneficiary (Last Name First Name MI),Beneficiary Relationship,Continuation of Coverage Expiration Date,Continuation of Coverage Event Date,Continuation of Coverage Length of Coverage,Work Location Zip Code,Street Address Line 1,Street Address Line 2,City,State,Zip Code,Home Phone Number,Work Phone Number,Accept Code,Evidence Code,EE Email Address,Communication Disability Code,EE Alternate ID,Dep Alternate ID,Old Control,Old Suffix,Old Account,New Control,New Suffix,New Account,
Not captured,Not captured,06/20/2019,Not captured,Not captured,863949,020,00072,ARS-02-0050941,Beacon America,Not captured,Not captured,Not captured,,,,Zinda,Mary Anne,,12/30/1997,female,Not captured,Not captured,Not captured,Not captured,Not captured,Not captured,Not captured,Not captured,Not captured,Not captured,Not captured,Not captured,Not captured,,,Not captured,Not captured,Not captured,Not captured,515 Maple Ln,,Sewickley,,15143,,,Not captured,Not captured,howardb@rmu.edu,Not captured,701937222,,Not captured,Not captured,Not captured,Not captured,Not captured,Not captured,
Not captured,Not captured,06/20/2019,Not captured,Not captured,863949,020,00072,ARS-02-0050940,Beacon America,Not captured,Not captured,Not captured,,,,Mitchell,Jon-Benay,,01/09/1999,female,Not captured,Not captured,Not captured,Not captured,Not captured,Not captured,Not captured,Not captured,Not captured,Not captured,Not captured,Not captured,Not captured,,,Not captured,Not captured,Not captured,Not captured,515 Maple Ln,,Sewickley,,15143,,,Not captured,Not captured,howardb@rmu.edu,Not captured,701937221,,Not captured,Not captured,Not captured,Not captured,Not captured,Not captured,
Not captured,Not captured,06/20/2019,Not captured,Not captured,863949,020,00072,ARS-02-0050939,Beacon America,Not captured,Not captured,Not captured,,,,Mgqobele,Sinazo,,02/04/1997,female,Not captured,Not captured,Not captured,Not captured,Not captured,Not captured,Not captured,Not captured,Not captured,Not captured,Not captured,Not captured,Not captured,,,Not captured,Not captured,Not captured,Not captured,515 Maple Ln,,Sewickley,,15143,,,Not captured,Not captured,howardb@rmu.edu,Not captured,701937220,,Not captured,Not captured,Not captured,Not captured,Not captured,Not captured,
Not captured,Not captured,06/20/2019,Not captured,Not captured,863949,020,00072,ARS-02-0050938,Beacon America,Not captured,Not captured,Not captured,,,,Mdhluli,Bonolo,,10/19/1999,male,Not captured,Not captured,Not captured,Not captured,Not captured,Not captured,Not captured,Not captured,Not captured,Not captured,Not captured,Not captured,Not captured,,,Not captured,Not captured,Not captured,Not captured,515 Maple Ln,,Sewickley,,15143,,,Not captured,Not captured,howardb@rmu.edu,Not captured,701937219,,Not captured,Not captured,Not captured,Not captured,Not captured,Not captured,
Not captured,Not captured,06/20/2019,Not captured,Not captured,863949,020,00072,ARS-02-0050937,Beacon America,Not captured,Not captured,Not captured,,,,Cwayita,Kweyi,,07/14/1998,female,Not captured,Not captured,Not captured,Not captured,Not captured,Not captured,Not captured,Not captured,Not captured,Not captured,Not captured,Not captured,Not captured,,,Not captured,Not captured,Not captured,Not captured,515 Maple Ln,,Sewickley,,15143,,,Not captured,Not captured,howardb@rmu.edu,Not captured,701937218,,Not captured,Not captured,Not captured,Not captured,Not captured,Not captured,
Not captured,Not captured,06/20/2019,Not captured,Not captured,863949,020,00072,ARS-02-0050936,Beacon America,Not captured,Not captured,Not captured,,,,Coetzee,Rayvern,,03/19/1999,male,Not captured,Not captured,Not captured,Not captured,Not captured,Not captured,Not captured,Not captured,Not captured,Not captured,Not captured,Not captured,Not captured,,,Not captured,Not captured,Not captured,Not captured,515 Maple Ln,,Sewickley,,15143,,,Not captured,Not captured,howardb@rmu.edu,Not captured,701937217,,Not captured,Not captured,Not captured,Not captured,Not captured,Not captured,
Not captured,Not captured,06/20/2019,Not captured,Not captured,863949,020,00072,ARS-03-0050423,Essential America,Not captured,Not captured,Not captured,Passport(566507596),,,Weatherford,Trenton ,Lee,04/01/1988,male,Not captured,Not captured,Not captured,Not captured,Not captured,Not captured,Not captured,Not captured,Not captured,Not captured,Not captured,Not captured,Not captured,,,Not captured,Not captured,Not captured,Not captured,862 Hilltop Dr,,Mineral Wells,Texas,76067,9404689008,,Not captured,Not captured,kellieweatherford@hotmail.com,Not captured,701935851,,Not captured,Not captured,Not captured,Not captured,Not captured,Not captured,
Not captured,Not captured,06/20/2019,Not captured,Not captured,863949,020,00072,ARS-03-0050423,Essential America,Not captured,Not captured,Not captured,,Passport(565900652),Spouse,Weatherford,Kellie,Marie,01/10/1979,female,Not captured,Not captured,Not captured,Not captured,Not captured,Not captured,Not captured,Not captured,Not captured,Not captured,Not captured,Not captured,Not captured,,,Not captured,Not captured,Not captured,Not captured,862 Hilltop Dr,,Mineral Wells,Texas,76067,9404689008,,Not captured,Not captured,kellieweatherford@hotmail.com,Not captured,,701935852,Not captured,Not captured,Not captured,Not captured,Not captured,Not captured,
Not captured,Not captured,06/20/2019,Not captured,Not captured,863949,020,00072,ARS-03-0050423,Essential America,Not captured,Not captured,Not captured,,Passport(565900653),Dependant,Weatherford,Hudson,Lee,06/25/2015,male,Not captured,Not captured,Not captured,Not captured,Not captured,Not captured,Not captured,Not captured,Not captured,Not captured,Not captured,Not captured,Not captured,,,Not captured,Not captured,Not captured,Not captured,862 Hilltop Dr,,Mineral Wells,Texas,76067,9404689008,,Not captured,Not captured,kellieweatherford@hotmail.com,Not captured,,701935853,Not captured,Not captured,Not captured,Not captured,Not captured,Not captured,
Not captured,Not captured,06/20/2019,Not captured,Not captured,863949,020,00072,ARS-03-0050423,Essential America,Not captured,Not captured,Not captured,,Passport(565900651),Dependant,Weatherford,Amelia,Ann,07/13/2017,female,Not captured,Not captured,Not captured,Not captured,Not captured,Not captured,Not captured,Not captured,Not captured,Not captured,Not captured,Not captured,Not captured,,,Not captured,Not captured,Not captured,Not captured,862 Hilltop Dr,,Mineral Wells,Texas,76067,9404689008,,Not captured,Not captured,kellieweatherford@hotmail.com,Not captured,,701935854,Not captured,Not captured,Not captured,Not captured,Not captured,Not captured,
Not captured,Not captured,06/20/2019,Not captured,Not captured,863949,020,00072,ARS-01-0050935,Beacon International,Not captured,Not captured,Not captured,,,,Kendall,Amanda,,01/19/1968,female,Not captured,Not captured,Not captured,Not captured,Not captured,Not captured,Not captured,Not captured,Not captured,Not captured,Not captured,Not captured,Not captured,,,Not captured,Not captured,Not captured,Not captured,Po Box 12398 643 Freel Drive,,Zephyr Cove,Nevada,89448,,,Not captured,Not captured,mandykendall1@gmail.com,Not captured,701937216,,Not captured,Not captured,Not captured,Not captured,Not captured,Not captured,
Not captured,Not captured,06/20/2019,Not captured,Not captured,863949,020,00072,OVI-28-0050934,OverseasCare Visitors Insurance Plan,Not captured,Not captured,Not captured,,,,Mullappilly,Jayaprakash,,05/25/1960,male,Not captured,Not captured,Not captured,Not captured,Not captured,Not captured,Not captured,Not captured,Not captured,Not captured,Not captured,Not captured,Not captured,Praseeda Thaliyakkattil,Daughter,Not captured,Not captured,Not captured,Not captured,1636 Angelina Ter,,Schenectady,New York,12303,5184413069,,Not captured,Not captured,jayendosoft@gmail.com,Not captured,701937215,,Not captured,Not captured,Not captured,Not captured,Not captured,Not captured,
Not captured,Not captured,06/20/2019,Not captured,Not captured,863949,020,00072,ARS-01-0050933,Beacon International,Not captured,Not captured,Not captured,,,,Gallop,Paige,K,03/07/1994,female,Not captured,Not captured,Not captured,Not captured,Not captured,Not captured,Not captured,Not captured,Not captured,Not captured,Not captured,Not captured,Not captured,,,Not captured,Not captured,Not captured,Not captured,11163 Hammerstone Dr,,South Lyon,Michigan,48178,,,Not captured,Not captured,deb.gallop@gmail.com,Not captured,701937214,,Not captured,Not captured,Not captured,Not captured,Not captured,Not captured,
Not captured,Not captured,06/20/2019,Not captured,Not captured,863949,020,00072,ARS-01-0050932,Beacon International,Not captured,Not captured,Not captured,,,,Gallop,Debra,L,03/18/1968,female,Not captured,Not captured,Not captured,Not captured,Not captured,Not captured,Not captured,Not captured,Not captured,Not captured,Not captured,Not captured,Not captured,,,Not captured,Not captured,Not captured,Not captured,11163 Hammerstone Dr,,South Lyon,Michigan,48178,,,Not captured,Not captured,deb.gallop@gmail.com,Not captured,701937213,,Not captured,Not captured,Not captured,Not captured,Not captured,Not captured,
Not captured,Not captured,06/20/2019,Not captured,Not captured,863949,020,00072,ARS-01-0050931,Beacon International,Not captured,Not captured,Not captured,,,,Pellegrin,James,,03/14/1979,male,Not captured,Not captured,Not captured,Not captured,Not captured,Not captured,Not captured,Not captured,Not captured,Not captured,Not captured,Not captured,Not captured,,,Not captured,Not captured,Not captured,Not captured,1814 Coastal Way,,Costa Mesa,California,92626,,,Not captured,Not captured,jamie.pellegrin@gmail.com,Not captured,701937212,,Not captured,Not captured,Not captured,Not captured,Not captured,Not captured,
Not captured,Not captured,06/20/2019,Not captured,Not captured,863949,020,00072,ARS-01-0050919,Beacon International,Not captured,Not captured,Not captured,,,,Schlaf,Rudiger,,04/03/1964,male,Not captured,Not captured,Not captured,Not captured,Not captured,Not captured,Not captured,Not captured,Not captured,Not captured,Not captured,Not captured,Not captured,,,Not captured,Not captured,Not captured,Not captured,4905 Ebensburg Drive,,Tampa,Florida,33647,,,Not captured,Not captured,rschlaf@gmail.com,Not captured,701937172,,Not captured,Not captured,Not captured,Not captured,Not captured,Not captured,
Not captured,Not captured,06/20/2019,Not captured,Not captured,863949,020,00072,ARS-01-0050918,Beacon International,Not captured,Not captured,Not captured,,,,Aizenchtadt,Olga,,09/02/1973,female,Not captured,Not captured,Not captured,Not captured,Not captured,Not captured,Not captured,Not captured,Not captured,Not captured,Not captured,Not captured,Not captured,,,Not captured,Not captured,Not captured,Not captured,4905 Ebensburg Drive,,Tampa,Florida,33647,,,Not captured,Not captured,rschlaf@gmail.com,Not captured,701937171,,Not captured,Not captured,Not captured,Not captured,Not captured,Not captured,
Not captured,Not captured,06/19/2019,Not captured,Not captured,863949,020,00072,ARS-02-0050909,Beacon America,Not captured,Not captured,Not captured,,,,malkiel,alex,,02/18/1987,male,Not captured,Not captured,Not captured,Not captured,Not captured,Not captured,Not captured,Not captured,Not captured,Not captured,Not captured,Not captured,Not captured,,,Not captured,Not captured,Not captured,Not captured,kornit 18/2,,nazarith elite,HaZafon,17000,,,Not captured,Not captured,alexma1@walla.com,Not captured,701937160,,Not captured,Not captured,Not captured,Not captured,Not captured,Not captured,
Not captured,Not captured,06/19/2019,Not captured,Not captured,863949,020,00072,ARS-01-0050908,Beacon International,Not captured,Not captured,Not captured,,,,Chandler,Logan,C,06/25/1991,male,Not captured,Not captured,Not captured,Not captured,Not captured,Not captured,Not captured,Not captured,Not captured,Not captured,Not captured,Not captured,Not captured,,,Not captured,Not captured,Not captured,Not captured,188 S Logan St #201,,Denver,Colorado,80209,,,Not captured,Not captured,lchandler224@gmail.com,Not captured,701937159,,Not captured,Not captured,Not captured,Not captured,Not captured,Not captured,
Not captured,Not captured,06/19/2019,Not captured,Not captured,863949,020,00072,ARS-02-0050905,Beacon America,Not captured,Not captured,Not captured,Passport(S8074590),,,Mehrotra,Harish,,01/07/1943,male,Not captured,Not captured,Not captured,Not captured,Not captured,Not captured,Not captured,Not captured,Not captured,Not captured,Not captured,Not captured,Not captured,,,Not captured,Not captured,Not captured,Not captured,290 stonebrier lane,,ALPHARETTA,Georgia,30004,6094892428,,Not captured,Not captured,sanjayrajsoni@gmail.com,Not captured,701937156,,Not captured,Not captured,Not captured,Not captured,Not captured,Not captured,
Not captured,Not captured,06/19/2019,Not captured,Not captured,863949,020,00072,ARS-02-0050904,Beacon America,Not captured,Not captured,Not captured,Passport(S8067377),,,Mehrotra,Mina,,02/24/1951,female,Not captured,Not captured,Not captured,Not captured,Not captured,Not captured,Not captured,Not captured,Not captured,Not captured,Not captured,Not captured,Not captured,,,Not captured,Not captured,Not captured,Not captured,290 stonebrier lane,,ALPHARETTA,Georgia,30004,6094892428,,Not captured,Not captured,roopaliraj@gmail.com,Not captured,701937155,,Not captured,Not captured,Not captured,Not captured,Not captured,Not captured,
Not captured,Not captured,06/20/2019,Not captured,Not captured,863949,020,00072,ARS-01-0050900,Beacon International,Not captured,Not captured,Not captured,Passport(533542949),,,Rhiddlehoover,Jon,,07/11/1978,male,Not captured,Not captured,Not captured,Not captured,Not captured,Not captured,Not captured,Not captured,Not captured,Not captured,Not captured,Not captured,Not captured,A&apos;Lana Rhiddlehoover,Spouse,Not captured,Not captured,Not captured,Not captured,1503 CliffwoodRd,,Euless,Texas,76040,8177135413,,Not captured,Not captured,jrhiddlehoover@pantego.org,Not captured,701937150,,Not captured,Not captured,Not captured,Not captured,Not captured,Not captured,
Not captured,Not captured,06/18/2019,Not captured,Not captured,863949,020,00072,ARS-02-0050897,Beacon America,Not captured,Not captured,Not captured,Passport(B4628030),,,Duong,Luu,N,08/19/1949,female,Not captured,Not captured,Not captured,Not captured,Not captured,Not captured,Not captured,Not captured,Not captured,Not captured,Not captured,Not captured,Not captured,,,Not captured,Not captured,Not captured,Not captured,692 Joplin St,,Aurora,Colorado,80011,720-635-0658,,Not captured,Not captured,l.duong21@yahoo.com,Not captured,701937147,,Not captured,Not captured,Not captured,Not captured,Not captured,Not captured,
Not captured,Not captured,06/18/2019,Not captured,Not captured,863949,020,00072,ARS-01-0050896,Beacon International,Not captured,Not captured,Not captured,,,,Bahr,Christine,,11/15/1976,female,Not captured,Not captured,Not captured,Not captured,Not captured,Not captured,Not captured,Not captured,Not captured,Not captured,Not captured,Not captured,Not captured,,,Not captured,Not captured,Not captured,Not captured,6152 Aspen Lane,,Gilbert,Minnesota,55741,,,Not captured,Not captured,cbahr@isd2711.org,Not captured,701937146,,Not captured,Not captured,Not captured,Not captured,Not captured,Not captured,
Not captured,Not captured,06/18/2019,Not captured,Not captured,863949,020,00072,ARS-01-0050895,Beacon International,Not captured,Not captured,Not captured,,,,Bahr,Darrin,,05/04/1967,male,Not captured,Not captured,Not captured,Not captured,Not captured,Not captured,Not captured,Not captured,Not captured,Not captured,Not captured,Not captured,Not captured,,,Not captured,Not captured,Not captured,Not captured,6152 Aspen Lane,,Gilbert,Minnesota,55741,,,Not captured,Not captured,cbahr@isd2711.org,Not captured,701937145,,Not captured,Not captured,Not captured,Not captured,Not captured,Not captured,
Not captured,Not captured,06/18/2019,Not captured,Not captured,863949,020,00072,ARS-01-0050894,Beacon International,Not captured,Not captured,Not captured,,,,Lamar,Traci,A,07/08/1959,female,Not captured,Not captured,Not captured,Not captured,Not captured,Not captured,Not captured,Not captured,Not captured,Not captured,Not captured,Not captured,Not captured,,,Not captured,Not captured,Not captured,Not captured,2300 Laurel Valley Way,,Raleigh,North Carolina,27604,,,Not captured,Not captured,traci@lamarfamily.com,Not captured,701937144,,Not captured,Not captured,Not captured,Not captured,Not captured,Not captured,
Not captured,Not captured,06/18/2019,Not captured,Not captured,863949,020,00072,ARS-01-0050893,Beacon International,Not captured,Not captured,Not captured,,,,Thompson,Emily,,12/27/1973,female,Not captured,Not captured,Not captured,Not captured,Not captured,Not captured,Not captured,Not captured,Not captured,Not captured,Not captured,Not captured,Not captured,,,Not captured,Not captured,Not captured,Not captured,1081 Prospect Place,,Brooklyn,New York,11213,,,Not captured,Not captured,emily@emilythompsonflowers.com,Not captured,701937143,,Not captured,Not captured,Not captured,Not captured,Not captured,Not captured,
Not captured,Not captured,06/18/2019,Not captured,Not captured,863949,020,00072,ARS-01-0050892,Beacon International,Not captured,Not captured,Not captured,,,,Kelley,August,,05/26/2014,male,Not captured,Not captured,Not captured,Not captured,Not captured,Not captured,Not captured,Not captured,Not captured,Not captured,Not captured,Not captured,Not captured,,,Not captured,Not captured,Not captured,Not captured,1081 Prospect Place,,Brooklyn,New York,11213,,,Not captured,Not captured,emily@emilythompsonflowers.com,Not captured,701937142,,Not captured,Not captured,Not captured,Not captured,Not captured,Not captured,
Not captured,Not captured,06/18/2019,Not captured,Not captured,863949,020,00072,ARS-02-0050891,Beacon America,Not captured,Not captured,Not captured,Passport(SC2267809),,,C,Ruth,BAEZ,01/10/1973,female,Not captured,Not captured,Not captured,Not captured,Not captured,Not captured,Not captured,Not captured,Not captured,Not captured,Not captured,Not captured,Not captured,NURYS SUBERO DE BAEZ,MOTHER,Not captured,Not captured,Not captured,Not captured,CUL DE SAC MADRE CARMEN GONZALEZ RESD. JHONSON I NO. 7,,LAS PRADERAS,SANTO DOMINGO,00000,8098693275,,Not captured,Not captured,BAEZ.RUTH@GMAIL.COM,Not captured,701937141,,Not captured,Not captured,Not captured,Not captured,Not captured,Not captured,
Not captured,Not captured,06/20/2019,Not captured,Not captured,863949,020,00072,ARS-02-0050890,Beacon America,Not captured,Not captured,Not captured,,,,MARSAN,ALISON,,12/31/1952,female,Not captured,Not captured,Not captured,Not captured,Not captured,Not captured,Not captured,Not captured,Not captured,Not captured,Not captured,Not captured,Not captured,,,Not captured,Not captured,Not captured,Not captured,UNIT 1 CASSIA HILL VILLAS,,PETIT VALLEY,PETIT VALLEY,0000,1-868-369-0876,,Not captured,Not captured,alisonmarsan@gmail.com,Not captured,701937140,,Not captured,Not captured,Not captured,Not captured,Not captured,Not captured,
Not captured,Not captured,06/20/2019,Not captured,Not captured,863949,020,00072,ARS-02-0050889,Beacon America,Not captured,Not captured,Not captured,,,,MARSAN,DOUGLAS,,12/17/1949,male,Not captured,Not captured,Not captured,Not captured,Not captured,Not captured,Not captured,Not captured,Not captured,Not captured,Not captured,Not captured,Not captured,,,Not captured,Not captured,Not captured,Not captured,UNIT 1 CASSIA HILL VILLAS,,PETIT VALLEY,PETIT VALLEY,0000,1-868-369-0876,,Not captured,Not captured,alisonmarsan@gmail.com,Not captured,701937139,,Not captured,Not captured,Not captured,Not captured,Not captured,Not captured,
Not captured,Not captured,06/18/2019,Not captured,Not captured,863949,020,00072,ARS-02-0050888,Beacon America,Not captured,Not captured,Not captured,Passport(SC2267809),,,Baez,Ruth,C,01/10/1973,female,Not captured,Not captured,Not captured,Not captured,Not captured,Not captured,Not captured,Not captured,Not captured,Not captured,Not captured,Not captured,Not captured,NURYS SUBERO DE BAEZ,MOTHER,Not captured,Not captured,Not captured,Not captured,,,,,,,,Not captured,Not captured,BAEZ.RUTH@GMAIL.COM,Not captured,701937138,,Not captured,Not captured,Not captured,Not captured,Not captured,Not captured,
Not captured,Not captured,06/18/2019,Not captured,Not captured,863949,020,00072,ARS-01-0050887,Beacon International,Not captured,Not captured,Not captured,,,,Horowitz,Esther,,03/12/1981,female,Not captured,Not captured,Not captured,Not captured,Not captured,Not captured,Not captured,Not captured,Not captured,Not captured,Not captured,Not captured,Not captured,,,Not captured,Not captured,Not captured,Not captured,119 Highgrove Crescent,,Lakewood,New Jersey,08701,,,Not captured,Not captured,estherhor@verizon.net,Not captured,701937137,,Not captured,Not captured,Not captured,Not captured,Not captured,Not captured,
Not captured,Not captured,06/18/2019,Not captured,Not captured,863949,020,00072,ARS-01-0050886,Beacon International,Not captured,Not captured,Not captured,,,,Horowitz,Mendy,,11/06/1980,male,Not captured,Not captured,Not captured,Not captured,Not captured,Not captured,Not captured,Not captured,Not captured,Not captured,Not captured,Not captured,Not captured,,,Not captured,Not captured,Not captured,Not captured,119 Highgrove Crescent,,Lakewood,New Jersey,08701,,,Not captured,Not captured,estherhor@verizon.net,Not captured,701937136,,Not captured,Not captured,Not captured,Not captured,Not captured,Not captured,
Not captured,Not captured,06/18/2019,Not captured,Not captured,863949,020,00072,ARS-01-0050884,Beacon International,Not captured,Not captured,Not captured,,,,RUSCHELAU,Susanne,M,07/21/1949,female,Not captured,Not captured,Not captured,Not captured,Not captured,Not captured,Not captured,Not captured,Not captured,Not captured,Not captured,Not captured,Not captured,,,Not captured,Not captured,Not captured,Not captured,49 Henfoot road,,Newton,New Jersey,07860,,,Not captured,Not captured,sruschelau@hotmail.com,Not captured,701937134,,Not captured,Not captured,Not captured,Not captured,Not captured,Not captured,
Not captured,Not captured,06/18/2019,Not captured,Not captured,863949,020,00072,ARS-01-0050883,Beacon International,Not captured,Not captured,Not captured,,,,Krause,Kenneth,C,09/17/1941,male,Not captured,Not captured,Not captured,Not captured,Not captured,Not captured,Not captured,Not captured,Not captured,Not captured,Not captured,Not captured,Not captured,,,Not captured,Not captured,Not captured,Not captured,49 Henfoot road,,Newton,New Jersey,07860,,,Not captured,Not captured,hopelaw01@yahoo.com,Not captured,701937133,,Not captured,Not captured,Not captured,Not captured,Not captured,Not captured,
Not captured,Not captured,06/18/2019,Not captured,Not captured,863949,020,00072,ARS-01-0050882,Beacon International,Not captured,Not captured,Not captured,,,,spang,Jared,,08/09/1995,male,Not captured,Not captured,Not captured,Not captured,Not captured,Not captured,Not captured,Not captured,Not captured,Not captured,Not captured,Not captured,Not captured,,,Not captured,Not captured,Not captured,Not captured,20190 argonaut drive,,saratoga,California,95070,,,Not captured,Not captured,cheryl.spang@comcast.net,Not captured,701937132,,Not captured,Not captured,Not captured,Not captured,Not captured,Not captured,