EE Transaction Type,Dependent Transaction Type,Effective Date,EE Signature,EE Signature Date,Control,Suffix,Account,Plan Number,Plan Name,Claim Office,Network ID Number,Customer Code,EE SSN,Dependent SSN,Dependent Relationship,Last Name,First Name,Middle Initial,DOB,Gender,Ethnicity,PCP/PCD,PCP/PCD Current Patient,Provider Cap Office Number,COB,Dep Student Indicator,Dep OOA Indicator,EE Prior Coverage Indicator,EE Late Entrant,EE Language Indicator,Hire Date,Earnings,Earnings Frequency,Beneficiary (Last Name First Name MI),Beneficiary Relationship,Continuation of Coverage Expiration Date,Continuation of Coverage Event Date,Continuation of Coverage Length of Coverage,Work Location Zip Code,Street Address Line 1,Street Address Line 2,City,State,Zip Code,Home Phone Number,Work Phone Number,Accept Code,Evidence Code,EE Email Address,Communication Disability Code,EE Alternate ID,Dep Alternate ID,Old Control,Old Suffix,Old Account,New Control,New Suffix,New Account,
Not captured,Not captured,06/17/2019,Not captured,Not captured,863949,020,00072,ARS-01-0050870,Beacon International,Not captured,Not captured,Not captured,,,,Brown,Darroch,C,03/30/1996,male,Not captured,Not captured,Not captured,Not captured,Not captured,Not captured,Not captured,Not captured,Not captured,Not captured,Not captured,Not captured,Not captured,,,Not captured,Not captured,Not captured,Not captured,47 Surrenden Road,,Brighton,,BN1 6PQ,,,Not captured,Not captured,darroch.brown@gmail.com,Not captured,701936999,,Not captured,Not captured,Not captured,Not captured,Not captured,Not captured,
Not captured,Not captured,06/17/2019,Not captured,Not captured,863949,020,00072,ARS-01-0050867,Beacon International,Not captured,Not captured,Not captured,,,,Camey,Jonah,A,03/11/2013,male,Not captured,Not captured,Not captured,Not captured,Not captured,Not captured,Not captured,Not captured,Not captured,Not captured,Not captured,Not captured,Not captured,,,Not captured,Not captured,Not captured,Not captured,813 Lancaster Dr,,Friendswood,Texas,77546,,,Not captured,Not captured,jacamey1@gmail.com,Not captured,701936996,,Not captured,Not captured,Not captured,Not captured,Not captured,Not captured,
Not captured,Not captured,06/17/2019,Not captured,Not captured,863949,020,00072,ARS-01-0050866,Beacon International,Not captured,Not captured,Not captured,,,,Camey,Lauren,,06/11/1983,female,Not captured,Not captured,Not captured,Not captured,Not captured,Not captured,Not captured,Not captured,Not captured,Not captured,Not captured,Not captured,Not captured,,,Not captured,Not captured,Not captured,Not captured,813 Lancaster Dr,,Friendswood,Texas,77546,,,Not captured,Not captured,jacamey1@gmail.com,Not captured,701936995,,Not captured,Not captured,Not captured,Not captured,Not captured,Not captured,
Not captured,Not captured,06/17/2019,Not captured,Not captured,863949,020,00072,ARS-01-0050865,Beacon International,Not captured,Not captured,Not captured,,,,Camey,Jonathan,,12/18/1983,male,Not captured,Not captured,Not captured,Not captured,Not captured,Not captured,Not captured,Not captured,Not captured,Not captured,Not captured,Not captured,Not captured,,,Not captured,Not captured,Not captured,Not captured,813 Lancaster Dr,,Friendswood,Texas,77546,,,Not captured,Not captured,jacamey1@gmail.com,Not captured,701936994,,Not captured,Not captured,Not captured,Not captured,Not captured,Not captured,
Not captured,Not captured,06/17/2019,Not captured,Not captured,863949,020,00072,ARS-03-0050511,Essential America,Not captured,Not captured,Not captured,Passport(XDA386803),,,Hernandez,Armando,,06/09/1955,male,Not captured,Not captured,Not captured,Not captured,Not captured,Not captured,Not captured,Not captured,Not captured,Not captured,Not captured,Not captured,Not captured,,,Not captured,Not captured,Not captured,Not captured,Caya Bunita #8,,palm beach malnock,terra del sol,0000,17864502201,,Not captured,Not captured,armando.h@grupohelsan.com.ve,Not captured,701936105,,Not captured,Not captured,Not captured,Not captured,Not captured,Not captured,
Not captured,Not captured,06/17/2019,Not captured,Not captured,863949,020,00072,ARS-01-0050864,Beacon International,Not captured,Not captured,Not captured,,,,Muldoon,Kellen,J,10/14/1990,male,Not captured,Not captured,Not captured,Not captured,Not captured,Not captured,Not captured,Not captured,Not captured,Not captured,Not captured,Not captured,Not captured,,,Not captured,Not captured,Not captured,Not captured,11811 W Whitaker Ave,,Greenfield,Wisconsin,53228,,,Not captured,Not captured,kellen@am-ex.com,Not captured,701936993,,Not captured,Not captured,Not captured,Not captured,Not captured,Not captured,
Not captured,Not captured,06/17/2019,Not captured,Not captured,863949,020,00072,ARS-01-0050857,Beacon International,Not captured,Not captured,Not captured,,,,Burrow,Tonia,J,01/19/1982,female,Not captured,Not captured,Not captured,Not captured,Not captured,Not captured,Not captured,Not captured,Not captured,Not captured,Not captured,Not captured,Not captured,,,Not captured,Not captured,Not captured,Not captured,P.O. Box 634,,Girdwood,Alaska,99587,,,Not captured,Not captured,tonia.burrow@gmail.com,Not captured,701936986,,Not captured,Not captured,Not captured,Not captured,Not captured,Not captured,
Not captured,Not captured,06/17/2019,Not captured,Not captured,863949,020,00072,ARS-01-0050856,Beacon International,Not captured,Not captured,Not captured,,,,Williams,Patricia,D,02/10/1941,female,Not captured,Not captured,Not captured,Not captured,Not captured,Not captured,Not captured,Not captured,Not captured,Not captured,Not captured,Not captured,Not captured,,,Not captured,Not captured,Not captured,Not captured,9845 SW Ventura Ct,,Tigard,Oregon,97223,,,Not captured,Not captured,p_d_williams@yahoo.com,Not captured,701936985,,Not captured,Not captured,Not captured,Not captured,Not captured,Not captured,
Not captured,Not captured,06/17/2019,Not captured,Not captured,863949,020,00072,ARS-02-0050773,Beacon America,Not captured,Not captured,Not captured,,,,GAYLE,BARRINGTON,,05/12/1985,male,Not captured,Not captured,Not captured,Not captured,Not captured,Not captured,Not captured,Not captured,Not captured,Not captured,Not captured,Not captured,Not captured,,,Not captured,Not captured,Not captured,Not captured,2425 Wilson Blvd. Suite 350 Virginia V,,Arlington,Virginia,22201,7038415607,,Not captured,Not captured,mhernandez@ncsc.org,Not captured,701936792,,Not captured,Not captured,Not captured,Not captured,Not captured,Not captured,
Not captured,Not captured,06/17/2019,Not captured,Not captured,863949,020,00072,ARS-01-0050680,Beacon International,Not captured,Not captured,Not captured,,,,amstell,simon,m,11/29/1979,male,Not captured,Not captured,Not captured,Not captured,Not captured,Not captured,Not captured,Not captured,Not captured,Not captured,Not captured,Not captured,Not captured,,,Not captured,Not captured,Not captured,Not captured,Flat 3,,London,,NW3 5JY,,,Not captured,Not captured,iamsimonamstell@gmail.com,Not captured,701936578,,Not captured,Not captured,Not captured,Not captured,Not captured,Not captured,
Not captured,Not captured,06/17/2019,Not captured,Not captured,863949,020,00072,ARS-02-0050580,Beacon America,Not captured,Not captured,Not captured,,,,BOURNE,KELEANN,,01/28/1981,female,Not captured,Not captured,Not captured,Not captured,Not captured,Not captured,Not captured,Not captured,Not captured,Not captured,Not captured,Not captured,Not captured,,,Not captured,Not captured,Not captured,Not captured,2425 Wilson Blvd. Suite 350 Virginia V,,Arlington,Virginia,22201,7038415607,,Not captured,Not captured,mhernandez@ncsc.org,Not captured,701936296,,Not captured,Not captured,Not captured,Not captured,Not captured,Not captured,
Not captured,Not captured,06/17/2019,Not captured,Not captured,863949,020,00072,ARS-02-0050579,Beacon America,Not captured,Not captured,Not captured,,,,NORTON,CARLOS,,05/30/1972,male,Not captured,Not captured,Not captured,Not captured,Not captured,Not captured,Not captured,Not captured,Not captured,Not captured,Not captured,Not captured,Not captured,,,Not captured,Not captured,Not captured,Not captured,2425 Wilson Blvd. Suite 350 Virginia V,,Arlington,Virginia,22201,7038415607,,Not captured,Not captured,mhernandez@ncsc.org,Not captured,701936295,,Not captured,Not captured,Not captured,Not captured,Not captured,Not captured,
Not captured,Not captured,06/17/2019,Not captured,Not captured,863949,020,00072,ARS-02-0050578,Beacon America,Not captured,Not captured,Not captured,,,,SAKHAN,BRIAN,,07/31/1987,male,Not captured,Not captured,Not captured,Not captured,Not captured,Not captured,Not captured,Not captured,Not captured,Not captured,Not captured,Not captured,Not captured,,,Not captured,Not captured,Not captured,Not captured,2425 Wilson Blvd. Suite 350 Virginia Virginia,,Arlington,Virginia,22201,7038415607,,Not captured,Not captured,mhernandez@ncsc.org,Not captured,701936294,,Not captured,Not captured,Not captured,Not captured,Not captured,Not captured,
Not captured,Not captured,06/17/2019,Not captured,Not captured,863949,020,00072,ARS-01-0050568,Beacon International,Not captured,Not captured,Not captured,,,,Kobrick,Madison,L,01/01/2019,female,Not captured,Not captured,Not captured,Not captured,Not captured,Not captured,Not captured,Not captured,Not captured,Not captured,Not captured,Not captured,Not captured,,,Not captured,Not captured,Not captured,Not captured,756 Tumblebrook Dr.,,Port Orange,Florida,32127,3217477752,,Not captured,Not captured,ryanxpc@gmail.com,Not captured,701936284,,Not captured,Not captured,Not captured,Not captured,Not captured,Not captured,
Not captured,Not captured,06/17/2019,Not captured,Not captured,863949,020,00072,ARS-01-0050567,Beacon International,Not captured,Not captured,Not captured,,,,Kobrick,Rafael,N,07/16/2015,male,Not captured,Not captured,Not captured,Not captured,Not captured,Not captured,Not captured,Not captured,Not captured,Not captured,Not captured,Not captured,Not captured,,,Not captured,Not captured,Not captured,Not captured,756 Tumblebrook Dr.,,Port Orange,Florida,32127,3217477752,,Not captured,Not captured,ryanxpc@gmail.com,Not captured,701936283,,Not captured,Not captured,Not captured,Not captured,Not captured,Not captured,
Not captured,Not captured,06/17/2019,Not captured,Not captured,863949,020,00072,ARS-01-0050566,Beacon International,Not captured,Not captured,Not captured,,,,Kobrick,Jennifer,L,06/25/1986,female,Not captured,Not captured,Not captured,Not captured,Not captured,Not captured,Not captured,Not captured,Not captured,Not captured,Not captured,Not captured,Not captured,,,Not captured,Not captured,Not captured,Not captured,756 Tumblebrook Dr.,,Port Orange,Florida,32127,3217477752,,Not captured,Not captured,ryanxpc@gmail.com,Not captured,701936282,,Not captured,Not captured,Not captured,Not captured,Not captured,Not captured,
Not captured,Not captured,06/17/2019,Not captured,Not captured,863949,020,00072,ARS-01-0050565,Beacon International,Not captured,Not captured,Not captured,,,,Kobrick,Ryan,L,11/05/1979,male,Not captured,Not captured,Not captured,Not captured,Not captured,Not captured,Not captured,Not captured,Not captured,Not captured,Not captured,Not captured,Not captured,,,Not captured,Not captured,Not captured,Not captured,756 Tumblebrook Dr.,,Port Orange,Florida,32127,3217477752,,Not captured,Not captured,ryanxpc@gmail.com,Not captured,701936281,,Not captured,Not captured,Not captured,Not captured,Not captured,Not captured,
Not captured,Not captured,06/17/2019,Not captured,Not captured,863949,020,00072,ARS-01-0050028,Beacon International,Not captured,Not captured,Not captured,,,,Reeves,Sharon,,07/10/1950,female,Not captured,Not captured,Not captured,Not captured,Not captured,Not captured,Not captured,Not captured,Not captured,Not captured,Not captured,Not captured,Not captured,,,Not captured,Not captured,Not captured,Not captured,3030 Spruce Terrace,,Island Lake,Illinois,60042,847-310-2286,,Not captured,Not captured,ilauva@yahoo.com,Not captured,701934682,,Not captured,Not captured,Not captured,Not captured,Not captured,Not captured,
Not captured,Not captured,06/17/2019,Not captured,Not captured,863949,020,00072,ARS-01-0050027,Beacon International,Not captured,Not captured,Not captured,,,,Lauva,Ines,,05/04/1951,female,Not captured,Not captured,Not captured,Not captured,Not captured,Not captured,Not captured,Not captured,Not captured,Not captured,Not captured,Not captured,Not captured,,,Not captured,Not captured,Not captured,Not captured,3030 Spruce Terrace,,Island Lake,Illinois,60042,847-310-2286,,Not captured,Not captured,ilauva@yahoo.com,Not captured,701934681,,Not captured,Not captured,Not captured,Not captured,Not captured,Not captured,
Not captured,Not captured,07/21/2019,Not captured,Not captured,863949,020,00072,BG001030-23-d937db5a,International Assurance,Not captured,Not captured,Not captured,-,-,,KAPPER,LESLIE,D,04/22/1975,female,Not captured,Not captured,Not captured,Not captured,Not captured,Not captured,Not captured,Not captured,Not captured,Not captured,Not captured,Not captured,Not captured,,,Not captured,Not captured,Not captured,Not captured,2945 W. ASH AVE,,DECATUR,Illinois,62526,217-877-2300,,Not captured,Not captured,TLKAPPER@GMAIL.COM,Not captured,701937091,,Not captured,Not captured,Not captured,Not captured,Not captured,Not captured,
Not captured,Not captured,07/21/2019,Not captured,Not captured,863949,020,00072,BG001030-23-d937db5a,International Assurance,Not captured,Not captured,Not captured,-,-,,KAPPER,TED,A,09/19/1974,male,Not captured,Not captured,Not captured,Not captured,Not captured,Not captured,Not captured,Not captured,Not captured,Not captured,Not captured,Not captured,Not captured,,,Not captured,Not captured,Not captured,Not captured,2945 W. ASH AVE,,DECATUR,Illinois,62526,217-877-2300,,Not captured,Not captured,TLKAPPER@GMAIL.COM,Not captured,701937092,,Not captured,Not captured,Not captured,Not captured,Not captured,Not captured,
Not captured,Not captured,07/21/2019,Not captured,Not captured,863949,020,00072,BG001030-23-d937db5a,International Assurance,Not captured,Not captured,Not captured,-,-,,KAPPER,WYATT,A,12/11/2001,male,Not captured,Not captured,Not captured,Not captured,Not captured,Not captured,Not captured,Not captured,Not captured,Not captured,Not captured,Not captured,Not captured,,,Not captured,Not captured,Not captured,Not captured,2945 W. ASH AVE,,DECATUR,Illinois,62526,217-877-2300,,Not captured,Not captured,TLKAPPER@GMAIL.COM,Not captured,701937093,,Not captured,Not captured,Not captured,Not captured,Not captured,Not captured,
Not captured,Not captured,07/21/2019,Not captured,Not captured,863949,020,00072,BG001030-23-d937db5a,International Assurance,Not captured,Not captured,Not captured,-,-,,KAPPER,SALEM,K,03/25/2008,male,Not captured,Not captured,Not captured,Not captured,Not captured,Not captured,Not captured,Not captured,Not captured,Not captured,Not captured,Not captured,Not captured,,,Not captured,Not captured,Not captured,Not captured,2945 W. ASH AVE,,DECATUR,Illinois,62526,217-877-2300,,Not captured,Not captured,TLKAPPER@GMAIL.COM,Not captured,701937094,,Not captured,Not captured,Not captured,Not captured,Not captured,Not captured,
Not captured,Not captured,07/21/2019,Not captured,Not captured,863949,020,00072,BG001030-23-d937db5a,International Assurance,Not captured,Not captured,Not captured,-,-,,BIRD,TAYLOR,A,01/25/1991,female,Not captured,Not captured,Not captured,Not captured,Not captured,Not captured,Not captured,Not captured,Not captured,Not captured,Not captured,Not captured,Not captured,,,Not captured,Not captured,Not captured,Not captured,2945 W. ASH AVE,,DECATUR,Illinois,62526,217-877-2300,,Not captured,Not captured,TLKAPPER@GMAIL.COM,Not captured,701937095,,Not captured,Not captured,Not captured,Not captured,Not captured,Not captured,
Not captured,Not captured,07/21/2019,Not captured,Not captured,863949,020,00072,BG001030-23-d937db5a,International Assurance,Not captured,Not captured,Not captured,-,-,,CANADAY,SCOTT,A,07/06/1956,male,Not captured,Not captured,Not captured,Not captured,Not captured,Not captured,Not captured,Not captured,Not captured,Not captured,Not captured,Not captured,Not captured,,,Not captured,Not captured,Not captured,Not captured,2945 W. ASH AVE,,DECATUR,Illinois,62526,217-877-2300,,Not captured,Not captured,TLKAPPER@GMAIL.COM,Not captured,701937096,,Not captured,Not captured,Not captured,Not captured,Not captured,Not captured,
Not captured,Not captured,07/21/2019,Not captured,Not captured,863949,020,00072,BG001030-23-d937db5a,International Assurance,Not captured,Not captured,Not captured,-,-,,CANADAY,LEANNE,M,09/25/1956,female,Not captured,Not captured,Not captured,Not captured,Not captured,Not captured,Not captured,Not captured,Not captured,Not captured,Not captured,Not captured,Not captured,,,Not captured,Not captured,Not captured,Not captured,2945 W. ASH AVE,,DECATUR,Illinois,62526,217-877-2300,,Not captured,Not captured,TLKAPPER@GMAIL.COM,Not captured,701937097,,Not captured,Not captured,Not captured,Not captured,Not captured,Not captured,
Not captured,Not captured,07/21/2019,Not captured,Not captured,863949,020,00072,BG001030-23-d937db5a,International Assurance,Not captured,Not captured,Not captured,-,-,,CLARK,KELLY,J,09/13/1972,male,Not captured,Not captured,Not captured,Not captured,Not captured,Not captured,Not captured,Not captured,Not captured,Not captured,Not captured,Not captured,Not captured,,,Not captured,Not captured,Not captured,Not captured,2945 W. ASH AVE,,DECATUR,Illinois,62526,217-877-2300,,Not captured,Not captured,TLKAPPER@GMAIL.COM,Not captured,701937098,,Not captured,Not captured,Not captured,Not captured,Not captured,Not captured,
Not captured,Not captured,07/21/2019,Not captured,Not captured,863949,020,00072,BG001030-23-d937db5a,International Assurance,Not captured,Not captured,Not captured,-,-,,CLARK,ANGELA,M,03/03/1976,female,Not captured,Not captured,Not captured,Not captured,Not captured,Not captured,Not captured,Not captured,Not captured,Not captured,Not captured,Not captured,Not captured,,,Not captured,Not captured,Not captured,Not captured,2945 W. ASH AVE,,DECATUR,Illinois,62526,217-877-2300,,Not captured,Not captured,TLKAPPER@GMAIL.COM,Not captured,701937099,,Not captured,Not captured,Not captured,Not captured,Not captured,Not captured,
Not captured,Not captured,07/21/2019,Not captured,Not captured,863949,020,00072,BG001030-23-d937db5a,International Assurance,Not captured,Not captured,Not captured,-,-,,CLARK,KOLBY,J,10/27/1999,male,Not captured,Not captured,Not captured,Not captured,Not captured,Not captured,Not captured,Not captured,Not captured,Not captured,Not captured,Not captured,Not captured,,,Not captured,Not captured,Not captured,Not captured,2945 W. ASH AVE,,DECATUR,Illinois,62526,217-877-2300,,Not captured,Not captured,TLKAPPER@GMAIL.COM,Not captured,701937100,,Not captured,Not captured,Not captured,Not captured,Not captured,Not captured,
Not captured,Not captured,07/21/2019,Not captured,Not captured,863949,020,00072,BG001030-23-d937db5a,International Assurance,Not captured,Not captured,Not captured,-,-,,CLARK,KADEN,M,06/22/2001,male,Not captured,Not captured,Not captured,Not captured,Not captured,Not captured,Not captured,Not captured,Not captured,Not captured,Not captured,Not captured,Not captured,,,Not captured,Not captured,Not captured,Not captured,2945 W. ASH AVE,,DECATUR,Illinois,62526,217-877-2300,,Not captured,Not captured,TLKAPPER@GMAIL.COM,Not captured,701937101,,Not captured,Not captured,Not captured,Not captured,Not captured,Not captured,
Not captured,Not captured,07/21/2019,Not captured,Not captured,863949,020,00072,BG001030-23-d937db5a,International Assurance,Not captured,Not captured,Not captured,-,-,,CLARK,ASHLYN,R,04/25/2003,female,Not captured,Not captured,Not captured,Not captured,Not captured,Not captured,Not captured,Not captured,Not captured,Not captured,Not captured,Not captured,Not captured,,,Not captured,Not captured,Not captured,Not captured,2945 W. ASH AVE,,DECATUR,Illinois,62526,217-877-2300,,Not captured,Not captured,TLKAPPER@GMAIL.COM,Not captured,701937102,,Not captured,Not captured,Not captured,Not captured,Not captured,Not captured,
Not captured,Not captured,07/21/2019,Not captured,Not captured,863949,020,00072,BG001030-23-d937db5a,International Assurance,Not captured,Not captured,Not captured,-,-,,CLARK,KAMERON,R,02/21/2005,male,Not captured,Not captured,Not captured,Not captured,Not captured,Not captured,Not captured,Not captured,Not captured,Not captured,Not captured,Not captured,Not captured,,,Not captured,Not captured,Not captured,Not captured,2945 W. ASH AVE,,DECATUR,Illinois,62526,217-877-2300,,Not captured,Not captured,TLKAPPER@GMAIL.COM,Not captured,701937103,,Not captured,Not captured,Not captured,Not captured,Not captured,Not captured,
Not captured,Not captured,07/21/2019,Not captured,Not captured,863949,020,00072,BG001030-23-d937db5a,International Assurance,Not captured,Not captured,Not captured,-,-,,COLEMAN,JERMIAH,M,06/14/1987,male,Not captured,Not captured,Not captured,Not captured,Not captured,Not captured,Not captured,Not captured,Not captured,Not captured,Not captured,Not captured,Not captured,,,Not captured,Not captured,Not captured,Not captured,2945 W. ASH AVE,,DECATUR,Illinois,62526,217-877-2300,,Not captured,Not captured,TLKAPPER@GMAIL.COM,Not captured,701937104,,Not captured,Not captured,Not captured,Not captured,Not captured,Not captured,
Not captured,Not captured,07/21/2019,Not captured,Not captured,863949,020,00072,BG001030-23-d937db5a,International Assurance,Not captured,Not captured,Not captured,-,-,,COOPER,MARK,P,04/24/1978,male,Not captured,Not captured,Not captured,Not captured,Not captured,Not captured,Not captured,Not captured,Not captured,Not captured,Not captured,Not captured,Not captured,,,Not captured,Not captured,Not captured,Not captured,2945 W. ASH AVE,,DECATUR,Illinois,62526,217-877-2300,,Not captured,Not captured,TLKAPPER@GMAIL.COM,Not captured,701937105,,Not captured,Not captured,Not captured,Not captured,Not captured,Not captured,
Not captured,Not captured,07/21/2019,Not captured,Not captured,863949,020,00072,BG001030-23-d937db5a,International Assurance,Not captured,Not captured,Not captured,-,-,,COOPER,ELIJAH,B,04/15/2002,male,Not captured,Not captured,Not captured,Not captured,Not captured,Not captured,Not captured,Not captured,Not captured,Not captured,Not captured,Not captured,Not captured,,,Not captured,Not captured,Not captured,Not captured,2945 W. ASH AVE,,DECATUR,Illinois,62526,217-877-2300,,Not captured,Not captured,TLKAPPER@GMAIL.COM,Not captured,701937106,,Not captured,Not captured,Not captured,Not captured,Not captured,Not captured,
Not captured,Not captured,07/21/2019,Not captured,Not captured,863949,020,00072,BG001030-23-d937db5a,International Assurance,Not captured,Not captured,Not captured,-,-,,COOPER,ISABELLA,N,01/26/2005,female,Not captured,Not captured,Not captured,Not captured,Not captured,Not captured,Not captured,Not captured,Not captured,Not captured,Not captured,Not captured,Not captured,,,Not captured,Not captured,Not captured,Not captured,2945 W. ASH AVE,,DECATUR,Illinois,62526,217-877-2300,,Not captured,Not captured,TLKAPPER@GMAIL.COM,Not captured,701937107,,Not captured,Not captured,Not captured,Not captured,Not captured,Not captured,