EE Transaction Type,Dependent Transaction Type,Effective Date,EE Signature,EE Signature Date,Control,Suffix,Account,Plan Number,Plan Name,Claim Office,Network ID Number,Customer Code,EE SSN,Dependent SSN,Dependent Relationship,Last Name,First Name,Middle Initial,DOB,Gender,Ethnicity,PCP/PCD,PCP/PCD Current Patient,Provider Cap Office Number,COB,Dep Student Indicator,Dep OOA Indicator,EE Prior Coverage Indicator,EE Late Entrant,EE Language Indicator,Hire Date,Earnings,Earnings Frequency,Beneficiary (Last Name First Name MI),Beneficiary Relationship,Continuation of Coverage Expiration Date,Continuation of Coverage Event Date,Continuation of Coverage Length of Coverage,Work Location Zip Code,Street Address Line 1,Street Address Line 2,City,State,Zip Code,Home Phone Number,Work Phone Number,Accept Code,Evidence Code,EE Email Address,Communication Disability Code,EE Alternate ID,Dep Alternate ID,Old Control,Old Suffix,Old Account,New Control,New Suffix,New Account,
Not captured,Not captured,06/16/2019,Not captured,Not captured,863949,020,00072,ARS-01-0050855,Beacon International,Not captured,Not captured,Not captured,,,,Rausman,Tzvi,,03/30/1986,male,Not captured,Not captured,Not captured,Not captured,Not captured,Not captured,Not captured,Not captured,Not captured,Not captured,Not captured,Not captured,Not captured,,,Not captured,Not captured,Not captured,Not captured,61 Broadway Ave,,Lakewood,New Jersey,08701,732-998-3274,,Not captured,Not captured,amibleier@gmail.com,Not captured,701936965,,Not captured,Not captured,Not captured,Not captured,Not captured,Not captured,
Not captured,Not captured,06/16/2019,Not captured,Not captured,863949,020,00072,ARS-01-0050854,Beacon International,Not captured,Not captured,Not captured,,,,Bleier,Jeffrey ,,08/01/1998,male,Not captured,Not captured,Not captured,Not captured,Not captured,Not captured,Not captured,Not captured,Not captured,Not captured,Not captured,Not captured,Not captured,,,Not captured,Not captured,Not captured,Not captured,26 Stamford Hill RD,,Lakewood.,New Jersey,08701,732-998-3274,,Not captured,Not captured,amibleier@gmail.com,Not captured,701936964,,Not captured,Not captured,Not captured,Not captured,Not captured,Not captured,
Not captured,Not captured,06/16/2019,Not captured,Not captured,863949,020,00072,ARS-01-0050853,Beacon International,Not captured,Not captured,Not captured,,,,Belier,Jonathan,,07/08/1992,male,Not captured,Not captured,Not captured,Not captured,Not captured,Not captured,Not captured,Not captured,Not captured,Not captured,Not captured,Not captured,Not captured,,,Not captured,Not captured,Not captured,Not captured,20 Shayas Rd,,Lakewood,New Jersey,08701,732-998-3274,,Not captured,Not captured,shaindylowenger@gmail.com,Not captured,701936963,,Not captured,Not captured,Not captured,Not captured,Not captured,Not captured,
Not captured,Not captured,06/16/2019,Not captured,Not captured,863949,020,00072,ARS-01-0050852,Beacon International,Not captured,Not captured,Not captured,,,,Bleier,Andew ,,02/03/1991,male,Not captured,Not captured,Not captured,Not captured,Not captured,Not captured,Not captured,Not captured,Not captured,Not captured,Not captured,Not captured,Not captured,,,Not captured,Not captured,Not captured,Not captured,26 Stamford Hill RD,,Lakewood,New Jersey,08701,732-998-3274,,Not captured,Not captured,amibleier@gmail.com,Not captured,701936962,,Not captured,Not captured,Not captured,Not captured,Not captured,Not captured,
Not captured,Not captured,06/16/2019,Not captured,Not captured,863949,020,00072,ARS-01-0050851,Beacon International,Not captured,Not captured,Not captured,,,,Blier,Shimmi,,09/23/1995,male,Not captured,Not captured,Not captured,Not captured,Not captured,Not captured,Not captured,Not captured,Not captured,Not captured,Not captured,Not captured,Not captured,,,Not captured,Not captured,Not captured,Not captured,37 Cushman st,,Lakewood,New Jersey,08701,848-224-5962,,Not captured,Not captured,bleirshimmi@gmail.com,Not captured,701936961,,Not captured,Not captured,Not captured,Not captured,Not captured,Not captured,
Not captured,Not captured,06/16/2019,Not captured,Not captured,863949,020,00072,ARS-01-0050850,Beacon International,Not captured,Not captured,Not captured,,,,Spira,Simcha,,01/30/1990,male,Not captured,Not captured,Not captured,Not captured,Not captured,Not captured,Not captured,Not captured,Not captured,Not captured,Not captured,Not captured,Not captured,,,Not captured,Not captured,Not captured,Not captured,608 West Kennedy Blvd,,Lakewood,New Jersey,08701,718-7474054,,Not captured,Not captured,simchaspira2@gmail.com,Not captured,701936960,,Not captured,Not captured,Not captured,Not captured,Not captured,Not captured,
Not captured,Not captured,06/16/2019,Not captured,Not captured,863949,020,00072,ARS-01-0050847,Beacon International,Not captured,Not captured,Not captured,,,,Hershkovits,Chana M,,11/29/1973,female,Not captured,Not captured,Not captured,Not captured,Not captured,Not captured,Not captured,Not captured,Not captured,Not captured,Not captured,Not captured,Not captured,,,Not captured,Not captured,Not captured,Not captured,1432 52nd street,,Brooklyn,New York,11219,718-972-9425,,Not captured,Not captured,chanamindy@aol.com,Not captured,701936957,,Not captured,Not captured,Not captured,Not captured,Not captured,Not captured,
Not captured,Not captured,06/16/2019,Not captured,Not captured,863949,020,00072,ARS-01-0050846,Beacon International,Not captured,Not captured,Not captured,,,,Lowen,Aliza,T,08/13/2002,female,Not captured,Not captured,Not captured,Not captured,Not captured,Not captured,Not captured,Not captured,Not captured,Not captured,Not captured,Not captured,Not captured,,,Not captured,Not captured,Not captured,Not captured,1 Executive Drive,,Fort Lee,New Jersey,07024,,,Not captured,Not captured,ltl@lowen.net,Not captured,701936956,,Not captured,Not captured,Not captured,Not captured,Not captured,Not captured,
Not captured,Not captured,06/16/2019,Not captured,Not captured,863949,020,00072,ARS-01-0050845,Beacon International,Not captured,Not captured,Not captured,,,,Lopez,Victor,,05/03/1965,male,Not captured,Not captured,Not captured,Not captured,Not captured,Not captured,Not captured,Not captured,Not captured,Not captured,Not captured,Not captured,Not captured,,,Not captured,Not captured,Not captured,Not captured,11704 SW 129 COURT,,MIAMI,Florida,33186,,,Not captured,Not captured,miamiair.svc@gmail.com,Not captured,701936955,,Not captured,Not captured,Not captured,Not captured,Not captured,Not captured,
Not captured,Not captured,06/16/2019,Not captured,Not captured,863949,020,00072,ARS-01-0050844,Beacon International,Not captured,Not captured,Not captured,Passport(523418071),,,TRACHTENBERG,CHAYA ,I,01/28/2002,female,Not captured,Not captured,Not captured,Not captured,Not captured,Not captured,Not captured,Not captured,Not captured,Not captured,Not captured,Not captured,Not captured,Raquel Trachtenberg,Madre,Not captured,Not captured,Not captured,Not captured,7810 LAGO DEL MAR DR,,Boca Raton,Florida,33433,5619296691,,Not captured,Not captured,raquelt18@hotmail.com,Not captured,701936954,,Not captured,Not captured,Not captured,Not captured,Not captured,Not captured,
Not captured,Not captured,06/15/2019,Not captured,Not captured,863949,020,00072,OVI-28-0050843,OverseasCare Visitors Insurance Plan,Not captured,Not captured,Not captured,,,,Dei,Parbati,,02/10/1951,female,Not captured,Not captured,Not captured,Not captured,Not captured,Not captured,Not captured,Not captured,Not captured,Not captured,Not captured,Not captured,Not captured,Jyoti Swain,son,Not captured,Not captured,Not captured,Not captured,2128 Ipswich Ln,,Frisco,Texas,75036,8183719611,,Not captured,Not captured,rjyotiranjan@gmail.com,Not captured,701936953,,Not captured,Not captured,Not captured,Not captured,Not captured,Not captured,
Not captured,Not captured,06/15/2019,Not captured,Not captured,863949,020,00072,OVI-28-0050842,OverseasCare Visitors Insurance Plan,Not captured,Not captured,Not captured,,,,Swain,Rabindra,,11/20/1946,male,Not captured,Not captured,Not captured,Not captured,Not captured,Not captured,Not captured,Not captured,Not captured,Not captured,Not captured,Not captured,Not captured,Jyoti Swain,son,Not captured,Not captured,Not captured,Not captured,2128 Ipswich Ln,,Frisco,Texas,75036,8183719611,,Not captured,Not captured,rjyotiranjan@gmail.com,Not captured,701936952,,Not captured,Not captured,Not captured,Not captured,Not captured,Not captured,
Not captured,Not captured,06/15/2019,Not captured,Not captured,863949,020,00072,ARS-02-0050840,Beacon America,Not captured,Not captured,Not captured,,,,Miloslavsky,Galina,,05/09/1942,female,Not captured,Not captured,Not captured,Not captured,Not captured,Not captured,Not captured,Not captured,Not captured,Not captured,Not captured,Not captured,Not captured,,,Not captured,Not captured,Not captured,Not captured,125 pugsley Ave,,Richmond hill,Ontario,L4c8w5,,,Not captured,Not captured,lilfaintinggoat@yahoo.com,Not captured,701936950,,Not captured,Not captured,Not captured,Not captured,Not captured,Not captured,
Not captured,Not captured,06/15/2019,Not captured,Not captured,863949,020,00072,ARS-01-0050837,Beacon International,Not captured,Not captured,Not captured,,,,cagliostro,eva,r,11/15/1999,female,Not captured,Not captured,Not captured,Not captured,Not captured,Not captured,Not captured,Not captured,Not captured,Not captured,Not captured,Not captured,Not captured,,,Not captured,Not captured,Not captured,Not captured,4 oakledge road,,bronxville,New York,10708,,,Not captured,Not captured,squaremouth@tokenworks.com,Not captured,701936946,,Not captured,Not captured,Not captured,Not captured,Not captured,Not captured,
Not captured,Not captured,06/15/2019,Not captured,Not captured,863949,020,00072,ARS-01-0050835,Beacon International,Not captured,Not captured,Not captured,Passport(523962566),,,OFarrell,Christina,L,06/07/1998,female,Not captured,Not captured,Not captured,Not captured,Not captured,Not captured,Not captured,Not captured,Not captured,Not captured,Not captured,Not captured,Not captured,Niall OFarrell,Father,Not captured,Not captured,Not captured,Not captured,26104 Camden woods dr,,Fort mill,South Carolina,29707,8033893737,7046213070,Not captured,Not captured,Nialljj@gmail.com,Not captured,701936942,,Not captured,Not captured,Not captured,Not captured,Not captured,Not captured,
Not captured,Not captured,06/15/2019,Not captured,Not captured,863949,020,00072,ARS-01-0050834,Beacon International,Not captured,Not captured,Not captured,,,,BRACKMAN,LEVI,,03/17/1978,male,Not captured,Not captured,Not captured,Not captured,Not captured,Not captured,Not captured,Not captured,Not captured,Not captured,Not captured,Not captured,Not captured,,,Not captured,Not captured,Not captured,Not captured,10917 Depew Pl,,Broomfield,Colorado,80020,,,Not captured,Not captured,sheindybrackman@gmail.com,Not captured,701936941,,Not captured,Not captured,Not captured,Not captured,Not captured,Not captured,
Not captured,Not captured,06/15/2019,Not captured,Not captured,863949,020,00072,ARS-01-0050832,Beacon International,Not captured,Not captured,Not captured,,,,Torres,Elizabeth,,03/04/1998,female,Not captured,Not captured,Not captured,Not captured,Not captured,Not captured,Not captured,Not captured,Not captured,Not captured,Not captured,Not captured,Not captured,,,Not captured,Not captured,Not captured,Not captured,10503 Riverside Drive,,Toluca Lake,California,91602,,,Not captured,Not captured,elizabethbroadway27@yahoo.com,Not captured,701936939,,Not captured,Not captured,Not captured,Not captured,Not captured,Not captured,
Not captured,Not captured,06/15/2019,Not captured,Not captured,863949,020,00072,ARS-02-0050831,Beacon America,Not captured,Not captured,Not captured,,,,ARAYA MORENO,JAVIERA,,02/28/1986,female,Not captured,Not captured,Not captured,Not captured,Not captured,Not captured,Not captured,Not captured,Not captured,Not captured,Not captured,Not captured,Not captured,,,Not captured,Not captured,Not captured,Not captured,7379 DE LORIMIER,,MONTREAL,Quebec,H2E2P2,,,Not captured,Not captured,javieraarayamoreno@gmail.com,Not captured,701936938,,Not captured,Not captured,Not captured,Not captured,Not captured,Not captured,
Not captured,Not captured,06/15/2019,Not captured,Not captured,863949,020,00072,ARS-01-0050829,Beacon International,Not captured,Not captured,Not captured,,,,Bernini da Costa,Katia,,05/08/1983,female,Not captured,Not captured,Not captured,Not captured,Not captured,Not captured,Not captured,Not captured,Not captured,Not captured,Not captured,Not captured,Not captured,,,Not captured,Not captured,Not captured,Not captured,511 47th Avenue,,Long Island City,New York,11101,,,Not captured,Not captured,katiabernini@gmail.com,Not captured,701936936,,Not captured,Not captured,Not captured,Not captured,Not captured,Not captured,
Not captured,Not captured,06/15/2019,Not captured,Not captured,863949,020,00072,ARS-01-0050828,Beacon International,Not captured,Not captured,Not captured,,,,Raskin,Artem,,09/23/1991,male,Not captured,Not captured,Not captured,Not captured,Not captured,Not captured,Not captured,Not captured,Not captured,Not captured,Not captured,Not captured,Not captured,,,Not captured,Not captured,Not captured,Not captured,1522 Parkmont Dr,,San Jose,California,95131,,,Not captured,Not captured,artem.raskin@gmail.com,Not captured,701936935,,Not captured,Not captured,Not captured,Not captured,Not captured,Not captured,
Not captured,Not captured,06/15/2019,Not captured,Not captured,863949,020,00072,ARS-01-0050827,Beacon International,Not captured,Not captured,Not captured,,,,Turner,Helen,C,02/04/1971,female,Not captured,Not captured,Not captured,Not captured,Not captured,Not captured,Not captured,Not captured,Not captured,Not captured,Not captured,Not captured,Not captured,,,Not captured,Not captured,Not captured,Not captured,1022 Prospect Street,,Honolulu,Hawaii,96822,,,Not captured,Not captured,astokes@hawaii.edu,Not captured,701936934,,Not captured,Not captured,Not captured,Not captured,Not captured,Not captured,
Not captured,Not captured,06/15/2019,Not captured,Not captured,863949,020,00072,ARS-01-0050826,Beacon International,Not captured,Not captured,Not captured,,,,Stokes,Alexander,J,05/06/1974,male,Not captured,Not captured,Not captured,Not captured,Not captured,Not captured,Not captured,Not captured,Not captured,Not captured,Not captured,Not captured,Not captured,,,Not captured,Not captured,Not captured,Not captured,1022 Prospect Street,,Honolulu,Hawaii,96822,,,Not captured,Not captured,astokes@hawaii.edu,Not captured,701936933,,Not captured,Not captured,Not captured,Not captured,Not captured,Not captured,
Not captured,Not captured,06/14/2019,Not captured,Not captured,863949,020,00072,ARS-02-0050824,Beacon America,Not captured,Not captured,Not captured,Passport(E13532770),,,Lei,Guiying ,,10/04/1959,female,Not captured,Not captured,Not captured,Not captured,Not captured,Not captured,Not captured,Not captured,Not captured,Not captured,Not captured,Not captured,Not captured,Wenjing Liao,daughter,Not captured,Not captured,Not captured,Not captured,401 17TH STREET NW,,ATLANTA,GEORGIA,30363,5302198617,,Not captured,Not captured,wenjing.op@gmail.com,Not captured,701936929,,Not captured,Not captured,Not captured,Not captured,Not captured,Not captured,
Not captured,Not captured,06/14/2019,Not captured,Not captured,863949,020,00072,ARS-02-0050823,Beacon America,Not captured,Not captured,Not captured,,,,Keate,Linda,,02/08/1990,female,Not captured,Not captured,Not captured,Not captured,Not captured,Not captured,Not captured,Not captured,Not captured,Not captured,Not captured,Not captured,Not captured,,,Not captured,Not captured,Not captured,Not captured,1252 N 2600 E,,Enterprise,Utah,84725,,,Not captured,Not captured,klinda@mailcenter.us,Not captured,701936928,,Not captured,Not captured,Not captured,Not captured,Not captured,Not captured,
Not captured,Not captured,06/14/2019,Not captured,Not captured,863949,020,00072,ARS-02-0050822,Beacon America,Not captured,Not captured,Not captured,,,,Keate,Ranae,,02/17/1991,female,Not captured,Not captured,Not captured,Not captured,Not captured,Not captured,Not captured,Not captured,Not captured,Not captured,Not captured,Not captured,Not captured,,,Not captured,Not captured,Not captured,Not captured,1252 N 2600 E,,Enterprise,Utah,84725,,,Not captured,Not captured,klinda@mailcenter.us,Not captured,701936927,,Not captured,Not captured,Not captured,Not captured,Not captured,Not captured,
Not captured,Not captured,06/16/2019,Not captured,Not captured,863949,020,00072,ARS-01-0050821,Beacon International,Not captured,Not captured,Not captured,Passport(AAE799601),,,Pascua,Francisco Javier,,10/28/1966,male,Not captured,Not captured,Not captured,Not captured,Not captured,Not captured,Not captured,Not captured,Not captured,Not captured,Not captured,Not captured,Not captured,,,Not captured,Not captured,Not captured,Not captured,2425 WILSON BLVD,,Arlington,Virginia,22201,7038415641,,Not captured,Not captured,pamruthkumar@ncsc.org,Not captured,701936926,,Not captured,Not captured,Not captured,Not captured,Not captured,Not captured,
Not captured,Not captured,06/16/2019,Not captured,Not captured,863949,020,00072,ARS-01-0050820,Beacon International,Not captured,Not captured,Not captured,Passport(B01142157),,,Mendez Palomo,Miguel Antonio,,05/10/1966,male,Not captured,Not captured,Not captured,Not captured,Not captured,Not captured,Not captured,Not captured,Not captured,Not captured,Not captured,Not captured,Not captured,,,Not captured,Not captured,Not captured,Not captured,2425 Wilson Blvd,,Arlington,Virginia,22201,7038415641,,Not captured,Not captured,pamruthkumar@ncsc.org,Not captured,701936925,,Not captured,Not captured,Not captured,Not captured,Not captured,Not captured,
Not captured,Not captured,06/14/2019,Not captured,Not captured,863949,020,00072,ARS-01-0050819,Beacon International,Not captured,Not captured,Not captured,,,,Jejjala,Vishnumohan,,01/15/1975,male,Not captured,Not captured,Not captured,Not captured,Not captured,Not captured,Not captured,Not captured,Not captured,Not captured,Not captured,Not captured,Not captured,,,Not captured,Not captured,Not captured,Not captured,326 S 15th St APT 3F,,Philadelphia,Pennsylvania,19102,,,Not captured,Not captured,vjejjala@gmail.com,Not captured,701936924,,Not captured,Not captured,Not captured,Not captured,Not captured,Not captured,
Not captured,Not captured,06/16/2019,Not captured,Not captured,863949,020,00072,ARS-01-0050818,Beacon International,Not captured,Not captured,Not captured,,,,Goldberger,Blima,,01/03/1979,female,Not captured,Not captured,Not captured,Not captured,Not captured,Not captured,Not captured,Not captured,Not captured,Not captured,Not captured,Not captured,Not captured,,,Not captured,Not captured,Not captured,Not captured,116 Hadassah lane,,Lakewood,New Jersey,08701,732-330-2515,,Not captured,Not captured,yechezkelgoldberger1@gmail.com,Not captured,701936923,,Not captured,Not captured,Not captured,Not captured,Not captured,Not captured,
Not captured,Not captured,06/16/2019,Not captured,Not captured,863949,020,00072,ARS-01-0050817,Beacon International,Not captured,Not captured,Not captured,,,,Goldberger,Yecheskel,,01/01/1979,male,Not captured,Not captured,Not captured,Not captured,Not captured,Not captured,Not captured,Not captured,Not captured,Not captured,Not captured,Not captured,Not captured,,,Not captured,Not captured,Not captured,Not captured,116 Hadassah lane,,Lakewood,New Jersey,08701,732-330-2515,,Not captured,Not captured,yechezkelgoldberger1@gmail.com,Not captured,701936922,,Not captured,Not captured,Not captured,Not captured,Not captured,Not captured,
Not captured,Not captured,06/14/2019,Not captured,Not captured,863949,020,00072,ARS-01-0050816,Beacon International,Not captured,Not captured,Not captured,,,,Johnson,Kent,,08/25/1981,male,Not captured,Not captured,Not captured,Not captured,Not captured,Not captured,Not captured,Not captured,Not captured,Not captured,Not captured,Not captured,Not captured,,,Not captured,Not captured,Not captured,Not captured,4229 Wesley Hall Ln,,Decatur,Georgia,30035,,,Not captured,Not captured,kpurnellj@gmail.com,Not captured,701936920,,Not captured,Not captured,Not captured,Not captured,Not captured,Not captured,
Not captured,Not captured,06/14/2019,Not captured,Not captured,863949,020,00072,ARS-01-0050815,Beacon International,Not captured,Not captured,Not captured,,,,MacQuarrie,Kim,A,11/09/1956,male,Not captured,Not captured,Not captured,Not captured,Not captured,Not captured,Not captured,Not captured,Not captured,Not captured,Not captured,Not captured,Not captured,,,Not captured,Not captured,Not captured,Not captured,11900 Red Camellia Ave.,,Las Vegas,Nevada,89138,,,Not captured,Not captured,ciarambyrne@yahoo.com,Not captured,701936906,,Not captured,Not captured,Not captured,Not captured,Not captured,Not captured,
Not captured,Not captured,06/14/2019,Not captured,Not captured,863949,020,00072,ARS-01-0050814,Beacon International,Not captured,Not captured,Not captured,,,,byrne,ciara,m,10/08/1970,female,Not captured,Not captured,Not captured,Not captured,Not captured,Not captured,Not captured,Not captured,Not captured,Not captured,Not captured,Not captured,Not captured,,,Not captured,Not captured,Not captured,Not captured,11900 Red Camellia Ave.,,Las Vegas,Nevada,89138,,,Not captured,Not captured,ciarambyrne@yahoo.com,Not captured,701936905,,Not captured,Not captured,Not captured,Not captured,Not captured,Not captured,
Not captured,Not captured,06/14/2019,Not captured,Not captured,863949,020,00072,ARS-01-0050813,Beacon International,Not captured,Not captured,Not captured,,,,Wallace,Lydia,F,08/18/1966,female,Not captured,Not captured,Not captured,Not captured,Not captured,Not captured,Not captured,Not captured,Not captured,Not captured,Not captured,Not captured,Not captured,,,Not captured,Not captured,Not captured,Not captured,9808 Saigon,,El Paso,Texas,79925,,,Not captured,Not captured,lfwallaciii@gmail.com,Not captured,701936904,,Not captured,Not captured,Not captured,Not captured,Not captured,Not captured,
Not captured,Not captured,06/14/2019,Not captured,Not captured,863949,020,00072,ARS-01-0050812,Beacon International,Not captured,Not captured,Not captured,,,,Wallace,Leo,F,02/01/1963,male,Not captured,Not captured,Not captured,Not captured,Not captured,Not captured,Not captured,Not captured,Not captured,Not captured,Not captured,Not captured,Not captured,,,Not captured,Not captured,Not captured,Not captured,9808 Saigon,,El Paso,Texas,79925,,,Not captured,Not captured,lfwallaciii@gmail.com,Not captured,701936903,,Not captured,Not captured,Not captured,Not captured,Not captured,Not captured,
Not captured,Not captured,06/14/2019,Not captured,Not captured,863949,020,00072,OVI-28-0050811,OverseasCare Visitors Insurance Plan,Not captured,Not captured,Not captured,Passport(C887804),,,Cruz Fernandes,Maria Isabel,F,02/20/1995,female,Not captured,Not captured,Not captured,Not captured,Not captured,Not captured,Not captured,Not captured,Not captured,Not captured,Not captured,Not captured,Not captured,Maria Isabel Cruz Fernandes,Maria Cristina Cruz Fernandes,Not captured,Not captured,Not captured,Not captured,Rua da Correnteza n&ordm;28 3&ordm;esq,,Lisboa,Lisboa,1400,914736521,,Not captured,Not captured,isa.cruzfernandes@gmail.com,Not captured,701936873,,Not captured,Not captured,Not captured,Not captured,Not captured,Not captured,