EE Transaction Type,Dependent Transaction Type,Effective Date,EE Signature,EE Signature Date,Control,Suffix,Account,Plan Number,Plan Name,Claim Office,Network ID Number,Customer Code,EE SSN,Dependent SSN,Dependent Relationship,Last Name,First Name,Middle Initial,DOB,Gender,Ethnicity,PCP/PCD,PCP/PCD Current Patient,Provider Cap Office Number,COB,Dep Student Indicator,Dep OOA Indicator,EE Prior Coverage Indicator,EE Late Entrant,EE Language Indicator,Hire Date,Earnings,Earnings Frequency,Beneficiary (Last Name First Name MI),Beneficiary Relationship,Continuation of Coverage Expiration Date,Continuation of Coverage Event Date,Continuation of Coverage Length of Coverage,Work Location Zip Code,Street Address Line 1,Street Address Line 2,City,State,Zip Code,Home Phone Number,Work Phone Number,Accept Code,Evidence Code,EE Email Address,Communication Disability Code,EE Alternate ID,Dep Alternate ID,Old Control,Old Suffix,Old Account,New Control,New Suffix,New Account,
Not captured,Not captured,06/13/2019,Not captured,Not captured,863949,020,00072,ARS-01-0050809,Beacon International,Not captured,Not captured,Not captured,,,,Humphrey,Roberta,L,12/17/1950,female,Not captured,Not captured,Not captured,Not captured,Not captured,Not captured,Not captured,Not captured,Not captured,Not captured,Not captured,Not captured,Not captured,,,Not captured,Not captured,Not captured,Not captured,1327 Noxon rd,,Lagrangeville,New York,12540,,,Not captured,Not captured,bz4145@yahoo.com,Not captured,701936858,,Not captured,Not captured,Not captured,Not captured,Not captured,Not captured,
Not captured,Not captured,06/13/2019,Not captured,Not captured,863949,020,00072,ARS-01-0050808,Beacon International,Not captured,Not captured,Not captured,,,,Zetterberg,Robert,R,04/04/1955,male,Not captured,Not captured,Not captured,Not captured,Not captured,Not captured,Not captured,Not captured,Not captured,Not captured,Not captured,Not captured,Not captured,,,Not captured,Not captured,Not captured,Not captured,1327 Noxon rd,,Lagrangeville,New York,12540,,,Not captured,Not captured,bz4145@yahoo.com,Not captured,701936857,,Not captured,Not captured,Not captured,Not captured,Not captured,Not captured,
Not captured,Not captured,06/13/2019,Not captured,Not captured,863949,020,00072,ARS-01-0050807,Beacon International,Not captured,Not captured,Not captured,Passport(594973227),,,R,Savannah,Hardin,06/02/2001,female,Not captured,Not captured,Not captured,Not captured,Not captured,Not captured,Not captured,Not captured,Not captured,Not captured,Not captured,Not captured,Not captured,Steve Dumey,Granfather,Not captured,Not captured,Not captured,Not captured,9106 Pheasant Hill Drive,,Lakeland,Tennessee,38002,9012680229,,Not captured,Not captured,dumeys@bellsouth.net,Not captured,701936856,,Not captured,Not captured,Not captured,Not captured,Not captured,Not captured,
Not captured,Not captured,06/13/2019,Not captured,Not captured,863949,020,00072,ARS-01-0050806,Beacon International,Not captured,Not captured,Not captured,,,,Zadoo,Kiara,,06/10/2018,female,Not captured,Not captured,Not captured,Not captured,Not captured,Not captured,Not captured,Not captured,Not captured,Not captured,Not captured,Not captured,Not captured,,,Not captured,Not captured,Not captured,Not captured,2 2nd St,,Jersey City,New Jersey,07302,,,Not captured,Not captured,kapilzadoo84@gmail.com,Not captured,701936832,,Not captured,Not captured,Not captured,Not captured,Not captured,Not captured,
Not captured,Not captured,06/13/2019,Not captured,Not captured,863949,020,00072,ARS-01-0050805,Beacon International,Not captured,Not captured,Not captured,,,,Starnes,Michael,R,10/20/1952,male,Not captured,Not captured,Not captured,Not captured,Not captured,Not captured,Not captured,Not captured,Not captured,Not captured,Not captured,Not captured,Not captured,,,Not captured,Not captured,Not captured,Not captured,6580 Madison Street,,Bonners Ferry,Idaho,83805,,,Not captured,Not captured,rustynail56@frontier.com,Not captured,701936831,,Not captured,Not captured,Not captured,Not captured,Not captured,Not captured,
Not captured,Not captured,06/13/2019,Not captured,Not captured,863949,020,00072,ARS-01-0050804,Beacon International,Not captured,Not captured,Not captured,,,,Graham,Elizabeth,B,11/30/1958,male,Not captured,Not captured,Not captured,Not captured,Not captured,Not captured,Not captured,Not captured,Not captured,Not captured,Not captured,Not captured,Not captured,,,Not captured,Not captured,Not captured,Not captured,40 Atwill Road,,West Roxbury,Massachusetts,02132,,,Not captured,Not captured,gramom123@gmail.com,Not captured,701936826,,Not captured,Not captured,Not captured,Not captured,Not captured,Not captured,
Not captured,Not captured,06/13/2019,Not captured,Not captured,863949,020,00072,ARS-01-0050802,Beacon International,Not captured,Not captured,Not captured,,,,DeWitt,Tyler,,01/13/1982,male,Not captured,Not captured,Not captured,Not captured,Not captured,Not captured,Not captured,Not captured,Not captured,Not captured,Not captured,Not captured,Not captured,,,Not captured,Not captured,Not captured,Not captured,736 West 187th Street,,New York,New York,10033,,,Not captured,Not captured,tyler.a.dewitt@gmail.com,Not captured,701936824,,Not captured,Not captured,Not captured,Not captured,Not captured,Not captured,
Not captured,Not captured,06/13/2019,Not captured,Not captured,863949,020,00072,ARS-01-0050801,Beacon International,Not captured,Not captured,Not captured,,,,Oromendia,Ana,,05/14/1987,female,Not captured,Not captured,Not captured,Not captured,Not captured,Not captured,Not captured,Not captured,Not captured,Not captured,Not captured,Not captured,Not captured,,,Not captured,Not captured,Not captured,Not captured,736 West 187th Street,,New York,New York,10033,,,Not captured,Not captured,tyler.a.dewitt@gmail.com,Not captured,701936823,,Not captured,Not captured,Not captured,Not captured,Not captured,Not captured,
Not captured,Not captured,06/13/2019,Not captured,Not captured,863949,020,00072,ARS-01-0050800,Beacon International,Not captured,Not captured,Not captured,,,,Codd,Alan,G,11/29/1965,male,Not captured,Not captured,Not captured,Not captured,Not captured,Not captured,Not captured,Not captured,Not captured,Not captured,Not captured,Not captured,Not captured,,,Not captured,Not captured,Not captured,Not captured,175 Red Rock Way,,San Francisco,California,94131,,,Not captured,Not captured,alancodd@mac.com,Not captured,701936822,,Not captured,Not captured,Not captured,Not captured,Not captured,Not captured,
Not captured,Not captured,06/13/2019,Not captured,Not captured,863949,020,00072,ARS-01-0050799,Beacon International,Not captured,Not captured,Not captured,,,,Katzman,Zelda,R,08/03/1992,female,Not captured,Not captured,Not captured,Not captured,Not captured,Not captured,Not captured,Not captured,Not captured,Not captured,Not captured,Not captured,Not captured,,,Not captured,Not captured,Not captured,Not captured,790 Montgomery Street,,Brooklyn,New York,11213,,,Not captured,Not captured,zelrochelle@gmail.com,Not captured,701936821,,Not captured,Not captured,Not captured,Not captured,Not captured,Not captured,
Not captured,Not captured,06/13/2019,Not captured,Not captured,863949,020,00072,ARS-01-0050798,Beacon International,Not captured,Not captured,Not captured,,,,Coleman,Susan,,05/03/1955,female,Not captured,Not captured,Not captured,Not captured,Not captured,Not captured,Not captured,Not captured,Not captured,Not captured,Not captured,Not captured,Not captured,,,Not captured,Not captured,Not captured,Not captured,40 Travis Corners Road,,Garrison,New York,10524,,,Not captured,Not captured,scoleman100@gmail.com,Not captured,701936820,,Not captured,Not captured,Not captured,Not captured,Not captured,Not captured,
Not captured,Not captured,06/13/2019,Not captured,Not captured,863949,020,00072,ARS-01-0050797,Beacon International,Not captured,Not captured,Not captured,,,,Smalley,Gregory,,01/28/1982,male,Not captured,Not captured,Not captured,Not captured,Not captured,Not captured,Not captured,Not captured,Not captured,Not captured,Not captured,Not captured,Not captured,,,Not captured,Not captured,Not captured,Not captured,350 W 43rd #14B,,New York,New York,10036,,,Not captured,Not captured,gregsmalleyjr@gmail.com,Not captured,701936817,,Not captured,Not captured,Not captured,Not captured,Not captured,Not captured,
Not captured,Not captured,06/13/2019,Not captured,Not captured,863949,020,00072,ARS-01-0050796,Beacon International,Not captured,Not captured,Not captured,,,,Moore,Marianne,,01/28/1964,female,Not captured,Not captured,Not captured,Not captured,Not captured,Not captured,Not captured,Not captured,Not captured,Not captured,Not captured,Not captured,Not captured,,,Not captured,Not captured,Not captured,Not captured,Po box 61565,,Vancouver,Washington,98666,,,Not captured,Not captured,emmsellsre@yahoo.com,Not captured,701936816,,Not captured,Not captured,Not captured,Not captured,Not captured,Not captured,
Not captured,Not captured,06/13/2019,Not captured,Not captured,863949,020,00072,ARS-01-0050795,Beacon International,Not captured,Not captured,Not captured,,,,Eline,Maximilian,F,04/12/2004,male,Not captured,Not captured,Not captured,Not captured,Not captured,Not captured,Not captured,Not captured,Not captured,Not captured,Not captured,Not captured,Not captured,,,Not captured,Not captured,Not captured,Not captured,Po box 61565,,Vancouver,Washington,98666,,,Not captured,Not captured,emmsellsre@yahoo.com,Not captured,701936815,,Not captured,Not captured,Not captured,Not captured,Not captured,Not captured,
Not captured,Not captured,06/13/2019,Not captured,Not captured,863949,020,00072,ARS-02-0050789,Beacon America,Not captured,Not captured,Not captured,,,,EINSTADTER,ELYAHU,B,12/30/2004,male,Not captured,Not captured,Not captured,Not captured,Not captured,Not captured,Not captured,Not captured,Not captured,Not captured,Not captured,Not captured,Not captured,,,Not captured,Not captured,Not captured,Not captured,6935 WILDORTON,,MONTREAL,Quebec,H3F2M4,,,Not captured,Not captured,geinstadter@gmail.com,Not captured,701936808,,Not captured,Not captured,Not captured,Not captured,Not captured,Not captured,
Not captured,Not captured,06/13/2019,Not captured,Not captured,863949,020,00072,ARS-02-0050788,Beacon America,Not captured,Not captured,Not captured,,,,EINSTADTER,SHIMON,Y,07/02/1999,male,Not captured,Not captured,Not captured,Not captured,Not captured,Not captured,Not captured,Not captured,Not captured,Not captured,Not captured,Not captured,Not captured,,,Not captured,Not captured,Not captured,Not captured,999 RIDGE AVE,,LAKEWOOD,New Jersey,08701,,,Not captured,Not captured,geinstadter@gmail.com,Not captured,701936807,,Not captured,Not captured,Not captured,Not captured,Not captured,Not captured,
Not captured,Not captured,06/12/2019,Not captured,Not captured,863949,020,00072,OVI-28-0050786,OverseasCare Visitors Insurance Plan,Not captured,Not captured,Not captured,,,,Rabade,Rekha ,,06/11/1954,female,Not captured,Not captured,Not captured,Not captured,Not captured,Not captured,Not captured,Not captured,Not captured,Not captured,Not captured,Not captured,Not captured,Bhakti Adhyapak,Dausghter,Not captured,Not captured,Not captured,Not captured,2230 Longview Road,,Irving,Texas,75063,9728903580,,Not captured,Not captured,bhaktiadhyapak@gmail.com,Not captured,701936805,,Not captured,Not captured,Not captured,Not captured,Not captured,Not captured,
Not captured,Not captured,06/12/2019,Not captured,Not captured,863949,020,00072,OVI-28-0050785,OverseasCare Visitors Insurance Plan,Not captured,Not captured,Not captured,,,,Rabade,Moreshwar,,11/10/1947,male,Not captured,Not captured,Not captured,Not captured,Not captured,Not captured,Not captured,Not captured,Not captured,Not captured,Not captured,Not captured,Not captured,Bhakti Adhyapak,Dausghter,Not captured,Not captured,Not captured,Not captured,2230 Longview Road,,Irving,Texas,75063,9728903580,,Not captured,Not captured,bhaktiadhyapak@gmail.com,Not captured,701936804,,Not captured,Not captured,Not captured,Not captured,Not captured,Not captured,
Not captured,Not captured,06/12/2019,Not captured,Not captured,863949,020,00072,ARS-01-0050781,Beacon International,Not captured,Not captured,Not captured,,,,Ragone,Dana,,10/15/1989,female,Not captured,Not captured,Not captured,Not captured,Not captured,Not captured,Not captured,Not captured,Not captured,Not captured,Not captured,Not captured,Not captured,,,Not captured,Not captured,Not captured,Not captured,7741 S. Kit Carson Dr,,Centennial,Colorado,80122,,,Not captured,Not captured,cumechanic@gmail.com,Not captured,701936800,,Not captured,Not captured,Not captured,Not captured,Not captured,Not captured,
Not captured,Not captured,06/12/2019,Not captured,Not captured,863949,020,00072,ARS-01-0050780,Beacon International,Not captured,Not captured,Not captured,,,,Arangua,Paul,,02/09/1984,male,Not captured,Not captured,Not captured,Not captured,Not captured,Not captured,Not captured,Not captured,Not captured,Not captured,Not captured,Not captured,Not captured,,,Not captured,Not captured,Not captured,Not captured,7741 S. Kit Carson Dr,,Centennial,Colorado,80122,,,Not captured,Not captured,cumechanic@gmail.com,Not captured,701936799,,Not captured,Not captured,Not captured,Not captured,Not captured,Not captured,
Not captured,Not captured,06/12/2019,Not captured,Not captured,863949,020,00072,ARS-01-0050777,Beacon International,Not captured,Not captured,Not captured,,,,Rubinstein,Berish,,10/25/1974,male,Not captured,Not captured,Not captured,Not captured,Not captured,Not captured,Not captured,Not captured,Not captured,Not captured,Not captured,Not captured,Not captured,,,Not captured,Not captured,Not captured,Not captured,1482 Ocean Parkway,,Brooklyn,New York,11219,3472031073,,Not captured,Not captured,er460@aol.com,Not captured,701936796,,Not captured,Not captured,Not captured,Not captured,Not captured,Not captured,
Not captured,Not captured,06/12/2019,Not captured,Not captured,863949,020,00072,ARS-03-0050745,Essential America,Not captured,Not captured,Not captured,Passport(546456838),,,Butterworth,Nicholas,Guy,07/01/1978,male,Not captured,Not captured,Not captured,Not captured,Not captured,Not captured,Not captured,Not captured,Not captured,Not captured,Not captured,Not captured,Not captured,,,Not captured,Not captured,Not captured,Not captured,8 Kinnerton Place South,,London,England,SW1X 8EH,+44 771 775 3866,,Not captured,Not captured,nick@butterworth.co.uk,Not captured,701936712,,Not captured,Not captured,Not captured,Not captured,Not captured,Not captured,
Not captured,Not captured,06/12/2019,Not captured,Not captured,863949,020,00072,ARS-01-0050774,Beacon International,Not captured,Not captured,Not captured,,,,Akda,Ann,,05/17/1965,female,Not captured,Not captured,Not captured,Not captured,Not captured,Not captured,Not captured,Not captured,Not captured,Not captured,Not captured,Not captured,Not captured,,,Not captured,Not captured,Not captured,Not captured,331 Laurel Ave,,Lakewood,New Jersey,08701,,,Not captured,Not captured,michaelakda@gmail.com,Not captured,701936793,,Not captured,Not captured,Not captured,Not captured,Not captured,Not captured,
Not captured,Not captured,06/12/2019,Not captured,Not captured,863949,020,00072,ARS-01-0050772,Beacon International,Not captured,Not captured,Not captured,,,,Rodriguez Villamil,Federico,,02/09/2006,male,Not captured,Not captured,Not captured,Not captured,Not captured,Not captured,Not captured,Not captured,Not captured,Not captured,Not captured,Not captured,Not captured,,,Not captured,Not captured,Not captured,Not captured,11370 NW 83rd Way,,Doral,Florida,33178,,,Not captured,Not captured,srvillamil@gmail.com,Not captured,701936791,,Not captured,Not captured,Not captured,Not captured,Not captured,Not captured,
Not captured,Not captured,06/12/2019,Not captured,Not captured,863949,020,00072,ARS-01-0050768,Beacon International,Not captured,Not captured,Not captured,,,,Bright,Michael,J,05/03/1961,male,Not captured,Not captured,Not captured,Not captured,Not captured,Not captured,Not captured,Not captured,Not captured,Not captured,Not captured,Not captured,Not captured,,,Not captured,Not captured,Not captured,Not captured,615 n. Kansas,,Burrton,Kansas,67020,,,Not captured,Not captured,brightmichael@live.com,Not captured,701936784,,Not captured,Not captured,Not captured,Not captured,Not captured,Not captured,
Not captured,Not captured,06/12/2019,Not captured,Not captured,863949,020,00072,ARS-01-0050767,Beacon International,Not captured,Not captured,Not captured,,,,Thiemann,DeAngela,S,09/29/1972,female,Not captured,Not captured,Not captured,Not captured,Not captured,Not captured,Not captured,Not captured,Not captured,Not captured,Not captured,Not captured,Not captured,,,Not captured,Not captured,Not captured,Not captured,615 n. Kansas,,Burrton,Kansas,67020,,,Not captured,Not captured,brightmichael@live.com,Not captured,701936783,,Not captured,Not captured,Not captured,Not captured,Not captured,Not captured,
Not captured,Not captured,06/13/2019,Not captured,Not captured,863949,020,00072,ARS-01-0050766,Beacon International,Not captured,Not captured,Not captured,,,,Buckley,Natthanya,,09/30/2001,female,Not captured,Not captured,Not captured,Not captured,Not captured,Not captured,Not captured,Not captured,Not captured,Not captured,Not captured,Not captured,Not captured,,,Not captured,Not captured,Not captured,Not captured,122 Towne Terrace,,Los Gatos,California,95032,,,Not captured,Not captured,janniebuckley@gmail.com,Not captured,701936782,,Not captured,Not captured,Not captured,Not captured,Not captured,Not captured,
Not captured,Not captured,06/12/2019,Not captured,Not captured,863949,020,00072,ARS-01-0050765,Beacon International,Not captured,Not captured,Not captured,,,,Buckley,Jerome,M,10/28/1955,male,Not captured,Not captured,Not captured,Not captured,Not captured,Not captured,Not captured,Not captured,Not captured,Not captured,Not captured,Not captured,Not captured,,,Not captured,Not captured,Not captured,Not captured,122 Towne Terrace,,Los Gatos,California,95032,,,Not captured,Not captured,webbrauzer@aol.com,Not captured,701936781,,Not captured,Not captured,Not captured,Not captured,Not captured,Not captured,
Not captured,Not captured,06/12/2019,Not captured,Not captured,863949,020,00072,ARS-01-0050764,Beacon International,Not captured,Not captured,Not captured,,,,Rosten,Chase,,04/03/1996,male,Not captured,Not captured,Not captured,Not captured,Not captured,Not captured,Not captured,Not captured,Not captured,Not captured,Not captured,Not captured,Not captured,,,Not captured,Not captured,Not captured,Not captured,718 Marigold Avenue,,Corona Del Mar,California,92625,,,Not captured,Not captured,db.rosten@gmail.com,Not captured,701936780,,Not captured,Not captured,Not captured,Not captured,Not captured,Not captured,
Not captured,Not captured,06/12/2019,Not captured,Not captured,863949,020,00072,ARS-01-0050763,Beacon International,Not captured,Not captured,Not captured,Passport(1q18865483),,,Kvick,Johan Valter,Emil,06/10/2019,male,Not captured,Not captured,Not captured,Not captured,Not captured,Not captured,Not captured,Not captured,Not captured,Not captured,Not captured,Not captured,Not captured,Doreen Kvick,Wife,Not captured,Not captured,Not captured,Not captured,407-2096 West 46th Ave,,Vancouver,British Columbia,V6M2KP,6047313495,,Not captured,Not captured,emildoreen@gmail.com,Not captured,701936779,,Not captured,Not captured,Not captured,Not captured,Not captured,Not captured,
Not captured,Not captured,06/12/2019,Not captured,Not captured,863949,020,00072,ARS-01-0050762,Beacon International,Not captured,Not captured,Not captured,,,,Lfil,Effie,J,10/13/2017,female,Not captured,Not captured,Not captured,Not captured,Not captured,Not captured,Not captured,Not captured,Not captured,Not captured,Not captured,Not captured,Not captured,,,Not captured,Not captured,Not captured,Not captured,4010 E Ironhorse Rd,,Gilbert,Arizona,85297,,,Not captured,Not captured,sjlfil@gmail.com,Not captured,701936759,,Not captured,Not captured,Not captured,Not captured,Not captured,Not captured,
Not captured,Not captured,06/12/2019,Not captured,Not captured,863949,020,00072,ARS-01-0050761,Beacon International,Not captured,Not captured,Not captured,,,,Lfil,Margaret,A,11/04/1989,female,Not captured,Not captured,Not captured,Not captured,Not captured,Not captured,Not captured,Not captured,Not captured,Not captured,Not captured,Not captured,Not captured,,,Not captured,Not captured,Not captured,Not captured,4010 E Ironhorse Rd,,Gilbert,Arizona,85297,,,Not captured,Not captured,sjlfil@gmail.com,Not captured,701936758,,Not captured,Not captured,Not captured,Not captured,Not captured,Not captured,
Not captured,Not captured,06/12/2019,Not captured,Not captured,863949,020,00072,ARS-01-0050760,Beacon International,Not captured,Not captured,Not captured,,,,Lfil,Said,J,04/17/1985,male,Not captured,Not captured,Not captured,Not captured,Not captured,Not captured,Not captured,Not captured,Not captured,Not captured,Not captured,Not captured,Not captured,,,Not captured,Not captured,Not captured,Not captured,4010 E Ironhorse Rd,,Gilbert,Arizona,85297,,,Not captured,Not captured,sjlfil@gmail.com,Not captured,701936757,,Not captured,Not captured,Not captured,Not captured,Not captured,Not captured,
Not captured,Not captured,06/13/2019,Not captured,Not captured,863949,020,00072,ARS-02-0050759,Beacon America,Not captured,Not captured,Not captured,Passport(531263239),,,Speegle,David,J,01/10/1963,male,Not captured,Not captured,Not captured,Not captured,Not captured,Not captured,Not captured,Not captured,Not captured,Not captured,Not captured,Not captured,Not captured,Cameron Speegle,Son,Not captured,Not captured,Not captured,Not captured,2408 DeSoto Drive,,Austin,Texas,78733,7132997543,,Not captured,Not captured,stevespeegle.pe@gmail.com,Not captured,701936756,,Not captured,Not captured,Not captured,Not captured,Not captured,Not captured,
Not captured,Not captured,06/13/2019,Not captured,Not captured,863949,020,00072,ARS-02-0050758,Beacon America,Not captured,Not captured,Not captured,Passport(571183430),,,Speegle,Charles,L,04/16/1938,male,Not captured,Not captured,Not captured,Not captured,Not captured,Not captured,Not captured,Not captured,Not captured,Not captured,Not captured,Not captured,Not captured,Jean Speegle,Spouse,Not captured,Not captured,Not captured,Not captured,3415 Pebble Bay Drive,,Katy,Texas,77450,7132997543,,Not captured,Not captured,stevespeegle.pe@gmail.com,Not captured,701936755,,Not captured,Not captured,Not captured,Not captured,Not captured,Not captured,
Not captured,Not captured,06/13/2019,Not captured,Not captured,863949,020,00072,ARS-02-0050757,Beacon America,Not captured,Not captured,Not captured,Passport(470604826),,,Speegle,Steven,C,04/17/1956,male,Not captured,Not captured,Not captured,Not captured,Not captured,Not captured,Not captured,Not captured,Not captured,Not captured,Not captured,Not captured,Not captured,Joni Diane Speegle,Spouse,Not captured,Not captured,Not captured,Not captured,3415 Pebble Bay Drive,,Katy,Texas,77450,7132997543,,Not captured,Not captured,stevespeegle.pe@gmail.com,Not captured,701936754,,Not captured,Not captured,Not captured,Not captured,Not captured,Not captured,
Not captured,Not captured,06/12/2019,Not captured,Not captured,863949,020,00072,ARS-02-0050756,Beacon America,Not captured,Not captured,Not captured,,,,Machnio,Patricia,E,07/11/1999,female,Not captured,Not captured,Not captured,Not captured,Not captured,Not captured,Not captured,Not captured,Not captured,Not captured,Not captured,Not captured,Not captured,,,Not captured,Not captured,Not captured,Not captured,444 Lana Terr,,Mississauga,Ontario,L5A 3B3,,,Not captured,Not captured,patriciam.11@hotmail.com,Not captured,701936753,,Not captured,Not captured,Not captured,Not captured,Not captured,Not captured,