EE Transaction Type,Dependent Transaction Type,Effective Date,EE Signature,EE Signature Date,Control,Suffix,Account,Plan Number,Plan Name,Claim Office,Network ID Number,Customer Code,EE SSN,Dependent SSN,Dependent Relationship,Last Name,First Name,Middle Initial,DOB,Gender,Ethnicity,PCP/PCD,PCP/PCD Current Patient,Provider Cap Office Number,COB,Dep Student Indicator,Dep OOA Indicator,EE Prior Coverage Indicator,EE Late Entrant,EE Language Indicator,Hire Date,Earnings,Earnings Frequency,Beneficiary (Last Name First Name MI),Beneficiary Relationship,Continuation of Coverage Expiration Date,Continuation of Coverage Event Date,Continuation of Coverage Length of Coverage,Work Location Zip Code,Street Address Line 1,Street Address Line 2,City,State,Zip Code,Home Phone Number,Work Phone Number,Accept Code,Evidence Code,EE Email Address,Communication Disability Code,EE Alternate ID,Dep Alternate ID,Old Control,Old Suffix,Old Account,New Control,New Suffix,New Account,
Not captured,Not captured,06/11/2019,Not captured,Not captured,863949,020,00072,ARS-01-0050754,Beacon International,Not captured,Not captured,Not captured,,,,Brown,Joseph,,04/15/2001,male,Not captured,Not captured,Not captured,Not captured,Not captured,Not captured,Not captured,Not captured,Not captured,Not captured,Not captured,Not captured,Not captured,,,Not captured,Not captured,Not captured,Not captured,19 FRANKFURT RD,,MONROE,New York,10950,,,Not captured,Not captured,yoelbrown@gmail.com,Not captured,701936751,,Not captured,Not captured,Not captured,Not captured,Not captured,Not captured,
Not captured,Not captured,06/11/2019,Not captured,Not captured,863949,020,00072,ARS-01-0050753,Beacon International,Not captured,Not captured,Not captured,,,,BROWN,ESTHER,,08/23/1980,female,Not captured,Not captured,Not captured,Not captured,Not captured,Not captured,Not captured,Not captured,Not captured,Not captured,Not captured,Not captured,Not captured,,,Not captured,Not captured,Not captured,Not captured,19 FRANKFURT RD,,MONROE,New York,10950,,,Not captured,Not captured,yoelbrown@gmail.com,Not captured,701936750,,Not captured,Not captured,Not captured,Not captured,Not captured,Not captured,
Not captured,Not captured,06/11/2019,Not captured,Not captured,863949,020,00072,ARS-01-0050752,Beacon International,Not captured,Not captured,Not captured,,,,Brown,Joel,,04/27/1981,male,Not captured,Not captured,Not captured,Not captured,Not captured,Not captured,Not captured,Not captured,Not captured,Not captured,Not captured,Not captured,Not captured,,,Not captured,Not captured,Not captured,Not captured,19 FRANKFURT RD,,MONROE,New York,10950,,,Not captured,Not captured,yoelbrown@gmail.com,Not captured,701936749,,Not captured,Not captured,Not captured,Not captured,Not captured,Not captured,
Not captured,Not captured,06/11/2019,Not captured,Not captured,863949,020,00072,ARS-01-0050750,Beacon International,Not captured,Not captured,Not captured,,,,HO,VALERIE,H,11/24/1977,female,Not captured,Not captured,Not captured,Not captured,Not captured,Not captured,Not captured,Not captured,Not captured,Not captured,Not captured,Not captured,Not captured,,,Not captured,Not captured,Not captured,Not captured,32-14 55TH STREET APT 3,,WOODSIDE,New York,11377,,,Not captured,Not captured,VALHO9@YAHOO.CA,Not captured,701936747,,Not captured,Not captured,Not captured,Not captured,Not captured,Not captured,
Not captured,Not captured,06/11/2019,Not captured,Not captured,863949,020,00072,ARS-02-0050749,Beacon America,Not captured,Not captured,Not captured,,,,Eipe,Juliana,,05/14/1953,female,Not captured,Not captured,Not captured,Not captured,Not captured,Not captured,Not captured,Not captured,Not captured,Not captured,Not captured,Not captured,Not captured,,,Not captured,Not captured,Not captured,Not captured,764 2nd floor 14 cross 16th main,,Bangalore,,560076,,,Not captured,Not captured,ajit_5@yahoo.com,Not captured,701936746,,Not captured,Not captured,Not captured,Not captured,Not captured,Not captured,
Not captured,Not captured,06/11/2019,Not captured,Not captured,863949,020,00072,ARS-01-0050741,Beacon International,Not captured,Not captured,Not captured,,,,Stoerr de Queiroz,Katrin,,07/28/1969,female,Not captured,Not captured,Not captured,Not captured,Not captured,Not captured,Not captured,Not captured,Not captured,Not captured,Not captured,Not captured,Not captured,,,Not captured,Not captured,Not captured,Not captured,6795 SW 135th Street,,Miami,Florida,33156,,,Not captured,Not captured,kittyshab@comcast.net,Not captured,701936696,,Not captured,Not captured,Not captured,Not captured,Not captured,Not captured,
Not captured,Not captured,06/11/2019,Not captured,Not captured,863949,020,00072,ARS-01-0050734,Beacon International,Not captured,Not captured,Not captured,,,,Lundy,Eamon,,12/20/2017,male,Not captured,Not captured,Not captured,Not captured,Not captured,Not captured,Not captured,Not captured,Not captured,Not captured,Not captured,Not captured,Not captured,,,Not captured,Not captured,Not captured,Not captured,4922 Lodge Lake Dr,,Fulshear,Texas,77441,,,Not captured,Not captured,hilarysherry@gmail.com,Not captured,701936689,,Not captured,Not captured,Not captured,Not captured,Not captured,Not captured,
Not captured,Not captured,06/11/2019,Not captured,Not captured,863949,020,00072,ARS-01-0050733,Beacon International,Not captured,Not captured,Not captured,,,,Lundy,Aidan,,09/23/1981,male,Not captured,Not captured,Not captured,Not captured,Not captured,Not captured,Not captured,Not captured,Not captured,Not captured,Not captured,Not captured,Not captured,,,Not captured,Not captured,Not captured,Not captured,4922 Lodge Lake Dr,,Fulshear,Texas,77441,,,Not captured,Not captured,hilarysherry@gmail.com,Not captured,701936688,,Not captured,Not captured,Not captured,Not captured,Not captured,Not captured,
Not captured,Not captured,06/11/2019,Not captured,Not captured,863949,020,00072,ARS-01-0050732,Beacon International,Not captured,Not captured,Not captured,,,,Sherry,Hilary,,06/11/1982,female,Not captured,Not captured,Not captured,Not captured,Not captured,Not captured,Not captured,Not captured,Not captured,Not captured,Not captured,Not captured,Not captured,,,Not captured,Not captured,Not captured,Not captured,4922 Lodge Lake Dr,,Fulshear,Texas,77441,,,Not captured,Not captured,hilarysherry@gmail.com,Not captured,701936687,,Not captured,Not captured,Not captured,Not captured,Not captured,Not captured,
Not captured,Not captured,06/11/2019,Not captured,Not captured,863949,020,00072,ARS-01-0050725,Beacon International,Not captured,Not captured,Not captured,,,,Huff,Bonnie,,11/07/1994,female,Not captured,Not captured,Not captured,Not captured,Not captured,Not captured,Not captured,Not captured,Not captured,Not captured,Not captured,Not captured,Not captured,,,Not captured,Not captured,Not captured,Not captured,614 24th St,,Sacramento,California,95816,,,Not captured,Not captured,bonniehuff94@gmail.com,Not captured,701936680,,Not captured,Not captured,Not captured,Not captured,Not captured,Not captured,
Not captured,Not captured,06/11/2019,Not captured,Not captured,863949,020,00072,ARS-01-0050718,Beacon International,Not captured,Not captured,Not captured,,,,Pang,Adela,,02/22/1997,female,Not captured,Not captured,Not captured,Not captured,Not captured,Not captured,Not captured,Not captured,Not captured,Not captured,Not captured,Not captured,Not captured,,,Not captured,Not captured,Not captured,Not captured,7019 Blakemore Ln.,,Dublin,Ohio,43016,,,Not captured,Not captured,panadela@gmail.com,Not captured,701936673,,Not captured,Not captured,Not captured,Not captured,Not captured,Not captured,
Not captured,Not captured,06/11/2019,Not captured,Not captured,863949,020,00072,ARS-02-0050717,Beacon America,Not captured,Not captured,Not captured,,,,Cross,Miriam,,02/28/1987,female,Not captured,Not captured,Not captured,Not captured,Not captured,Not captured,Not captured,Not captured,Not captured,Not captured,Not captured,Not captured,Not captured,,,Not captured,Not captured,Not captured,Not captured,2122 Massachusetts Ave NW,,Washington DC,Dist. of Columbia,20008,,,Not captured,Not captured,cross.miriam@gmail.com,Not captured,701936672,,Not captured,Not captured,Not captured,Not captured,Not captured,Not captured,
Not captured,Not captured,06/10/2019,Not captured,Not captured,863949,020,00072,ARS-01-0050715,Beacon International,Not captured,Not captured,Not captured,,,,Gilligan,Victoria,,12/23/1965,female,Not captured,Not captured,Not captured,Not captured,Not captured,Not captured,Not captured,Not captured,Not captured,Not captured,Not captured,Not captured,Not captured,,,Not captured,Not captured,Not captured,Not captured,933 Tyler Street,,Port Townsend,Washington,98368,,,Not captured,Not captured,victoriagilligan@gmail.com,Not captured,701936635,,Not captured,Not captured,Not captured,Not captured,Not captured,Not captured,
Not captured,Not captured,06/11/2019,Not captured,Not captured,863949,020,00072,ARS-01-0050714,Beacon International,Not captured,Not captured,Not captured,Passport(B01142157),,,Mendez Palomo,Miguel Antonio,,05/10/1966,male,Not captured,Not captured,Not captured,Not captured,Not captured,Not captured,Not captured,Not captured,Not captured,Not captured,Not captured,Not captured,Not captured,,,Not captured,Not captured,Not captured,Not captured,2425 Wilson Blvd,,Arlington,Virginia,22201,7038415641,,Not captured,Not captured,pamruthkumar@ncsc.org,Not captured,701936634,,Not captured,Not captured,Not captured,Not captured,Not captured,Not captured,
Not captured,Not captured,06/10/2019,Not captured,Not captured,863949,020,00072,ARS-01-0050689,Beacon International,Not captured,Not captured,Not captured,,,,Crnkovich,Tung,T,05/22/1964,female,Not captured,Not captured,Not captured,Not captured,Not captured,Not captured,Not captured,Not captured,Not captured,Not captured,Not captured,Not captured,Not captured,,,Not captured,Not captured,Not captured,Not captured,1882 Cass Lake Front,,Keego Harbor,Michigan,48320,,,Not captured,Not captured,mike@odlc.com,Not captured,701936587,,Not captured,Not captured,Not captured,Not captured,Not captured,Not captured,
Not captured,Not captured,06/10/2019,Not captured,Not captured,863949,020,00072,OVI-28-0050688,OverseasCare Visitors Insurance Plan,Not captured,Not captured,Not captured,,,,Girkar,Sushma Lavu,,06/20/1963,female,Not captured,Not captured,Not captured,Not captured,Not captured,Not captured,Not captured,Not captured,Not captured,Not captured,Not captured,Not captured,Not captured,sameer girkar,Son,Not captured,Not captured,Not captured,Not captured,1255 Vicente Dr ,,sunnyvale,California,94086,4704553781,,Not captured,Not captured,sam.girkar@gmail.com,Not captured,701936586,,Not captured,Not captured,Not captured,Not captured,Not captured,Not captured,
Not captured,Not captured,06/10/2019,Not captured,Not captured,863949,020,00072,OVI-28-0050687,OverseasCare Visitors Insurance Plan,Not captured,Not captured,Not captured,,,,Girkar,Lavu Sitaram,,06/01/1954,male,Not captured,Not captured,Not captured,Not captured,Not captured,Not captured,Not captured,Not captured,Not captured,Not captured,Not captured,Not captured,Not captured,sameer girkar,Son,Not captured,Not captured,Not captured,Not captured,1255 Vicente Dr ,,sunnyvale,California,94086,4704553781,,Not captured,Not captured,sam.girkar@gmail.com,Not captured,701936585,,Not captured,Not captured,Not captured,Not captured,Not captured,Not captured,
Not captured,Not captured,06/11/2019,Not captured,Not captured,863949,020,00072,ARS-01-0050684,Beacon International,Not captured,Not captured,Not captured,,,,Ruiz Puentes,Juan,C,06/17/1998,male,Not captured,Not captured,Not captured,Not captured,Not captured,Not captured,Not captured,Not captured,Not captured,Not captured,Not captured,Not captured,Not captured,Lucero Puentes Osorio,Mother,Not captured,Not captured,Not captured,Not captured,Calle 132A # 19 - 43,,Bogota,Distrito Capltal de Santa Fe de Bogot&atilde;,110111,7526950,,Not captured,Not captured,eduruiz.alonso@outlook.com,Not captured,701936582,,Not captured,Not captured,Not captured,Not captured,Not captured,Not captured,
Not captured,Not captured,06/11/2019,Not captured,Not captured,863949,020,00072,ARS-01-0050683,Beacon International,Not captured,Not captured,Not captured,,,,Ruiz Puentes,Paola,,06/27/1996,female,Not captured,Not captured,Not captured,Not captured,Not captured,Not captured,Not captured,Not captured,Not captured,Not captured,Not captured,Not captured,Not captured,Lucero Puentes Osorio,Mother,Not captured,Not captured,Not captured,Not captured,Calle 132A # 19 - 43,,Bogota,Distrito Capltal de Santa Fe de Bogot&atilde;,110111,7526950,,Not captured,Not captured,eduruiz.alonso@outlook.com,Not captured,701936581,,Not captured,Not captured,Not captured,Not captured,Not captured,Not captured,
Not captured,Not captured,06/11/2019,Not captured,Not captured,863949,020,00072,ARS-01-0050682,Beacon International,Not captured,Not captured,Not captured,Passport(AQ784371),,,Puentes Osorio,Lucero,,08/18/1962,female,Not captured,Not captured,Not captured,Not captured,Not captured,Not captured,Not captured,Not captured,Not captured,Not captured,Not captured,Not captured,Not captured,Lucero Puentes Osorio,Mother,Not captured,Not captured,Not captured,Not captured,Calle 132A # 19 - 43,,Bogota,Distrito Capltal de Santa Fe de Bogot&atilde;,110111,7526950,,Not captured,Not captured,eduruiz.alonso@outlook.com,Not captured,701936580,,Not captured,Not captured,Not captured,Not captured,Not captured,Not captured,
Not captured,Not captured,06/11/2019,Not captured,Not captured,863949,020,00072,OVI-28-0050681,OverseasCare Visitors Insurance Plan,Not captured,Not captured,Not captured,Passport(052960052),,,DUMITRIU,Lucia,,09/03/1938,female,Not captured,Not captured,Not captured,Not captured,Not captured,Not captured,Not captured,Not captured,Not captured,Not captured,Not captured,Not captured,Not captured,Lucia DUMITRIU,myself,Not captured,Not captured,Not captured,Not captured,1331 Brickell Bay Dr,,MIAMI,Florida,33131,7184065436,,Not captured,Not captured,ovidumitriu@gmail.com,Not captured,701936579,,Not captured,Not captured,Not captured,Not captured,Not captured,Not captured,
Not captured,Not captured,06/09/2019,Not captured,Not captured,863949,020,00072,ARS-01-0050678,Beacon International,Not captured,Not captured,Not captured,,,,Pirhonen,Pia,K,07/03/1965,female,Not captured,Not captured,Not captured,Not captured,Not captured,Not captured,Not captured,Not captured,Not captured,Not captured,Not captured,Not captured,Not captured,,,Not captured,Not captured,Not captured,Not captured,34 Hamiltonian drive,,Red Bank,New Jersey,07701,,,Not captured,Not captured,pirhonen_pia@hotmail.com,Not captured,701936576,,Not captured,Not captured,Not captured,Not captured,Not captured,Not captured,
Not captured,Not captured,06/09/2019,Not captured,Not captured,863949,020,00072,ARS-02-0050677,Beacon America,Not captured,Not captured,Not captured,Passport(94521399),,,Medina,German,,05/25/1978,male,Not captured,Not captured,Not captured,Not captured,Not captured,Not captured,Not captured,Not captured,Not captured,Not captured,Not captured,Not captured,Not captured,Hugo Medina,Brother,Not captured,Not captured,Not captured,Not captured,Calle 20 121-234,,Cali,Valle del Cauca,760032,573165225105,,Not captured,Not captured,admin@cnx.co,Not captured,701936575,,Not captured,Not captured,Not captured,Not captured,Not captured,Not captured,
Not captured,Not captured,06/09/2019,Not captured,Not captured,863949,020,00072,ARS-01-0050676,Beacon International,Not captured,Not captured,Not captured,,,,Prince,James,,11/07/1987,male,Not captured,Not captured,Not captured,Not captured,Not captured,Not captured,Not captured,Not captured,Not captured,Not captured,Not captured,Not captured,Not captured,,,Not captured,Not captured,Not captured,Not captured,180 Montague st,,Brooklyn,New York,11201,,,Not captured,Not captured,jcp2149@gmail.com,Not captured,701936574,,Not captured,Not captured,Not captured,Not captured,Not captured,Not captured,
Not captured,Not captured,06/09/2019,Not captured,Not captured,863949,020,00072,ARS-01-0050675,Beacon International,Not captured,Not captured,Not captured,,,,Wiener,Victoria,,01/07/1989,female,Not captured,Not captured,Not captured,Not captured,Not captured,Not captured,Not captured,Not captured,Not captured,Not captured,Not captured,Not captured,Not captured,,,Not captured,Not captured,Not captured,Not captured,180 Montague st,,Brooklyn,New York,11201,,,Not captured,Not captured,jcp2149@gmail.com,Not captured,701936573,,Not captured,Not captured,Not captured,Not captured,Not captured,Not captured,
Not captured,Not captured,06/09/2019,Not captured,Not captured,863949,020,00072,ARS-02-0050674,Beacon America,Not captured,Not captured,Not captured,,,,Wu,Shuchin,A,07/05/1961,female,Not captured,Not captured,Not captured,Not captured,Not captured,Not captured,Not captured,Not captured,Not captured,Not captured,Not captured,Not captured,Not captured,,,Not captured,Not captured,Not captured,Not captured,955 Nordic Avenue North,,Stillwater,Minnesota,55082,,,Not captured,Not captured,wuxxx819@gmail.com,Not captured,701936572,,Not captured,Not captured,Not captured,Not captured,Not captured,Not captured,
Not captured,Not captured,06/09/2019,Not captured,Not captured,863949,020,00072,ARS-02-0050673,Beacon America,Not captured,Not captured,Not captured,,,,Reid,Keva,E,06/16/1959,female,Not captured,Not captured,Not captured,Not captured,Not captured,Not captured,Not captured,Not captured,Not captured,Not captured,Not captured,Not captured,Not captured,,,Not captured,Not captured,Not captured,Not captured,10 Candover Street,,George Town,,KY1-1107,,,Not captured,Not captured,mcreid@candw.ky,Not captured,701936571,,Not captured,Not captured,Not captured,Not captured,Not captured,Not captured,
Not captured,Not captured,06/09/2019,Not captured,Not captured,863949,020,00072,ARS-01-0050671,Beacon International,Not captured,Not captured,Not captured,,,,tran,phuong,,03/01/1983,female,Not captured,Not captured,Not captured,Not captured,Not captured,Not captured,Not captured,Not captured,Not captured,Not captured,Not captured,Not captured,Not captured,,,Not captured,Not captured,Not captured,Not captured,stuart hayes,,dubai media city,,dubai,,,Not captured,Not captured,stuart@propertyfinder.ae,Not captured,701936569,,Not captured,Not captured,Not captured,Not captured,Not captured,Not captured,
Not captured,Not captured,06/09/2019,Not captured,Not captured,863949,020,00072,ARS-01-0050670,Beacon International,Not captured,Not captured,Not captured,,,,Crutchfield,Anthony,J,05/06/1981,male,Not captured,Not captured,Not captured,Not captured,Not captured,Not captured,Not captured,Not captured,Not captured,Not captured,Not captured,Not captured,Not captured,,,Not captured,Not captured,Not captured,Not captured,4750 C Street SE #202,,Washington,Dist. of Columbia,20019,,,Not captured,Not captured,ajcrutchfield81@gmail.com,Not captured,701936568,,Not captured,Not captured,Not captured,Not captured,Not captured,Not captured,
Not captured,Not captured,06/11/2019,Not captured,Not captured,863949,020,00072,OVI-28-0050669,OverseasCare Visitors Insurance Plan,Not captured,Not captured,Not captured,Passport(z4842255),,,nair,radhika hariprasad,,05/28/1993,female,Not captured,Not captured,Not captured,Not captured,Not captured,Not captured,Not captured,Not captured,Not captured,Not captured,Not captured,Not captured,Not captured,jay rajamohan,uncle,Not captured,Not captured,Not captured,Not captured,1520 calle constancia,,redlands,California,92373,8569799512,,Not captured,Not captured,jrajamoh@gmail.com,Not captured,701936567,,Not captured,Not captured,Not captured,Not captured,Not captured,Not captured,
Not captured,Not captured,06/09/2019,Not captured,Not captured,863949,020,00072,ARS-01-0050653,Beacon International,Not captured,Not captured,Not captured,Passport(B004188),,,Sealy Burke,Jacqueline ,,11/02/1965,female,Not captured,Not captured,Not captured,Not captured,Not captured,Not captured,Not captured,Not captured,Not captured,Not captured,Not captured,Not captured,Not captured,,,Not captured,Not captured,Not captured,Not captured,2425 Wilson Blvd,,Arlington,Virginia,22201,7038416901,,Not captured,Not captured,jsbatbsb@spiceisle.com,Not captured,701936535,,Not captured,Not captured,Not captured,Not captured,Not captured,Not captured,
Not captured,Not captured,06/10/2019,Not captured,Not captured,863949,020,00072,ARS-02-0050645,Beacon America,Not captured,Not captured,Not captured,Passport(E27549107),,,Xiao,Yuan,,08/22/1997,female,Not captured,Not captured,Not captured,Not captured,Not captured,Not captured,Not captured,Not captured,Not captured,Not captured,Not captured,Not captured,Not captured,Jesse David Wilson,other,Not captured,Not captured,Not captured,Not captured,709 Verdant Ln,,Maryville,Tennessee,37804,8659839852,,Not captured,Not captured,cen29529@centurytel.net,Not captured,701936406,,Not captured,Not captured,Not captured,Not captured,Not captured,Not captured,
Not captured,Not captured,06/10/2019,Not captured,Not captured,863949,020,00072,ARS-02-0050562,Beacon America,Not captured,Not captured,Not captured,Passport(138912578),,,Balestrini de Lamas,Atilia,,10/01/1945,female,Not captured,Not captured,Not captured,Not captured,Not captured,Not captured,Not captured,Not captured,Not captured,Not captured,Not captured,Not captured,Not captured,Yadzia Lamas,daughter,Not captured,Not captured,Not captured,Not captured,305 LEXINGTON AVE Apt 9C,,NEW YORK,New York,10016,2039700595,,Not captured,Not captured,atiliabalestrini@gmail.com,Not captured,701936278,,Not captured,Not captured,Not captured,Not captured,Not captured,Not captured,
Not captured,Not captured,06/09/2019,Not captured,Not captured,863949,020,00072,ARS-04-0050491,Enhanced America,Not captured,Not captured,Not captured,Passport(GA361564),,,Dunham,Craig,,07/10/1960,male,Not captured,Not captured,Not captured,Not captured,Not captured,Not captured,Not captured,Not captured,Not captured,Not captured,Not captured,Not captured,Not captured,,,Not captured,Not captured,Not captured,Not captured,1434 Binbrook Road,,Binbrook,Ontario,L0R 1C0,289-887-2378,,Not captured,Not captured,cdunham@crandun.com,Not captured,701936052,,Not captured,Not captured,Not captured,Not captured,Not captured,Not captured,
Not captured,Not captured,06/09/2019,Not captured,Not captured,863949,020,00072,ARS-02-0050520,Beacon America,Not captured,Not captured,Not captured,Passport(077437714),,,Guerrero,Gabriela,,01/11/1988,female,Not captured,Not captured,Not captured,Not captured,Not captured,Not captured,Not captured,Not captured,Not captured,Not captured,Not captured,Not captured,Not captured,Maritza Ayala V-5.100.919,Madre,Not captured,Not captured,Not captured,Not captured,Urb. Sta Ines. Residencia Villa Jard&iacute;n Apart 42 Piso 2,,San Cristobal,Tachira,5001,+582763416136,+582763571082,Not captured,Not captured,Gaby.gayala14@gmail.com,Not captured,701936171,,Not captured,Not captured,Not captured,Not captured,Not captured,Not captured,
Not captured,Not captured,06/10/2019,Not captured,Not captured,863949,020,00072,ARS-01-0050515,Beacon International,Not captured,Not captured,Not captured,,,,Doyle,Katherine,C,10/20/1967,female,Not captured,Not captured,Not captured,Not captured,Not captured,Not captured,Not captured,Not captured,Not captured,Not captured,Not captured,Not captured,Not captured,,,Not captured,Not captured,Not captured,Not captured,2730 N. Magnolia Ave,,Chicago,Illinois,60614,,,Not captured,Not captured,kmd60614@gmail.com,Not captured,701936166,,Not captured,Not captured,Not captured,Not captured,Not captured,Not captured,