EE Transaction Type,Dependent Transaction Type,Effective Date,EE Signature,EE Signature Date,Control,Suffix,Account,Plan Number,Plan Name,Claim Office,Network ID Number,Customer Code,EE SSN,Dependent SSN,Dependent Relationship,Last Name,First Name,Middle Initial,DOB,Gender,Ethnicity,PCP/PCD,PCP/PCD Current Patient,Provider Cap Office Number,COB,Dep Student Indicator,Dep OOA Indicator,EE Prior Coverage Indicator,EE Late Entrant,EE Language Indicator,Hire Date,Earnings,Earnings Frequency,Beneficiary (Last Name First Name MI),Beneficiary Relationship,Continuation of Coverage Expiration Date,Continuation of Coverage Event Date,Continuation of Coverage Length of Coverage,Work Location Zip Code,Street Address Line 1,Street Address Line 2,City,State,Zip Code,Home Phone Number,Work Phone Number,Accept Code,Evidence Code,EE Email Address,Communication Disability Code,EE Alternate ID,Dep Alternate ID,Old Control,Old Suffix,Old Account,New Control,New Suffix,New Account,
Not captured,Not captured,06/05/2019,Not captured,Not captured,863949,020,00072,ARS-01-0050559,Beacon International,Not captured,Not captured,Not captured,,,,Baradar,Alireza,A,08/12/1997,male,Not captured,Not captured,Not captured,Not captured,Not captured,Not captured,Not captured,Not captured,Not captured,Not captured,Not captured,Not captured,Not captured,,,Not captured,Not captured,Not captured,Not captured,PO Box 66015,,Vancouver,Washington,98666,,,Not captured,Not captured,newday8520@gmail.com,Not captured,701936272,,Not captured,Not captured,Not captured,Not captured,Not captured,Not captured,
Not captured,Not captured,06/05/2019,Not captured,Not captured,863949,020,00072,ARS-01-0050546,Beacon International,Not captured,Not captured,Not captured,,,,Kuikka,Juha,,10/30/1979,male,Not captured,Not captured,Not captured,Not captured,Not captured,Not captured,Not captured,Not captured,Not captured,Not captured,Not captured,Not captured,Not captured,,,Not captured,Not captured,Not captured,Not captured,505 Belmont Ave E,,Seattle,Washington,98102,,,Not captured,Not captured,juha.kuikka@gmail.com,Not captured,701936250,,Not captured,Not captured,Not captured,Not captured,Not captured,Not captured,
Not captured,Not captured,06/05/2019,Not captured,Not captured,863949,020,00072,ARS-02-0050545,Beacon America,Not captured,Not captured,Not captured,,,,Alharbi,Norah,,03/29/1964,female,Not captured,Not captured,Not captured,Not captured,Not captured,Not captured,Not captured,Not captured,Not captured,Not captured,Not captured,Not captured,Not captured,,,Not captured,Not captured,Not captured,Not captured,4000 presidential blvd,,Philadelphia,,19131,,,Not captured,Not captured,ifnona@hotmail.com,Not captured,701936246,,Not captured,Not captured,Not captured,Not captured,Not captured,Not captured,
Not captured,Not captured,06/05/2019,Not captured,Not captured,863949,020,00072,ARS-02-0050542,Beacon America,Not captured,Not captured,Not captured,,,,Britz,Janet,,08/08/1993,female,Not captured,Not captured,Not captured,Not captured,Not captured,Not captured,Not captured,Not captured,Not captured,Not captured,Not captured,Not captured,Not captured,,,Not captured,Not captured,Not captured,Not captured,2000 Lee Drive,,Denton,,76209,,,Not captured,Not captured,janetbritz08@gmail.com,Not captured,701936229,,Not captured,Not captured,Not captured,Not captured,Not captured,Not captured,
Not captured,Not captured,06/05/2019,Not captured,Not captured,863949,020,00072,ARS-01-0050539,Beacon International,Not captured,Not captured,Not captured,,,,McPhee,Bradley,,09/01/1958,male,Not captured,Not captured,Not captured,Not captured,Not captured,Not captured,Not captured,Not captured,Not captured,Not captured,Not captured,Not captured,Not captured,,,Not captured,Not captured,Not captured,Not captured,75 E Ashland St.,,Doylestown,Pennsylvania,18901,,,Not captured,Not captured,pattrealtor@gmail.com,Not captured,701936226,,Not captured,Not captured,Not captured,Not captured,Not captured,Not captured,
Not captured,Not captured,06/05/2019,Not captured,Not captured,863949,020,00072,ARS-01-0050538,Beacon International,Not captured,Not captured,Not captured,,,,Tagliolini,Patricia,,03/25/1961,female,Not captured,Not captured,Not captured,Not captured,Not captured,Not captured,Not captured,Not captured,Not captured,Not captured,Not captured,Not captured,Not captured,,,Not captured,Not captured,Not captured,Not captured,75 E Ashland St.,,Doylestown,Pennsylvania,18901,,,Not captured,Not captured,pattrealtor@gmail.com,Not captured,701936225,,Not captured,Not captured,Not captured,Not captured,Not captured,Not captured,
Not captured,Not captured,06/05/2019,Not captured,Not captured,863949,020,00072,ARS-01-0050535,Beacon International,Not captured,Not captured,Not captured,,,,Saberian,Hedeeyeh,,05/12/1999,female,Not captured,Not captured,Not captured,Not captured,Not captured,Not captured,Not captured,Not captured,Not captured,Not captured,Not captured,Not captured,Not captured,,,Not captured,Not captured,Not captured,Not captured,P.O. Box 66015,,Vancouver,Washington,98666,,,Not captured,Not captured,newday8520@gmail.com,Not captured,701936218,,Not captured,Not captured,Not captured,Not captured,Not captured,Not captured,
Not captured,Not captured,06/05/2019,Not captured,Not captured,863949,020,00072,ARS-01-0050531,Beacon International,Not captured,Not captured,Not captured,,,,Baradar,Marjan,,08/12/1997,male,Not captured,Not captured,Not captured,Not captured,Not captured,Not captured,Not captured,Not captured,Not captured,Not captured,Not captured,Not captured,Not captured,,,Not captured,Not captured,Not captured,Not captured,P.O. Box 66015,,Vancouver,Washington,98666,,,Not captured,Not captured,newday8520@gmail.com,Not captured,701936214,,Not captured,Not captured,Not captured,Not captured,Not captured,Not captured,
Not captured,Not captured,06/05/2019,Not captured,Not captured,863949,020,00072,ARS-01-0050526,Beacon International,Not captured,Not captured,Not captured,,,,Wanik,Danielle,L,10/15/1989,female,Not captured,Not captured,Not captured,Not captured,Not captured,Not captured,Not captured,Not captured,Not captured,Not captured,Not captured,Not captured,Not captured,,,Not captured,Not captured,Not captured,Not captured,48 Sunnyledge St,,new britain,Connecticut,06052,,,Not captured,Not captured,david.w.wanik@gmail.com,Not captured,701936177,,Not captured,Not captured,Not captured,Not captured,Not captured,Not captured,
Not captured,Not captured,06/05/2019,Not captured,Not captured,863949,020,00072,ARS-01-0050525,Beacon International,Not captured,Not captured,Not captured,,,,WANIK,DAVID,W,10/15/1989,male,Not captured,Not captured,Not captured,Not captured,Not captured,Not captured,Not captured,Not captured,Not captured,Not captured,Not captured,Not captured,Not captured,,,Not captured,Not captured,Not captured,Not captured,48 Sunnyledge St,,new britain,Connecticut,06052,,,Not captured,Not captured,david.w.wanik@gmail.com,Not captured,701936176,,Not captured,Not captured,Not captured,Not captured,Not captured,Not captured,
Not captured,Not captured,06/05/2019,Not captured,Not captured,863949,020,00072,ARS-01-0050523,Beacon International,Not captured,Not captured,Not captured,,,,Olague Estrella,Estrella,,12/25/1989,female,Not captured,Not captured,Not captured,Not captured,Not captured,Not captured,Not captured,Not captured,Not captured,Not captured,Not captured,Not captured,Not captured,,,Not captured,Not captured,Not captured,Not captured,6862585961,,Mexicali,,21395,,,Not captured,Not captured,licestrellaolague@gmail.com,Not captured,701936174,,Not captured,Not captured,Not captured,Not captured,Not captured,Not captured,
Not captured,Not captured,06/05/2019,Not captured,Not captured,863949,020,00072,ARS-01-0050522,Beacon International,Not captured,Not captured,Not captured,,,,Henrichs,Jennifer,B,02/12/1977,female,Not captured,Not captured,Not captured,Not captured,Not captured,Not captured,Not captured,Not captured,Not captured,Not captured,Not captured,Not captured,Not captured,,,Not captured,Not captured,Not captured,Not captured,2663 California Street,,San Francisco,California,94115,,,Not captured,Not captured,jhenrichs@gmail.com,Not captured,701936173,,Not captured,Not captured,Not captured,Not captured,Not captured,Not captured,
Not captured,Not captured,06/05/2019,Not captured,Not captured,863949,020,00072,ARS-01-0050521,Beacon International,Not captured,Not captured,Not captured,,,,Twersky,Malka,,06/28/1964,female,Not captured,Not captured,Not captured,Not captured,Not captured,Not captured,Not captured,Not captured,Not captured,Not captured,Not captured,Not captured,Not captured,,,Not captured,Not captured,Not captured,Not captured,74 Washington Ave.,,New Square,New York,10977,845-354-8755,,Not captured,Not captured,3621175@gmail.com,Not captured,701936172,,Not captured,Not captured,Not captured,Not captured,Not captured,Not captured,
Not captured,Not captured,06/05/2019,Not captured,Not captured,863949,020,00072,OVI-28-0050519,OverseasCare Visitors Insurance Plan,Not captured,Not captured,Not captured,Passport(R5298885),,,Gottipati,Aruna,,08/26/1959,female,Not captured,Not captured,Not captured,Not captured,Not captured,Not captured,Not captured,Not captured,Not captured,Not captured,Not captured,Not captured,Not captured,Prashanti Yarvaneni,Daughter,Not captured,Not captured,Not captured,Not captured,42907 Arcola Grove Dr,,Ashburn,Virginia,20148,5514821001,,Not captured,Not captured,gopal235@yahoo.com,Not captured,701936170,,Not captured,Not captured,Not captured,Not captured,Not captured,Not captured,
Not captured,Not captured,06/05/2019,Not captured,Not captured,863949,020,00072,OVI-28-0050518,OverseasCare Visitors Insurance Plan,Not captured,Not captured,Not captured,Passport(R5298885),,,Gottipati,Subba rao,,01/14/1955,male,Not captured,Not captured,Not captured,Not captured,Not captured,Not captured,Not captured,Not captured,Not captured,Not captured,Not captured,Not captured,Not captured,Prashanti Yarvaneni,Daughter,Not captured,Not captured,Not captured,Not captured,42907 Arcola Grove Dr,,Ashburn,Virginia,20148,5514821001,,Not captured,Not captured,gopal235@yahoo.com,Not captured,701936169,,Not captured,Not captured,Not captured,Not captured,Not captured,Not captured,
Not captured,Not captured,06/04/2019,Not captured,Not captured,863949,020,00072,ARS-01-0050512,Beacon International,Not captured,Not captured,Not captured,,,,Trudelle,Marie,,09/09/1992,female,Not captured,Not captured,Not captured,Not captured,Not captured,Not captured,Not captured,Not captured,Not captured,Not captured,Not captured,Not captured,Not captured,,,Not captured,Not captured,Not captured,Not captured,302 Portola Road,,Portola Valley,California,94028,,,Not captured,Not captured,sgtrudelle@yahoo.com,Not captured,701936127,,Not captured,Not captured,Not captured,Not captured,Not captured,Not captured,
Not captured,Not captured,06/04/2019,Not captured,Not captured,863949,020,00072,ARS-01-0050510,Beacon International,Not captured,Not captured,Not captured,,,,Espina,Dario,,01/01/1958,male,Not captured,Not captured,Not captured,Not captured,Not captured,Not captured,Not captured,Not captured,Not captured,Not captured,Not captured,Not captured,Not captured,,,Not captured,Not captured,Not captured,Not captured,4300 rogers ave # 20-511,,Fort Smith,Arkansas,72903,,,Not captured,Not captured,preventionpays@aol.com,Not captured,701936103,,Not captured,Not captured,Not captured,Not captured,Not captured,Not captured,
Not captured,Not captured,06/04/2019,Not captured,Not captured,863949,020,00072,ARS-01-0050508,Beacon International,Not captured,Not captured,Not captured,,,,Traine,Noa,,06/12/2012,female,Not captured,Not captured,Not captured,Not captured,Not captured,Not captured,Not captured,Not captured,Not captured,Not captured,Not captured,Not captured,Not captured,,,Not captured,Not captured,Not captured,Not captured,2170 NE 5th Ave.,,Boca Raton,Florida,33431,5615728447,,Not captured,Not captured,jerometraine@gmail.com,Not captured,701936099,,Not captured,Not captured,Not captured,Not captured,Not captured,Not captured,
Not captured,Not captured,06/04/2019,Not captured,Not captured,863949,020,00072,ARS-01-0050507,Beacon International,Not captured,Not captured,Not captured,,,,Tranie,Nathan,,02/28/2009,male,Not captured,Not captured,Not captured,Not captured,Not captured,Not captured,Not captured,Not captured,Not captured,Not captured,Not captured,Not captured,Not captured,,,Not captured,Not captured,Not captured,Not captured,2170 NE 5th Ave.,,Boca Raton,Florida,33431,5615728447,,Not captured,Not captured,jerometraine@gmail.com,Not captured,701936098,,Not captured,Not captured,Not captured,Not captured,Not captured,Not captured,
Not captured,Not captured,06/04/2019,Not captured,Not captured,863949,020,00072,ARS-01-0050506,Beacon International,Not captured,Not captured,Not captured,,,,Tranie,France Lise,,12/20/1977,female,Not captured,Not captured,Not captured,Not captured,Not captured,Not captured,Not captured,Not captured,Not captured,Not captured,Not captured,Not captured,Not captured,,,Not captured,Not captured,Not captured,Not captured,2170 NE 5th Ave.,,Boca Raton,Florida,33431,5615728447,,Not captured,Not captured,jerometraine@gmail.com,Not captured,701936097,,Not captured,Not captured,Not captured,Not captured,Not captured,Not captured,
Not captured,Not captured,06/04/2019,Not captured,Not captured,863949,020,00072,ARS-01-0050505,Beacon International,Not captured,Not captured,Not captured,,,,Mor,Leath ,,10/24/1975,female,Not captured,Not captured,Not captured,Not captured,Not captured,Not captured,Not captured,Not captured,Not captured,Not captured,Not captured,Not captured,Not captured,,,Not captured,Not captured,Not captured,Not captured,960 County Line Rd,,lakewood,New Jersey,08701,908-217-64111,,Not captured,Not captured,sharon@ediconstruction.net,Not captured,701936096,,Not captured,Not captured,Not captured,Not captured,Not captured,Not captured,
Not captured,Not captured,06/05/2019,Not captured,Not captured,863949,020,00072,ARS-01-0050500,Beacon International,Not captured,Not captured,Not captured,Passport(14CL28912),,,Roquette,Annie,M,05/04/1992,female,Not captured,Not captured,Not captured,Not captured,Not captured,Not captured,Not captured,Not captured,Not captured,Not captured,Not captured,Not captured,Not captured,Pierre Roquette,Pierre is my father,Not captured,Not captured,Not captured,Not captured,18 rue de la petite fontaine,,Saint Paul,Oise,60650,0344821762,0344821762,Not captured,Not captured,annie.roquette@gmail.com,Not captured,701936067,,Not captured,Not captured,Not captured,Not captured,Not captured,Not captured,
Not captured,Not captured,06/05/2019,Not captured,Not captured,863949,020,00072,ARS-01-0050499,Beacon International,Not captured,Not captured,Not captured,,,,Roquette,Annie,M,05/04/1992,female,Not captured,Not captured,Not captured,Not captured,Not captured,Not captured,Not captured,Not captured,Not captured,Not captured,Not captured,Not captured,Not captured,Pierre Roquette,Pierre is my father,Not captured,Not captured,Not captured,Not captured,18 rue de la petite fontaine,,Saint Paul,Oise,60650,0344821762,0344821762,Not captured,Not captured,annie.roquette@gmail.com,Not captured,701936066,,Not captured,Not captured,Not captured,Not captured,Not captured,Not captured,
Not captured,Not captured,06/04/2019,Not captured,Not captured,863949,020,00072,ARS-01-0050497,Beacon International,Not captured,Not captured,Not captured,Passport(642418314),,,Homsi,Soamar,,02/05/1981,male,Not captured,Not captured,Not captured,Not captured,Not captured,Not captured,Not captured,Not captured,Not captured,Not captured,Not captured,Not captured,Not captured,Juan Yang,Fiancee,Not captured,Not captured,Not captured,Not captured,1926 Ocean Shore Blvd,,Ormond Beach,Florida,32176,8139669139,,Not captured,Not captured,yvonneyang818@qq.com,Not captured,701936062,,Not captured,Not captured,Not captured,Not captured,Not captured,Not captured,
Not captured,Not captured,06/05/2019,Not captured,Not captured,863949,020,00072,ARS-01-0050487,Beacon International,Not captured,Not captured,Not captured,Passport(GA277268),,,Kvick,Doreen,E,05/27/1962,female,Not captured,Not captured,Not captured,Not captured,Not captured,Not captured,Not captured,Not captured,Not captured,Not captured,Not captured,Not captured,Not captured,Johan Valter Emil Kvick,Husband,Not captured,Not captured,Not captured,Not captured,407-2096 west 46th Ave,,Vancouver,British Columbia,V6M2K9,6047313495,,Not captured,Not captured,emildoreen@gmail.com,Not captured,701936047,,Not captured,Not captured,Not captured,Not captured,Not captured,Not captured,
Not captured,Not captured,06/03/2019,Not captured,Not captured,863949,020,00072,ARS-01-0050483,Beacon International,Not captured,Not captured,Not captured,,,,Reingold,Carol,F,07/17/1951,female,Not captured,Not captured,Not captured,Not captured,Not captured,Not captured,Not captured,Not captured,Not captured,Not captured,Not captured,Not captured,Not captured,,,Not captured,Not captured,Not captured,Not captured,719 Greenwich St Apt 4N,,New York,New York,10014,,,Not captured,Not captured,cflamm@pobox.com,Not captured,701935982,,Not captured,Not captured,Not captured,Not captured,Not captured,Not captured,
Not captured,Not captured,06/03/2019,Not captured,Not captured,863949,020,00072,ARS-01-0050482,Beacon International,Not captured,Not captured,Not captured,,,,Farrow,Nicholas,,05/13/1999,male,Not captured,Not captured,Not captured,Not captured,Not captured,Not captured,Not captured,Not captured,Not captured,Not captured,Not captured,Not captured,Not captured,,,Not captured,Not captured,Not captured,Not captured,12 Saxon Gardens,,Southend-on-Sea,,Ss3 9pu,,,Not captured,Not captured,nickpharrow@gmail.com,Not captured,701935981,,Not captured,Not captured,Not captured,Not captured,Not captured,Not captured,
Not captured,Not captured,06/03/2019,Not captured,Not captured,863949,020,00072,ARS-01-0050481,Beacon International,Not captured,Not captured,Not captured,,,,Turunen,Aapo,,03/04/2019,male,Not captured,Not captured,Not captured,Not captured,Not captured,Not captured,Not captured,Not captured,Not captured,Not captured,Not captured,Not captured,Not captured,,,Not captured,Not captured,Not captured,Not captured,350 Peaerl street,,Cambridge,Massachusetts,02139,,,Not captured,Not captured,heikki.tapio.turunen@gmail.com,Not captured,701935980,,Not captured,Not captured,Not captured,Not captured,Not captured,Not captured,
Not captured,Not captured,06/03/2019,Not captured,Not captured,863949,020,00072,ARS-01-0050480,Beacon International,Not captured,Not captured,Not captured,,,,Heebink,Kelsey,,06/06/1983,female,Not captured,Not captured,Not captured,Not captured,Not captured,Not captured,Not captured,Not captured,Not captured,Not captured,Not captured,Not captured,Not captured,,,Not captured,Not captured,Not captured,Not captured,350 Peaerl street,,Cambridge,Massachusetts,02139,,,Not captured,Not captured,heikki.tapio.turunen@gmail.com,Not captured,701935979,,Not captured,Not captured,Not captured,Not captured,Not captured,Not captured,
Not captured,Not captured,06/03/2019,Not captured,Not captured,863949,020,00072,ARS-01-0050479,Beacon International,Not captured,Not captured,Not captured,,,,Turunen,Heikki,,08/26/1979,male,Not captured,Not captured,Not captured,Not captured,Not captured,Not captured,Not captured,Not captured,Not captured,Not captured,Not captured,Not captured,Not captured,,,Not captured,Not captured,Not captured,Not captured,350 Peaerl street,,Cambridge,Massachusetts,02139,,,Not captured,Not captured,heikki.tapio.turunen@gmail.com,Not captured,701935978,,Not captured,Not captured,Not captured,Not captured,Not captured,Not captured,
Not captured,Not captured,06/03/2019,Not captured,Not captured,863949,020,00072,ARS-01-0050477,Beacon International,Not captured,Not captured,Not captured,,,,Becker,Chad,E,05/26/1997,male,Not captured,Not captured,Not captured,Not captured,Not captured,Not captured,Not captured,Not captured,Not captured,Not captured,Not captured,Not captured,Not captured,,,Not captured,Not captured,Not captured,Not captured,1241 Luanne Avenue,,Fullerton,California,92831,,,Not captured,Not captured,chadbeckerfullerton@gmail.com,Not captured,701935967,,Not captured,Not captured,Not captured,Not captured,Not captured,Not captured,
Not captured,Not captured,06/03/2019,Not captured,Not captured,863949,020,00072,ARS-02-0050476,Beacon America,Not captured,Not captured,Not captured,,,,Clough,Charlotte-Amalie,A,06/27/1985,female,Not captured,Not captured,Not captured,Not captured,Not captured,Not captured,Not captured,Not captured,Not captured,Not captured,Not captured,Not captured,Not captured,,,Not captured,Not captured,Not captured,Not captured,53 Raglan Lane,,Dublin,,D04 H6F9,,,Not captured,Not captured,bobalize@gmail.com,Not captured,701935966,,Not captured,Not captured,Not captured,Not captured,Not captured,Not captured,
Not captured,Not captured,06/03/2019,Not captured,Not captured,863949,020,00072,ARS-03-0050409,Essential International,Not captured,Not captured,Not captured,Passport(01280988),,,SUBAIH,EMILIA,RIDA,11/02/1993,female,Not captured,Not captured,Not captured,Not captured,Not captured,Not captured,Not captured,Not captured,Not captured,Not captured,Not captured,Not captured,Not captured,,,Not captured,Not captured,Not captured,Not captured,C/O NOVAIT SRL,,Tallinn,L&auml;&auml;ne County,10145 ,32069509,,Not captured,Not captured,emilia.r.subaih@gmail.com,Not captured,701935766,,Not captured,Not captured,Not captured,Not captured,Not captured,Not captured,
Not captured,Not captured,06/03/2019,Not captured,Not captured,863949,020,00072,ARS-03-0050409,Essential International,Not captured,Not captured,Not captured,,Passport(H2713752),Spouse,RAJAN,RIJINARJ,THOKALOTH ,12/28/1982,male,Not captured,Not captured,Not captured,Not captured,Not captured,Not captured,Not captured,Not captured,Not captured,Not captured,Not captured,Not captured,Not captured,,,Not captured,Not captured,Not captured,Not captured,C/O NOVAIT SRL,,Tallinn,L&auml;&auml;ne County,10145 ,32069509,,Not captured,Not captured,emilia.r.subaih@gmail.com,Not captured,,701935767,Not captured,Not captured,Not captured,Not captured,Not captured,Not captured,
Not captured,Not captured,06/03/2019,Not captured,Not captured,863949,020,00072,ARS-01-0050475,Beacon International,Not captured,Not captured,Not captured,,,,Fibiger,Piers,,11/21/1991,male,Not captured,Not captured,Not captured,Not captured,Not captured,Not captured,Not captured,Not captured,Not captured,Not captured,Not captured,Not captured,Not captured,,,Not captured,Not captured,Not captured,Not captured,6249 Elm Street,,Vancouver,British Columbia,V6n1b2,,,Not captured,Not captured,piersfibiger@gmail.com,Not captured,701935942,,Not captured,Not captured,Not captured,Not captured,Not captured,Not captured,
Not captured,Not captured,06/03/2019,Not captured,Not captured,863949,020,00072,ARS-01-0050474,Beacon International,Not captured,Not captured,Not captured,,,,Breunich,Willa bay,,02/22/2001,female,Not captured,Not captured,Not captured,Not captured,Not captured,Not captured,Not captured,Not captured,Not captured,Not captured,Not captured,Not captured,Not captured,,,Not captured,Not captured,Not captured,Not captured,3351 SE River Vista Dr,,Port Saint Lucie,Florida,34952,n/a,,Not captured,Not captured,dbollett4@gmail.com,Not captured,701935941,,Not captured,Not captured,Not captured,Not captured,Not captured,Not captured,