EE Transaction Type,Dependent Transaction Type,Effective Date,EE Signature,EE Signature Date,Control,Suffix,Account,Plan Number,Plan Name,Claim Office,Network ID Number,Customer Code,EE SSN,Dependent SSN,Dependent Relationship,Last Name,First Name,Middle Initial,DOB,Gender,Ethnicity,PCP/PCD,PCP/PCD Current Patient,Provider Cap Office Number,COB,Dep Student Indicator,Dep OOA Indicator,EE Prior Coverage Indicator,EE Late Entrant,EE Language Indicator,Hire Date,Earnings,Earnings Frequency,Beneficiary (Last Name First Name MI),Beneficiary Relationship,Continuation of Coverage Expiration Date,Continuation of Coverage Event Date,Continuation of Coverage Length of Coverage,Work Location Zip Code,Street Address Line 1,Street Address Line 2,City,State,Zip Code,Home Phone Number,Work Phone Number,Accept Code,Evidence Code,EE Email Address,Communication Disability Code,EE Alternate ID,Dep Alternate ID,Old Control,Old Suffix,Old Account,New Control,New Suffix,New Account,
Not captured,Not captured,06/07/2019,Not captured,Not captured,863949,020,00072,ARS-03-0050698,Essential International,Not captured,Not captured,Not captured,Passport(n/a),,,Benitez,Alex,Anibal,11/28/2013,male,Not captured,Not captured,Not captured,Not captured,Not captured,Not captured,Not captured,Not captured,Not captured,Not captured,Not captured,Not captured,Not captured,,,Not captured,Not captured,Not captured,Not captured,7 Calle 17-05 Condominio Vistas Del Naranjo,,Mexico,Guatemala,00000,+502-5715-9135,,Not captured,Not captured,missionguate@hotmail.com,Not captured,701936598,,Not captured,Not captured,Not captured,Not captured,Not captured,Not captured,
Not captured,Not captured,06/07/2019,Not captured,Not captured,863949,020,00072,ARS-02-0050655,Beacon America,Not captured,Not captured,Not captured,,,,Giang,The,,08/15/1942,male,Not captured,Not captured,Not captured,Not captured,Not captured,Not captured,Not captured,Not captured,Not captured,Not captured,Not captured,Not captured,Not captured,,,Not captured,Not captured,Not captured,Not captured,439-52 Ho Hoc Lam Street,,Ho Chi Mim City,,00000,,,Not captured,Not captured,alicelu@live.com,Not captured,701936537,,Not captured,Not captured,Not captured,Not captured,Not captured,Not captured,
Not captured,Not captured,06/07/2019,Not captured,Not captured,863949,020,00072,ARS-01-0050652,Beacon International,Not captured,Not captured,Not captured,,,,Brown,Ryan,B,09/24/1985,male,Not captured,Not captured,Not captured,Not captured,Not captured,Not captured,Not captured,Not captured,Not captured,Not captured,Not captured,Not captured,Not captured,,,Not captured,Not captured,Not captured,Not captured,476 Jefferson St.,,Brooklyn,New York,11237,,,Not captured,Not captured,nina.ibarra@gmail.com,Not captured,701936525,,Not captured,Not captured,Not captured,Not captured,Not captured,Not captured,
Not captured,Not captured,06/07/2019,Not captured,Not captured,863949,020,00072,ARS-01-0050651,Beacon International,Not captured,Not captured,Not captured,,,,Melendez Ibarra,Nina,N,12/24/1981,female,Not captured,Not captured,Not captured,Not captured,Not captured,Not captured,Not captured,Not captured,Not captured,Not captured,Not captured,Not captured,Not captured,,,Not captured,Not captured,Not captured,Not captured,476 Jefferson St.,,Brooklyn,New York,11237,,,Not captured,Not captured,nina.ibarra@gmail.com,Not captured,701936524,,Not captured,Not captured,Not captured,Not captured,Not captured,Not captured,
Not captured,Not captured,06/07/2019,Not captured,Not captured,863949,020,00072,ARS-01-0050647,Beacon International,Not captured,Not captured,Not captured,,,,Soto,David,,04/22/1989,male,Not captured,Not captured,Not captured,Not captured,Not captured,Not captured,Not captured,Not captured,Not captured,Not captured,Not captured,Not captured,Not captured,,,Not captured,Not captured,Not captured,Not captured,3526 Tealwater Court,,Katy,Texas,77449,,,Not captured,Not captured,davidjsoto2@gmail.com,Not captured,701936438,,Not captured,Not captured,Not captured,Not captured,Not captured,Not captured,
Not captured,Not captured,06/07/2019,Not captured,Not captured,863949,020,00072,ARS-01-0050644,Beacon International,Not captured,Not captured,Not captured,,,,Murungi,Judith,,08/08/1980,female,Not captured,Not captured,Not captured,Not captured,Not captured,Not captured,Not captured,Not captured,Not captured,Not captured,Not captured,Not captured,Not captured,,,Not captured,Not captured,Not captured,Not captured,Po Box 37446,,Kampala,,00,,,Not captured,Not captured,judithm@reconciledworld.org,Not captured,701936405,,Not captured,Not captured,Not captured,Not captured,Not captured,Not captured,
Not captured,Not captured,06/07/2019,Not captured,Not captured,863949,020,00072,ARS-01-0050643,Beacon International,Not captured,Not captured,Not captured,,,,Herman,Sandra,,03/04/1949,female,Not captured,Not captured,Not captured,Not captured,Not captured,Not captured,Not captured,Not captured,Not captured,Not captured,Not captured,Not captured,Not captured,,,Not captured,Not captured,Not captured,Not captured,73 3rd St #34,,Los Latos,California,94020,,,Not captured,Not captured,skherman49@yahoo.com,Not captured,701936404,,Not captured,Not captured,Not captured,Not captured,Not captured,Not captured,
Not captured,Not captured,06/07/2019,Not captured,Not captured,863949,020,00072,ARS-01-0050642,Beacon International,Not captured,Not captured,Not captured,,,,GOODLOE,THOMAS,s,01/27/1967,male,Not captured,Not captured,Not captured,Not captured,Not captured,Not captured,Not captured,Not captured,Not captured,Not captured,Not captured,Not captured,Not captured,,,Not captured,Not captured,Not captured,Not captured,12118 HADDEN HALL DR,,CHESTERFIELD,Virginia,23838,,,Not captured,Not captured,tscott912@aol.com,Not captured,701936403,,Not captured,Not captured,Not captured,Not captured,Not captured,Not captured,
Not captured,Not captured,06/07/2019,Not captured,Not captured,863949,020,00072,ARS-02-0050639,Beacon America,Not captured,Not captured,Not captured,,,,Dewar,Martin,A,03/01/1975,male,Not captured,Not captured,Not captured,Not captured,Not captured,Not captured,Not captured,Not captured,Not captured,Not captured,Not captured,Not captured,Not captured,,,Not captured,Not captured,Not captured,Not captured,45 Huntingdale Blvd,,Toronto,Ontario,M1W 2N8,,,Not captured,Not captured,martindewar@hotmail.com,Not captured,701936400,,Not captured,Not captured,Not captured,Not captured,Not captured,Not captured,
Not captured,Not captured,06/07/2019,Not captured,Not captured,863949,020,00072,ARS-01-0050638,Beacon International,Not captured,Not captured,Not captured,,,,Vashisht,Harsha,,05/27/1986,male,Not captured,Not captured,Not captured,Not captured,Not captured,Not captured,Not captured,Not captured,Not captured,Not captured,Not captured,Not captured,Not captured,,,Not captured,Not captured,Not captured,Not captured,3516 Benton st,,Santa clara,California,95051,,,Not captured,Not captured,rvharsha@gmail.com,Not captured,701936399,,Not captured,Not captured,Not captured,Not captured,Not captured,Not captured,
Not captured,Not captured,06/07/2019,Not captured,Not captured,863949,020,00072,ARS-01-0050637,Beacon International,Not captured,Not captured,Not captured,,,,Jeffers,Joan,A,03/03/1947,female,Not captured,Not captured,Not captured,Not captured,Not captured,Not captured,Not captured,Not captured,Not captured,Not captured,Not captured,Not captured,Not captured,,,Not captured,Not captured,Not captured,Not captured,1289 Moonstone St,,Hemet,California,92543,,,Not captured,Not captured,jjrn1947@yahoo.com,Not captured,701936398,,Not captured,Not captured,Not captured,Not captured,Not captured,Not captured,
Not captured,Not captured,06/07/2019,Not captured,Not captured,863949,020,00072,ARS-02-0050634,Beacon America,Not captured,Not captured,Not captured,,,,Bistritz,Yaakov,,04/23/2018,male,Not captured,Not captured,Not captured,Not captured,Not captured,Not captured,Not captured,Not captured,Not captured,Not captured,Not captured,Not captured,Not captured,,,Not captured,Not captured,Not captured,Not captured,373 Ridgewood Ave,,Staten Island,New York,10312,845-709-0266,,Not captured,Not captured,hadassabistritz@gmail.com,Not captured,701936360,,Not captured,Not captured,Not captured,Not captured,Not captured,Not captured,
Not captured,Not captured,06/07/2019,Not captured,Not captured,863949,020,00072,ARS-02-0050633,Beacon America,Not captured,Not captured,Not captured,,,,Bistritz,Micha,,04/04/2016,male,Not captured,Not captured,Not captured,Not captured,Not captured,Not captured,Not captured,Not captured,Not captured,Not captured,Not captured,Not captured,Not captured,,,Not captured,Not captured,Not captured,Not captured,373 Ridgewood Ave,,Staten Island,New York,10312,845-709-0266,,Not captured,Not captured,hadassabistritz@gmail.com,Not captured,701936359,,Not captured,Not captured,Not captured,Not captured,Not captured,Not captured,
Not captured,Not captured,06/07/2019,Not captured,Not captured,863949,020,00072,ARS-02-0050632,Beacon America,Not captured,Not captured,Not captured,,,,Bistritz,Binyimin,,01/20/2014,male,Not captured,Not captured,Not captured,Not captured,Not captured,Not captured,Not captured,Not captured,Not captured,Not captured,Not captured,Not captured,Not captured,,,Not captured,Not captured,Not captured,Not captured,373 Ridgewood Ave,,Staten Island,New York,10312,845-709-0266,,Not captured,Not captured,hadassabistritz@gmail.com,Not captured,701936358,,Not captured,Not captured,Not captured,Not captured,Not captured,Not captured,
Not captured,Not captured,06/07/2019,Not captured,Not captured,863949,020,00072,ARS-02-0050631,Beacon America,Not captured,Not captured,Not captured,,,,Bistritz,Rivka,,08/19/2012,female,Not captured,Not captured,Not captured,Not captured,Not captured,Not captured,Not captured,Not captured,Not captured,Not captured,Not captured,Not captured,Not captured,,,Not captured,Not captured,Not captured,Not captured,373 Ridgewood Ave,,Staten Island,New York,10312,845-709-0266,,Not captured,Not captured,hadassabistritz@gmail.com,Not captured,701936357,,Not captured,Not captured,Not captured,Not captured,Not captured,Not captured,
Not captured,Not captured,06/07/2019,Not captured,Not captured,863949,020,00072,ARS-02-0050630,Beacon America,Not captured,Not captured,Not captured,,,,Bistritz,Nachama,,07/16/1990,female,Not captured,Not captured,Not captured,Not captured,Not captured,Not captured,Not captured,Not captured,Not captured,Not captured,Not captured,Not captured,Not captured,,,Not captured,Not captured,Not captured,Not captured,373 Ridgewood Ave,,Staten Island,New York,10312,845-709-0266,,Not captured,Not captured,hadassabistritz@gmail.com,Not captured,701936356,,Not captured,Not captured,Not captured,Not captured,Not captured,Not captured,
Not captured,Not captured,06/07/2019,Not captured,Not captured,863949,020,00072,ARS-02-0050629,Beacon America,Not captured,Not captured,Not captured,,,,Bistritz,Avrahom,,01/05/1989,male,Not captured,Not captured,Not captured,Not captured,Not captured,Not captured,Not captured,Not captured,Not captured,Not captured,Not captured,Not captured,Not captured,,,Not captured,Not captured,Not captured,Not captured,373 Ridgewood Ave,,Staten Island,New York,10312,845-709-0266,,Not captured,Not captured,hadassabistritz@gmail.com,Not captured,701936355,,Not captured,Not captured,Not captured,Not captured,Not captured,Not captured,
Not captured,Not captured,06/06/2019,Not captured,Not captured,863949,020,00072,ARS-02-0050613,Beacon America,Not captured,Not captured,Not captured,,,,Khamnasing ,Nilan,,08/24/2008,male,Not captured,Not captured,Not captured,Not captured,Not captured,Not captured,Not captured,Not captured,Not captured,Not captured,Not captured,Not captured,Not captured,Corinne Babcock,Friend,Not captured,Not captured,Not captured,Not captured,2502 Grand Ave,,Joplin,Missouri,64804,4027507116,,Not captured,Not captured,cmbabcock1955@gmail.com,Not captured,701936338,,Not captured,Not captured,Not captured,Not captured,Not captured,Not captured,
Not captured,Not captured,06/06/2019,Not captured,Not captured,863949,020,00072,ARS-02-0050612,Beacon America,Not captured,Not captured,Not captured,,,,Sichanthapadit ,Yosuva,,08/17/2005,male,Not captured,Not captured,Not captured,Not captured,Not captured,Not captured,Not captured,Not captured,Not captured,Not captured,Not captured,Not captured,Not captured,Corinne Babcock,Friend,Not captured,Not captured,Not captured,Not captured,2502 Grand Ave,,Joplin,Missouri,64804,4027507116,,Not captured,Not captured,cmbabcock1955@gmail.com,Not captured,701936337,,Not captured,Not captured,Not captured,Not captured,Not captured,Not captured,
Not captured,Not captured,06/06/2019,Not captured,Not captured,863949,020,00072,ARS-02-0050611,Beacon America,Not captured,Not captured,Not captured,,,,Sichanthapadit ,Manichanh,,07/24/1976,female,Not captured,Not captured,Not captured,Not captured,Not captured,Not captured,Not captured,Not captured,Not captured,Not captured,Not captured,Not captured,Not captured,Corinne Babcock,Friend,Not captured,Not captured,Not captured,Not captured,2502 Grand Ave,,Joplin,Missouri,64804,4027507116,,Not captured,Not captured,cmbabcock1955@gmail.com,Not captured,701936336,,Not captured,Not captured,Not captured,Not captured,Not captured,Not captured,
Not captured,Not captured,06/06/2019,Not captured,Not captured,863949,020,00072,ARS-02-0050610,Beacon America,Not captured,Not captured,Not captured,Passport(P1870691),,,Khamnasing,Somdao,,11/19/1978,male,Not captured,Not captured,Not captured,Not captured,Not captured,Not captured,Not captured,Not captured,Not captured,Not captured,Not captured,Not captured,Not captured,Corinne Babcock,Friend,Not captured,Not captured,Not captured,Not captured,2502 Grand Ave,,Joplin,Missouri,64804,4027507116,,Not captured,Not captured,cmbabcock1955@gmail.com,Not captured,701936335,,Not captured,Not captured,Not captured,Not captured,Not captured,Not captured,
Not captured,Not captured,06/06/2019,Not captured,Not captured,863949,020,00072,ARS-02-0050600,Beacon America,Not captured,Not captured,Not captured,,,,marshall,jean,a,01/06/1946,female,Not captured,Not captured,Not captured,Not captured,Not captured,Not captured,Not captured,Not captured,Not captured,Not captured,Not captured,Not captured,Not captured,,,Not captured,Not captured,Not captured,Not captured,281 southampton place,,waterloo,Ontario,n2t 2b3,,,Not captured,Not captured,jeanniemarshall@rogers.com,Not captured,701936325,,Not captured,Not captured,Not captured,Not captured,Not captured,Not captured,
Not captured,Not captured,06/06/2019,Not captured,Not captured,863949,020,00072,ARS-01-0050590,Beacon International,Not captured,Not captured,Not captured,,,,Eisenberg,Saadia,,01/01/1970,male,Not captured,Not captured,Not captured,Not captured,Not captured,Not captured,Not captured,Not captured,Not captured,Not captured,Not captured,Not captured,Not captured,,,Not captured,Not captured,Not captured,Not captured,1758 East 29th Street,,Brooklyn,New York,11229,718-435-9880,,Not captured,Not captured,skyesyx@aol.com,Not captured,701936315,,Not captured,Not captured,Not captured,Not captured,Not captured,Not captured,
Not captured,Not captured,06/06/2019,Not captured,Not captured,863949,020,00072,ARS-01-0050587,Beacon International,Not captured,Not captured,Not captured,,,,Uthe,Stephanie,K,05/04/1987,female,Not captured,Not captured,Not captured,Not captured,Not captured,Not captured,Not captured,Not captured,Not captured,Not captured,Not captured,Not captured,Not captured,,,Not captured,Not captured,Not captured,Not captured,1450 Market St. #229,,San Diego,California,92101,,,Not captured,Not captured,steph.uthe@gmail.com,Not captured,701936312,,Not captured,Not captured,Not captured,Not captured,Not captured,Not captured,
Not captured,Not captured,06/06/2019,Not captured,Not captured,863949,020,00072,ARS-01-0050581,Beacon International,Not captured,Not captured,Not captured,,,,Svarczkopf,Wyatt,,03/13/1995,male,Not captured,Not captured,Not captured,Not captured,Not captured,Not captured,Not captured,Not captured,Not captured,Not captured,Not captured,Not captured,Not captured,,,Not captured,Not captured,Not captured,Not captured,1635 Venice Ln,,Longmont,Colorado,80503-6958,,,Not captured,Not captured,wyattsvar@gmail.com,Not captured,701936297,,Not captured,Not captured,Not captured,Not captured,Not captured,Not captured,
Not captured,Not captured,06/06/2019,Not captured,Not captured,863949,020,00072,ARS-02-0050576,Beacon America,Not captured,Not captured,Not captured,,,,Robinson,Maurine,,03/14/1966,female,Not captured,Not captured,Not captured,Not captured,Not captured,Not captured,Not captured,Not captured,Not captured,Not captured,Not captured,Not captured,Not captured,,,Not captured,Not captured,Not captured,Not captured,18 Lewis Street,,Savanna la mar,,00000,,,Not captured,Not captured,cliffrob23@yahoo.com,Not captured,701936292,,Not captured,Not captured,Not captured,Not captured,Not captured,Not captured,
Not captured,Not captured,06/06/2019,Not captured,Not captured,863949,020,00072,ARS-01-0050575,Beacon International,Not captured,Not captured,Not captured,,,,Thomas,Krystle,,11/14/1987,female,Not captured,Not captured,Not captured,Not captured,Not captured,Not captured,Not captured,Not captured,Not captured,Not captured,Not captured,Not captured,Not captured,,,Not captured,Not captured,Not captured,Not captured,1071 LAKE CAROLYN PKWY,,IRVING,Texas,75039,,,Not captured,Not captured,melanie.c.harris@gmail.com,Not captured,701936291,,Not captured,Not captured,Not captured,Not captured,Not captured,Not captured,
Not captured,Not captured,06/06/2019,Not captured,Not captured,863949,020,00072,ARS-01-0050574,Beacon International,Not captured,Not captured,Not captured,,,,Harris,Melanie,,02/22/1980,female,Not captured,Not captured,Not captured,Not captured,Not captured,Not captured,Not captured,Not captured,Not captured,Not captured,Not captured,Not captured,Not captured,,,Not captured,Not captured,Not captured,Not captured,1071 LAKE CAROLYN PKWY,,IRVING,Texas,75039,,,Not captured,Not captured,melanie.c.harris@gmail.com,Not captured,701936290,,Not captured,Not captured,Not captured,Not captured,Not captured,Not captured,
Not captured,Not captured,06/06/2019,Not captured,Not captured,863949,020,00072,ARS-02-0050573,Beacon America,Not captured,Not captured,Not captured,Passport(K0032326),,,RAVILLA MOHAN,SARASWATHI,,05/25/1944,female,Not captured,Not captured,Not captured,Not captured,Not captured,Not captured,Not captured,Not captured,Not captured,Not captured,Not captured,Not captured,Not captured,BANERJEE R MOHAN,SON,Not captured,Not captured,Not captured,Not captured,3744 ADRIATIC WAY,,SANTA CLARA,CA,95051,4087722850,,Not captured,Not captured,BANERJEE.DEEPA@ICLOUD.COM,Not captured,701936289,,Not captured,Not captured,Not captured,Not captured,Not captured,Not captured,
Not captured,Not captured,06/06/2019,Not captured,Not captured,863949,020,00072,ARS-02-0050572,Beacon America,Not captured,Not captured,Not captured,,,,MUTHUKRISHNAN,LALITHA,,04/15/1957,female,Not captured,Not captured,Not captured,Not captured,Not captured,Not captured,Not captured,Not captured,Not captured,Not captured,Not captured,Not captured,Not captured,DEVI BANERJEE,DAUGHTER,Not captured,Not captured,Not captured,Not captured,3744 ADRIATIC WAY,,SANTA CLARA,CA,95051,4087722850,,Not captured,Not captured,BANERJEE.DEEPA@ICLOUD.COM,Not captured,701936288,,Not captured,Not captured,Not captured,Not captured,Not captured,Not captured,
Not captured,Not captured,06/06/2019,Not captured,Not captured,863949,020,00072,ARS-02-0050571,Beacon America,Not captured,Not captured,Not captured,Passport(P8225503),,,KACHEDIMANGALAM JANAKI RAMA NAIDU,MUTHUKRISHNAN,,10/10/1950,male,Not captured,Not captured,Not captured,Not captured,Not captured,Not captured,Not captured,Not captured,Not captured,Not captured,Not captured,Not captured,Not captured,DEVI BANERJEE,DAUGHTER,Not captured,Not captured,Not captured,Not captured,3744 ADRIATIC WAY,,SANTA CLARA,CA,95051,4087722850,,Not captured,Not captured,BANERJEE.DEEPA@ICLOUD.COM,Not captured,701936287,,Not captured,Not captured,Not captured,Not captured,Not captured,Not captured,
Not captured,Not captured,06/06/2019,Not captured,Not captured,863949,020,00072,ARS-02-0050570,Beacon America,Not captured,Not captured,Not captured,Passport(133613036),,,Velasquez,Andrea Sofia,,05/08/1993,male,Not captured,Not captured,Not captured,Not captured,Not captured,Not captured,Not captured,Not captured,Not captured,Not captured,Not captured,Not captured,Not captured,Alberto Velasquez,PADRE,Not captured,Not captured,Not captured,Not captured,Urb. Villa Jardin Casa No 15,,Maturin,Monagas,6201,+584148837314,+584148837314,Not captured,Not captured,asofiavl93@gmail.com,Not captured,701936286,,Not captured,Not captured,Not captured,Not captured,Not captured,Not captured,
Not captured,Not captured,06/06/2019,Not captured,Not captured,863949,020,00072,ARS-02-0050569,Beacon America,Not captured,Not captured,Not captured,Passport(133613036),,,Velasquez,Andrea Sofia,,05/08/1993,male,Not captured,Not captured,Not captured,Not captured,Not captured,Not captured,Not captured,Not captured,Not captured,Not captured,Not captured,Not captured,Not captured,Alberto Velasquez,PADRE,Not captured,Not captured,Not captured,Not captured,Urb. Villa Jardin Casa N 15,,Maturin,Monagas,6201,+584148837314,+584148837314,Not captured,Not captured,asofiavl93@gmail.com,Not captured,701936285,,Not captured,Not captured,Not captured,Not captured,Not captured,Not captured,
Not captured,Not captured,06/07/2019,Not captured,Not captured,863949,020,00072,ARS-02-0050560,Beacon America,Not captured,Not captured,Not captured,Passport(R9386365),,,VAKHARIA,PRAVINCHANDRA,HIRALAL,10/14/1947,male,Not captured,Not captured,Not captured,Not captured,Not captured,Not captured,Not captured,Not captured,Not captured,Not captured,Not captured,Not captured,Not captured,SUCHETA VAKHARIA,SPOUSE,Not captured,Not captured,Not captured,Not captured,126 PEONY CT,,FREMONT,CA,94538,4086939228,,Not captured,Not captured,bnvakharia@gmail.com,Not captured,701936273,,Not captured,Not captured,Not captured,Not captured,Not captured,Not captured,
Not captured,Not captured,06/05/2019,Not captured,Not captured,863949,020,00072,ARS-01-0050559,Beacon International,Not captured,Not captured,Not captured,,,,Baradar,Alireza,A,08/12/1997,male,Not captured,Not captured,Not captured,Not captured,Not captured,Not captured,Not captured,Not captured,Not captured,Not captured,Not captured,Not captured,Not captured,,,Not captured,Not captured,Not captured,Not captured,PO Box 66015,,Vancouver,Washington,98666,,,Not captured,Not captured,newday8520@gmail.com,Not captured,701936272,,Not captured,Not captured,Not captured,Not captured,Not captured,Not captured,
Not captured,Not captured,06/07/2019,Not captured,Not captured,863949,020,00072,ARS-02-0050552,Beacon America,Not captured,Not captured,Not captured,,,,Liderman,Nussan,,10/30/2016,male,Not captured,Not captured,Not captured,Not captured,Not captured,Not captured,Not captured,Not captured,Not captured,Not captured,Not captured,Not captured,Not captured,,,Not captured,Not captured,Not captured,Not captured,122 Regent Dr,,Lakewood,New Jersey,08701,718-755-5562,,Not captured,Not captured,tgliderman102@gmail.com,Not captured,701936256,,Not captured,Not captured,Not captured,Not captured,Not captured,Not captured,