EE Transaction Type,Dependent Transaction Type,Effective Date,EE Signature,EE Signature Date,Control,Suffix,Account,Plan Number,Plan Name,Claim Office,Network ID Number,Customer Code,EE SSN,Dependent SSN,Dependent Relationship,Last Name,First Name,Middle Initial,DOB,Gender,Ethnicity,PCP/PCD,PCP/PCD Current Patient,Provider Cap Office Number,COB,Dep Student Indicator,Dep OOA Indicator,EE Prior Coverage Indicator,EE Late Entrant,EE Language Indicator,Hire Date,Earnings,Earnings Frequency,Beneficiary (Last Name First Name MI),Beneficiary Relationship,Continuation of Coverage Expiration Date,Continuation of Coverage Event Date,Continuation of Coverage Length of Coverage,Work Location Zip Code,Street Address Line 1,Street Address Line 2,City,State,Zip Code,Home Phone Number,Work Phone Number,Accept Code,Evidence Code,EE Email Address,Communication Disability Code,EE Alternate ID,Dep Alternate ID,Old Control,Old Suffix,Old Account,New Control,New Suffix,New Account,
Not captured,Not captured,05/28/2019,Not captured,Not captured,863949,020,00072,ARS-01-0050354,Beacon International,Not captured,Not captured,Not captured,,,,Meredith,Nicola,F,10/08/1996,female,Not captured,Not captured,Not captured,Not captured,Not captured,Not captured,Not captured,Not captured,Not captured,Not captured,Not captured,Not captured,Not captured,,,Not captured,Not captured,Not captured,Not captured,6648 32nd Street NW,,Washington DC,Dist. of Columbia,20015,,,Not captured,Not captured,sfennellster@gmail.com,Not captured,701935587,,Not captured,Not captured,Not captured,Not captured,Not captured,Not captured,
Not captured,Not captured,05/28/2019,Not captured,Not captured,863949,020,00072,ARS-01-0050352,Beacon International,Not captured,Not captured,Not captured,,,,Knowles,Katherine,K,12/12/1996,female,Not captured,Not captured,Not captured,Not captured,Not captured,Not captured,Not captured,Not captured,Not captured,Not captured,Not captured,Not captured,Not captured,,,Not captured,Not captured,Not captured,Not captured,1405 Roundhouse Lane,,Alexandria,Virginia,22314,,,Not captured,Not captured,katekknowles@yahoo.com,Not captured,701935585,,Not captured,Not captured,Not captured,Not captured,Not captured,Not captured,
Not captured,Not captured,05/28/2019,Not captured,Not captured,863949,020,00072,ARS-01-0050347,Beacon International,Not captured,Not captured,Not captured,,,,Twersky,Avrohom,,11/03/1984,male,Not captured,Not captured,Not captured,Not captured,Not captured,Not captured,Not captured,Not captured,Not captured,Not captured,Not captured,Not captured,Not captured,,,Not captured,Not captured,Not captured,Not captured,1143 45th street,,Brooklyn,New York,11219,347-515-1692,,Not captured,Not captured,shaya@primeins.com,Not captured,701935580,,Not captured,Not captured,Not captured,Not captured,Not captured,Not captured,
Not captured,Not captured,05/28/2019,Not captured,Not captured,863949,020,00072,ARS-01-0050345,Beacon International,Not captured,Not captured,Not captured,,,,Elstob,Charlotte,A,09/27/1988,female,Not captured,Not captured,Not captured,Not captured,Not captured,Not captured,Not captured,Not captured,Not captured,Not captured,Not captured,Not captured,Not captured,,,Not captured,Not captured,Not captured,Not captured,200 E 15th St,,New York,New York,10003,,,Not captured,Not captured,CHARLOTTE.ELSTOB@AM.JLL.COM,Not captured,701935578,,Not captured,Not captured,Not captured,Not captured,Not captured,Not captured,
Not captured,Not captured,05/28/2019,Not captured,Not captured,863949,020,00072,ARS-01-0050343,Beacon International,Not captured,Not captured,Not captured,,,,Kinley,Matthew,,06/06/1994,male,Not captured,Not captured,Not captured,Not captured,Not captured,Not captured,Not captured,Not captured,Not captured,Not captured,Not captured,Not captured,Not captured,,,Not captured,Not captured,Not captured,Not captured,1137 Trentwood Dr,,Akron,Ohio,44313,,,Not captured,Not captured,kinley14966@aim.com,Not captured,701935552,,Not captured,Not captured,Not captured,Not captured,Not captured,Not captured,
Not captured,Not captured,05/28/2019,Not captured,Not captured,863949,020,00072,ARS-01-0050341,Beacon International,Not captured,Not captured,Not captured,,,,SCHOB,VICKI,,10/11/1958,male,Not captured,Not captured,Not captured,Not captured,Not captured,Not captured,Not captured,Not captured,Not captured,Not captured,Not captured,Not captured,Not captured,CHARLES SCHOB,SON,Not captured,Not captured,Not captured,Not captured,779 ARROW TRAIL,,BOZEMAN,Montana,59718,5599777335,,Not captured,Not captured,vicki@schob.us,Not captured,701935550,,Not captured,Not captured,Not captured,Not captured,Not captured,Not captured,
Not captured,Not captured,05/28/2019,Not captured,Not captured,863949,020,00072,ARS-01-0050340,Beacon International,Not captured,Not captured,Not captured,Passport(NA),,,SCHOB,GREGORY,,10/09/1959,male,Not captured,Not captured,Not captured,Not captured,Not captured,Not captured,Not captured,Not captured,Not captured,Not captured,Not captured,Not captured,Not captured,CHARLES SCHOB,SON,Not captured,Not captured,Not captured,Not captured,779 ARROW TRAIL,,BOZEMAN,Montana,59718,5599777335,,Not captured,Not captured,vicki@schob.us,Not captured,701935549,,Not captured,Not captured,Not captured,Not captured,Not captured,Not captured,
Not captured,Not captured,05/28/2019,Not captured,Not captured,863949,020,00072,ARS-01-0050339,Beacon International,Not captured,Not captured,Not captured,,,,Moraga,Sofia,E,02/02/1999,female,Not captured,Not captured,Not captured,Not captured,Not captured,Not captured,Not captured,Not captured,Not captured,Not captured,Not captured,Not captured,Not captured,,,Not captured,Not captured,Not captured,Not captured,1683 W Petunia pl,,Tucson,Arizona,85737,,,Not captured,Not captured,sofiamoraga299@gmail.com,Not captured,701935548,,Not captured,Not captured,Not captured,Not captured,Not captured,Not captured,
Not captured,Not captured,05/28/2019,Not captured,Not captured,863949,020,00072,ARS-01-0050336,Beacon International,Not captured,Not captured,Not captured,,,,Huber,Brett,J,06/21/1999,male,Not captured,Not captured,Not captured,Not captured,Not captured,Not captured,Not captured,Not captured,Not captured,Not captured,Not captured,Not captured,Not captured,,,Not captured,Not captured,Not captured,Not captured,15900 Indian Wells Ct,,Clermont,Florida,34711,,,Not captured,Not captured,bhuber203@gmail.com,Not captured,701935500,,Not captured,Not captured,Not captured,Not captured,Not captured,Not captured,
Not captured,Not captured,05/28/2019,Not captured,Not captured,863949,020,00072,ARS-01-0050335,Beacon International,Not captured,Not captured,Not captured,,,,Rogers,Cory,H,11/20/1992,male,Not captured,Not captured,Not captured,Not captured,Not captured,Not captured,Not captured,Not captured,Not captured,Not captured,Not captured,Not captured,Not captured,,,Not captured,Not captured,Not captured,Not captured,318 Bogey Drive,,Lowell,Arkansas,72745,,,Not captured,Not captured,cory10boom@gmail.com,Not captured,701935499,,Not captured,Not captured,Not captured,Not captured,Not captured,Not captured,
Not captured,Not captured,05/28/2019,Not captured,Not captured,863949,020,00072,ARS-02-0050334,Beacon America,Not captured,Not captured,Not captured,,,,Oltheten,Owen,,09/11/1997,male,Not captured,Not captured,Not captured,Not captured,Not captured,Not captured,Not captured,Not captured,Not captured,Not captured,Not captured,Not captured,Not captured,,,Not captured,Not captured,Not captured,Not captured,504 Inland Circle,,Azle,Texas,76020,,,Not captured,Not captured,bettinaoltheten@gmail.com,Not captured,701935498,,Not captured,Not captured,Not captured,Not captured,Not captured,Not captured,
Not captured,Not captured,05/28/2019,Not captured,Not captured,863949,020,00072,ARS-02-0050333,Beacon America,Not captured,Not captured,Not captured,,,,Oltheten,Bettina,,12/07/1965,female,Not captured,Not captured,Not captured,Not captured,Not captured,Not captured,Not captured,Not captured,Not captured,Not captured,Not captured,Not captured,Not captured,,,Not captured,Not captured,Not captured,Not captured,504 Inland Circle,,Azle,Texas,76020,,,Not captured,Not captured,bettinaoltheten@gmail.com,Not captured,701935497,,Not captured,Not captured,Not captured,Not captured,Not captured,Not captured,
Not captured,Not captured,05/28/2019,Not captured,Not captured,863949,020,00072,ARS-02-0050330,Beacon America,Not captured,Not captured,Not captured,,,,veinberg,haim,,09/10/1978,male,Not captured,Not captured,Not captured,Not captured,Not captured,Not captured,Not captured,Not captured,Not captured,Not captured,Not captured,Not captured,Not captured,,,Not captured,Not captured,Not captured,Not captured,5 gesher hachayim,,jerusalem,,95305,,,Not captured,Not captured,shea2775@gmail.com,Not captured,701935494,,Not captured,Not captured,Not captured,Not captured,Not captured,Not captured,
Not captured,Not captured,05/28/2019,Not captured,Not captured,863949,020,00072,ARS-01-0050328,Beacon International,Not captured,Not captured,Not captured,,,,Phoenix,Michele,,01/29/1968,female,Not captured,Not captured,Not captured,Not captured,Not captured,Not captured,Not captured,Not captured,Not captured,Not captured,Not captured,Not captured,Not captured,,,Not captured,Not captured,Not captured,Not captured,27W190 Emerson Court,,Winfield,Illinois,60190,,,Not captured,Not captured,shellphoenix@gmail.com,Not captured,701935492,,Not captured,Not captured,Not captured,Not captured,Not captured,Not captured,
Not captured,Not captured,05/28/2019,Not captured,Not captured,863949,020,00072,ARS-01-0050322,Beacon International,Not captured,Not captured,Not captured,,,,Salazar,Elias,,03/05/1991,male,Not captured,Not captured,Not captured,Not captured,Not captured,Not captured,Not captured,Not captured,Not captured,Not captured,Not captured,Not captured,Not captured,,,Not captured,Not captured,Not captured,Not captured,Barrio Los Angeles San Jose,,San Jose,,10108,,,Not captured,Not captured,eliasjsalazar@gmail.com,Not captured,701935486,,Not captured,Not captured,Not captured,Not captured,Not captured,Not captured,
Not captured,Not captured,05/27/2019,Not captured,Not captured,863949,020,00072,ARS-01-0050321,Beacon International,Not captured,Not captured,Not captured,,,,Kinsberg,Ari,,09/11/1974,male,Not captured,Not captured,Not captured,Not captured,Not captured,Not captured,Not captured,Not captured,Not captured,Not captured,Not captured,Not captured,Not captured,,,Not captured,Not captured,Not captured,Not captured,1852 Madison place,,Brooklyn,New York,11229,,,Not captured,Not captured,amkjudaica@hotmail.com,Not captured,701935485,,Not captured,Not captured,Not captured,Not captured,Not captured,Not captured,
Not captured,Not captured,05/27/2019,Not captured,Not captured,863949,020,00072,ARS-01-0050314,Beacon International,Not captured,Not captured,Not captured,,,,Bailey,William,A,12/09/1970,male,Not captured,Not captured,Not captured,Not captured,Not captured,Not captured,Not captured,Not captured,Not captured,Not captured,Not captured,Not captured,Not captured,,,Not captured,Not captured,Not captured,Not captured,3201 Tam Oshanter Lane,,Birmingham,Alabama,35242,,,Not captured,Not captured,andy@churchofthehighlands.com,Not captured,701935453,,Not captured,Not captured,Not captured,Not captured,Not captured,Not captured,
Not captured,Not captured,05/28/2019,Not captured,Not captured,863949,020,00072,ARS-01-0050313,Beacon International,Not captured,Not captured,Not captured,,,,Dabic,Nebojsa,,09/29/1970,male,Not captured,Not captured,Not captured,Not captured,Not captured,Not captured,Not captured,Not captured,Not captured,Not captured,Not captured,Not captured,Not captured,,,Not captured,Not captured,Not captured,Not captured,913 Elmwood Ave,,Evanston,Illinois,60202,,,Not captured,Not captured,nebojsa@sodata.us,Not captured,701935452,,Not captured,Not captured,Not captured,Not captured,Not captured,Not captured,
Not captured,Not captured,05/27/2019,Not captured,Not captured,863949,020,00072,OVI-28-0050312,OverseasCare Visitors Insurance Plan,Not captured,Not captured,Not captured,Passport(P8117419),,,Tamhankar,Gulab,B,11/15/1945,female,Not captured,Not captured,Not captured,Not captured,Not captured,Not captured,Not captured,Not captured,Not captured,Not captured,Not captured,Not captured,Not captured,Santosh B Tamhankar,Son,Not captured,Not captured,Not captured,Not captured,2929 Rancho Rio Chico,,Carlsbad,California,92009,7608283276,7605768086,Not captured,Not captured,santoshbt@hotmail.com,Not captured,701935451,,Not captured,Not captured,Not captured,Not captured,Not captured,Not captured,
Not captured,Not captured,05/26/2019,Not captured,Not captured,863949,020,00072,ARS-01-0050310,Beacon International,Not captured,Not captured,Not captured,,,,gallagher,lauren,,05/16/1981,female,Not captured,Not captured,Not captured,Not captured,Not captured,Not captured,Not captured,Not captured,Not captured,Not captured,Not captured,Not captured,Not captured,,,Not captured,Not captured,Not captured,Not captured,305 E 94TH ST,,NEW YORK,New York,10128,,,Not captured,Not captured,rhythmzslave@yahoo.com,Not captured,701935449,,Not captured,Not captured,Not captured,Not captured,Not captured,Not captured,
Not captured,Not captured,05/26/2019,Not captured,Not captured,863949,020,00072,ARS-01-0050309,Beacon International,Not captured,Not captured,Not captured,,,,Mitchell,John,C,02/16/1972,male,Not captured,Not captured,Not captured,Not captured,Not captured,Not captured,Not captured,Not captured,Not captured,Not captured,Not captured,Not captured,Not captured,,,Not captured,Not captured,Not captured,Not captured,1259 Berkeley Ave,,Saint Paul,Minnesota,55105,,,Not captured,Not captured,chriznatch@yahoo.com,Not captured,701935448,,Not captured,Not captured,Not captured,Not captured,Not captured,Not captured,
Not captured,Not captured,05/26/2019,Not captured,Not captured,863949,020,00072,ARS-02-0050308,Beacon America,Not captured,Not captured,Not captured,Passport(G40677757),,,HE,XIAODONG,,09/30/1942,female,Not captured,Not captured,Not captured,Not captured,Not captured,Not captured,Not captured,Not captured,Not captured,Not captured,Not captured,Not captured,Not captured,Tongtong Ding,daughter,Not captured,Not captured,Not captured,Not captured,1818 BROOKTREE WAY,,PLEASANTON,California,94566,4086886048,,Not captured,Not captured,tding@sbcglobal.net,Not captured,701935447,,Not captured,Not captured,Not captured,Not captured,Not captured,Not captured,
Not captured,Not captured,05/26/2019,Not captured,Not captured,863949,020,00072,ARS-01-0050307,Beacon International,Not captured,Not captured,Not captured,,,,Patel,Makiko,,05/23/1979,female,Not captured,Not captured,Not captured,Not captured,Not captured,Not captured,Not captured,Not captured,Not captured,Not captured,Not captured,Not captured,Not captured,,,Not captured,Not captured,Not captured,Not captured,1160 Pine St,,Menlo Park,California,94025,,,Not captured,Not captured,samir.patel@icloud.com,Not captured,701935446,,Not captured,Not captured,Not captured,Not captured,Not captured,Not captured,
Not captured,Not captured,05/26/2019,Not captured,Not captured,863949,020,00072,ARS-01-0050304,Beacon International,Not captured,Not captured,Not captured,,,,Campbell,joanna,,05/04/1987,female,Not captured,Not captured,Not captured,Not captured,Not captured,Not captured,Not captured,Not captured,Not captured,Not captured,Not captured,Not captured,Not captured,,,Not captured,Not captured,Not captured,Not captured,138 east 38th street,,New York,New York,10016,,,Not captured,Not captured,jocampbell45@gmail.com,Not captured,701935443,,Not captured,Not captured,Not captured,Not captured,Not captured,Not captured,
Not captured,Not captured,05/26/2019,Not captured,Not captured,863949,020,00072,ARS-01-0050301,Beacon International,Not captured,Not captured,Not captured,Passport(573327267),,,Osborn,Marilyn,Denise,05/03/1970,female,Not captured,Not captured,Not captured,Not captured,Not captured,Not captured,Not captured,Not captured,Not captured,Not captured,Not captured,Not captured,Not captured,Randall Osborn,Husband,Not captured,Not captured,Not captured,Not captured,1334 Louray Drive,,Baton Rouge,Louisiana,70808,2257183394,2256148707,Not captured,Not captured,marilynosborn@fastmail.com,Not captured,701935439,,Not captured,Not captured,Not captured,Not captured,Not captured,Not captured,
Not captured,Not captured,05/25/2019,Not captured,Not captured,863949,020,00072,ARS-01-0050300,Beacon International,Not captured,Not captured,Not captured,,,,Crum,Lisa,,06/22/1972,female,Not captured,Not captured,Not captured,Not captured,Not captured,Not captured,Not captured,Not captured,Not captured,Not captured,Not captured,Not captured,Not captured,,,Not captured,Not captured,Not captured,Not captured,21558 E Geddes Pl,,Centennial,Colorado,80016,,,Not captured,Not captured,bert323@yahoo.com,Not captured,701935438,,Not captured,Not captured,Not captured,Not captured,Not captured,Not captured,
Not captured,Not captured,05/25/2019,Not captured,Not captured,863949,020,00072,ARS-01-0050299,Beacon International,Not captured,Not captured,Not captured,,,,Crum,Robert,,10/17/1972,male,Not captured,Not captured,Not captured,Not captured,Not captured,Not captured,Not captured,Not captured,Not captured,Not captured,Not captured,Not captured,Not captured,,,Not captured,Not captured,Not captured,Not captured,21558 E Geddes Pl,,Centennial,Colorado,80016,,,Not captured,Not captured,bert323@yahoo.com,Not captured,701935437,,Not captured,Not captured,Not captured,Not captured,Not captured,Not captured,
Not captured,Not captured,05/27/2019,Not captured,Not captured,863949,020,00072,OVI-28-0050298,OverseasCare Visitors Insurance Plan,Not captured,Not captured,Not captured,Passport(K6581856),,,Tiwari,Vijaya,,08/01/1943,female,Not captured,Not captured,Not captured,Not captured,Not captured,Not captured,Not captured,Not captured,Not captured,Not captured,Not captured,Not captured,Not captured,Shashank Tiwari,Son,Not captured,Not captured,Not captured,Not captured,14923 Blakehill Dr,,Frisco,Texas,75035,7148878032,,Not captured,Not captured,SHASHANK_TIWARI@YAHOO.COM,Not captured,701935436,,Not captured,Not captured,Not captured,Not captured,Not captured,Not captured,
Not captured,Not captured,05/27/2019,Not captured,Not captured,863949,020,00072,OVI-28-0050295,OverseasCare Visitors Insurance Plan,Not captured,Not captured,Not captured,,,,Edupalli,Ramana,,03/10/1950,female,Not captured,Not captured,Not captured,Not captured,Not captured,Not captured,Not captured,Not captured,Not captured,Not captured,Not captured,Not captured,Not captured,srikanth edupalli,son,Not captured,Not captured,Not captured,Not captured,3070 whitfileld ave,,cumming,Georgia,30040,6784851842,,Not captured,Not captured,sriedupalli@gmail.com,Not captured,701935433,,Not captured,Not captured,Not captured,Not captured,Not captured,Not captured,
Not captured,Not captured,05/27/2019,Not captured,Not captured,863949,020,00072,OVI-28-0050294,OverseasCare Visitors Insurance Plan,Not captured,Not captured,Not captured,,,,Edupalli,Venkata Rao,,12/03/1945,male,Not captured,Not captured,Not captured,Not captured,Not captured,Not captured,Not captured,Not captured,Not captured,Not captured,Not captured,Not captured,Not captured,Srikanth Edupalli,Son,Not captured,Not captured,Not captured,Not captured,3070 Whitfield Ave,,Cumming,Georgia,30040,6788905878,,Not captured,Not captured,sriedupalli@gmail.com,Not captured,701935432,,Not captured,Not captured,Not captured,Not captured,Not captured,Not captured,
Not captured,Not captured,05/26/2019,Not captured,Not captured,863949,020,00072,ARS-01-0050293,Beacon International,Not captured,Not captured,Not captured,,,,King,Rachel,,07/10/1986,female,Not captured,Not captured,Not captured,Not captured,Not captured,Not captured,Not captured,Not captured,Not captured,Not captured,Not captured,Not captured,Not captured,,,Not captured,Not captured,Not captured,Not captured,2112 W North Ave,,CHICAGO,Illinois,60647,,,Not captured,Not captured,LAURABGRANT@GMAIL.COM,Not captured,701935431,,Not captured,Not captured,Not captured,Not captured,Not captured,Not captured,
Not captured,Not captured,05/26/2019,Not captured,Not captured,863949,020,00072,ARS-01-0050292,Beacon International,Not captured,Not captured,Not captured,,,,GRANT,LAURA,,09/23/1981,female,Not captured,Not captured,Not captured,Not captured,Not captured,Not captured,Not captured,Not captured,Not captured,Not captured,Not captured,Not captured,Not captured,,,Not captured,Not captured,Not captured,Not captured,2112 W North Ave,,CHICAGO,Illinois,60647,,,Not captured,Not captured,LAURABGRANT@GMAIL.COM,Not captured,701935430,,Not captured,Not captured,Not captured,Not captured,Not captured,Not captured,
Not captured,Not captured,05/25/2019,Not captured,Not captured,863949,020,00072,ARS-01-0050290,Beacon International,Not captured,Not captured,Not captured,,,,hochstead,adam,,11/28/1976,male,Not captured,Not captured,Not captured,Not captured,Not captured,Not captured,Not captured,Not captured,Not captured,Not captured,Not captured,Not captured,Not captured,,,Not captured,Not captured,Not captured,Not captured,11 east 44th street,,newyork,New York,10017,,,Not captured,Not captured,newyork1500@yahoo.com,Not captured,701935428,,Not captured,Not captured,Not captured,Not captured,Not captured,Not captured,
Not captured,Not captured,05/25/2019,Not captured,Not captured,863949,020,00072,ARS-01-0050289,Beacon International,Not captured,Not captured,Not captured,,,,juslin,inka,,08/15/1969,female,Not captured,Not captured,Not captured,Not captured,Not captured,Not captured,Not captured,Not captured,Not captured,Not captured,Not captured,Not captured,Not captured,,,Not captured,Not captured,Not captured,Not captured,11 east 44th street,,newyork,New York,10017,,,Not captured,Not captured,newyork1500@yahoo.com,Not captured,701935427,,Not captured,Not captured,Not captured,Not captured,Not captured,Not captured,
Not captured,Not captured,05/25/2019,Not captured,Not captured,863949,020,00072,ARS-01-0050288,Beacon International,Not captured,Not captured,Not captured,Passport(598359863),,,Powell,Jamie,,01/06/1965,male,Not captured,Not captured,Not captured,Not captured,Not captured,Not captured,Not captured,Not captured,Not captured,Not captured,Not captured,Not captured,Not captured,Tracy Powell,Wife,Not captured,Not captured,Not captured,Not captured,224 West 11th,,Cherokee,Oklahoma,73728,9182079839,4782444350,Not captured,Not captured,jpowells4him@comsouth.net,Not captured,701935426,,Not captured,Not captured,Not captured,Not captured,Not captured,Not captured,
Not captured,Not captured,05/25/2019,Not captured,Not captured,863949,020,00072,ARS-01-0050287,Beacon International,Not captured,Not captured,Not captured,,,,Staniczenko,Phillip,,09/23/1985,male,Not captured,Not captured,Not captured,Not captured,Not captured,Not captured,Not captured,Not captured,Not captured,Not captured,Not captured,Not captured,Not captured,,,Not captured,Not captured,Not captured,Not captured,127 West 96th Street,,New York,New York,10025,,,Not captured,Not captured,anna.goddu@gmail.com,Not captured,701935425,,Not captured,Not captured,Not captured,Not captured,Not captured,Not captured,
Not captured,Not captured,05/25/2019,Not captured,Not captured,863949,020,00072,ARS-01-0050286,Beacon International,Not captured,Not captured,Not captured,,,,Goddu,Anna,,09/27/1987,female,Not captured,Not captured,Not captured,Not captured,Not captured,Not captured,Not captured,Not captured,Not captured,Not captured,Not captured,Not captured,Not captured,,,Not captured,Not captured,Not captured,Not captured,127 West 96th Street,,New York,New York,10025,,,Not captured,Not captured,anna.goddu@gmail.com,Not captured,701935424,,Not captured,Not captured,Not captured,Not captured,Not captured,Not captured,