EE Transaction Type,Dependent Transaction Type,Effective Date,EE Signature,EE Signature Date,Control,Suffix,Account,Plan Number,Plan Name,Claim Office,Network ID Number,Customer Code,EE SSN,Dependent SSN,Dependent Relationship,Last Name,First Name,Middle Initial,DOB,Gender,Ethnicity,PCP/PCD,PCP/PCD Current Patient,Provider Cap Office Number,COB,Dep Student Indicator,Dep OOA Indicator,EE Prior Coverage Indicator,EE Late Entrant,EE Language Indicator,Hire Date,Earnings,Earnings Frequency,Beneficiary (Last Name First Name MI),Beneficiary Relationship,Continuation of Coverage Expiration Date,Continuation of Coverage Event Date,Continuation of Coverage Length of Coverage,Work Location Zip Code,Street Address Line 1,Street Address Line 2,City,State,Zip Code,Home Phone Number,Work Phone Number,Accept Code,Evidence Code,EE Email Address,Communication Disability Code,EE Alternate ID,Dep Alternate ID,Old Control,Old Suffix,Old Account,New Control,New Suffix,New Account,
Not captured,Not captured,05/23/2019,Not captured,Not captured,863949,020,00072,ARS-02-0050253,Beacon America,Not captured,Not captured,Not captured,,,,Andrachuk,Donald,J,09/19/1985,male,Not captured,Not captured,Not captured,Not captured,Not captured,Not captured,Not captured,Not captured,Not captured,Not captured,Not captured,Not captured,Not captured,,,Not captured,Not captured,Not captured,Not captured,314 East 6th Street,,New York,New York,10003,,,Not captured,Not captured,james.andrachuk@gmail.com,Not captured,701935333,,Not captured,Not captured,Not captured,Not captured,Not captured,Not captured,
Not captured,Not captured,05/23/2019,Not captured,Not captured,863949,020,00072,ARS-01-0050252,Beacon International,Not captured,Not captured,Not captured,Passport(533606223),,,Grainger,Leslie,,10/18/1988,female,Not captured,Not captured,Not captured,Not captured,Not captured,Not captured,Not captured,Not captured,Not captured,Not captured,Not captured,Not captured,Not captured,Gary Grainger,Father,Not captured,Not captured,Not captured,Not captured,125 NE 32nd Street,,Miami,Florida,33137,5083175098,,Not captured,Not captured,Leslie.grainger@gmail.com,Not captured,701935332,,Not captured,Not captured,Not captured,Not captured,Not captured,Not captured,
Not captured,Not captured,05/23/2019,Not captured,Not captured,863949,020,00072,ARS-01-0050246,Beacon International,Not captured,Not captured,Not captured,,,,Hamada-Minar,Kai,,08/21/2001,male,Not captured,Not captured,Not captured,Not captured,Not captured,Not captured,Not captured,Not captured,Not captured,Not captured,Not captured,Not captured,Not captured,,,Not captured,Not captured,Not captured,Not captured,2115 Aulii st.,,Honolulu,Hawaii,96817,,,Not captured,Not captured,kailukahamada@hotmail.co.jp,Not captured,701935289,,Not captured,Not captured,Not captured,Not captured,Not captured,Not captured,
Not captured,Not captured,05/23/2019,Not captured,Not captured,863949,020,00072,ARS-02-0050224,Beacon America,Not captured,Not captured,Not captured,,,,Abbruzzino,Luca,,04/13/1989,male,Not captured,Not captured,Not captured,Not captured,Not captured,Not captured,Not captured,Not captured,Not captured,Not captured,Not captured,Not captured,Not captured,,,Not captured,Not captured,Not captured,Not captured,2550 Fifth Avenue,,San Diego,California,92103,6093735918,,Not captured,Not captured,dario@ildandyrestaurant.com,Not captured,701935267,,Not captured,Not captured,Not captured,Not captured,Not captured,Not captured,
Not captured,Not captured,05/23/2019,Not captured,Not captured,863949,020,00072,ARS-02-0050223,Beacon America,Not captured,Not captured,Not captured,Passport(YA4359921),,,Abbruzzino,Antonio,,01/08/1963,male,Not captured,Not captured,Not captured,Not captured,Not captured,Not captured,Not captured,Not captured,Not captured,Not captured,Not captured,Not captured,Not captured,,,Not captured,Not captured,Not captured,Not captured,2550 Fifth Avenue,,San Diego,California,92103,6093735918,,Not captured,Not captured,dario@ildandyrestaurant.com,Not captured,701935266,,Not captured,Not captured,Not captured,Not captured,Not captured,Not captured,
Not captured,Not captured,05/23/2019,Not captured,Not captured,863949,020,00072,ARS-01-0050221,Beacon International,Not captured,Not captured,Not captured,,,,Ohara,Damian,,07/19/1982,male,Not captured,Not captured,Not captured,Not captured,Not captured,Not captured,Not captured,Not captured,Not captured,Not captured,Not captured,Not captured,Not captured,,,Not captured,Not captured,Not captured,Not captured,1416 Belfast Dr,,Los Angeles,California,90069,,,Not captured,Not captured,emmasidoli_23@hotmail.com,Not captured,701935264,,Not captured,Not captured,Not captured,Not captured,Not captured,Not captured,
Not captured,Not captured,05/23/2019,Not captured,Not captured,863949,020,00072,ARS-01-0050220,Beacon International,Not captured,Not captured,Not captured,,,,Sidoli,Emma,,11/23/1991,female,Not captured,Not captured,Not captured,Not captured,Not captured,Not captured,Not captured,Not captured,Not captured,Not captured,Not captured,Not captured,Not captured,,,Not captured,Not captured,Not captured,Not captured,1416 Belfast Dr,,Los Angeles,California,90069,,,Not captured,Not captured,emmasidoli_23@hotmail.com,Not captured,701935263,,Not captured,Not captured,Not captured,Not captured,Not captured,Not captured,
Not captured,Not captured,05/23/2019,Not captured,Not captured,863949,020,00072,ARS-02-0050199,Beacon America,Not captured,Not captured,Not captured,,,,Barraza,Ricardo,J,11/21/1963,male,Not captured,Not captured,Not captured,Not captured,Not captured,Not captured,Not captured,Not captured,Not captured,Not captured,Not captured,Not captured,Not captured,,,Not captured,Not captured,Not captured,Not captured,AND CRATER MZ 11 16 D3 SUPMZA,,Cancun Benito Juarez,,77511,,,Not captured,Not captured,ricardojbarraza@gmail.com,Not captured,701935231,,Not captured,Not captured,Not captured,Not captured,Not captured,Not captured,
Not captured,Not captured,05/23/2019,Not captured,Not captured,863949,020,00072,ARS-01-0050187,Beacon International,Not captured,Not captured,Not captured,,,,Figueroa Quezada,Norberto,,09/07/1983,male,Not captured,Not captured,Not captured,Not captured,Not captured,Not captured,Not captured,Not captured,Not captured,Not captured,Not captured,Not captured,Not captured,,,Not captured,Not captured,Not captured,Not captured,1172 Jefferson Ave #2,,Brooklyn,New York,11221,,,Not captured,Not captured,nornor01@hotmail.com,Not captured,701935219,,Not captured,Not captured,Not captured,Not captured,Not captured,Not captured,
Not captured,Not captured,05/23/2019,Not captured,Not captured,863949,020,00072,ARS-01-0050185,Beacon International,Not captured,Not captured,Not captured,,,,Gupta,Pratyusha,,02/19/1994,female,Not captured,Not captured,Not captured,Not captured,Not captured,Not captured,Not captured,Not captured,Not captured,Not captured,Not captured,Not captured,Not captured,,,Not captured,Not captured,Not captured,Not captured,240 Meeker Ave,,Brooklyn,New York,11211,,,Not captured,Not captured,dhrupad_bhardwaj@yahoo.com,Not captured,701935217,,Not captured,Not captured,Not captured,Not captured,Not captured,Not captured,
Not captured,Not captured,05/23/2019,Not captured,Not captured,863949,020,00072,ARS-01-0050184,Beacon International,Not captured,Not captured,Not captured,,,,Bhardwaj,Dhrupad,,08/27/1993,male,Not captured,Not captured,Not captured,Not captured,Not captured,Not captured,Not captured,Not captured,Not captured,Not captured,Not captured,Not captured,Not captured,,,Not captured,Not captured,Not captured,Not captured,240 Meeker Ave,,Brooklyn,New York,11211,,,Not captured,Not captured,dhrupad_bhardwaj@yahoo.com,Not captured,701935216,,Not captured,Not captured,Not captured,Not captured,Not captured,Not captured,
Not captured,Not captured,05/23/2019,Not captured,Not captured,863949,020,00072,ARS-01-0050181,Beacon International,Not captured,Not captured,Not captured,,,,Inman,Molly,,11/29/1976,female,Not captured,Not captured,Not captured,Not captured,Not captured,Not captured,Not captured,Not captured,Not captured,Not captured,Not captured,Not captured,Not captured,,,Not captured,Not captured,Not captured,Not captured,1023 Kensington Way,,Annapolis,Maryland,21403,,,Not captured,Not captured,helena.smolich@new-rule.com,Not captured,701935213,,Not captured,Not captured,Not captured,Not captured,Not captured,Not captured,
Not captured,Not captured,05/23/2019,Not captured,Not captured,863949,020,00072,ARS-01-0050176,Beacon International,Not captured,Not captured,Not captured,,,,Jackson,William,V,09/11/1971,male,Not captured,Not captured,Not captured,Not captured,Not captured,Not captured,Not captured,Not captured,Not captured,Not captured,Not captured,Not captured,Not captured,,,Not captured,Not captured,Not captured,Not captured,9910 Coventry Lane,,Johns Creek,Georgia,30022,,,Not captured,Not captured,djackson0220@gmail.com,Not captured,701935208,,Not captured,Not captured,Not captured,Not captured,Not captured,Not captured,
Not captured,Not captured,05/23/2019,Not captured,Not captured,863949,020,00072,ARS-01-0050175,Beacon International,Not captured,Not captured,Not captured,,,,Jackson,Deborah,S,02/20/1968,female,Not captured,Not captured,Not captured,Not captured,Not captured,Not captured,Not captured,Not captured,Not captured,Not captured,Not captured,Not captured,Not captured,,,Not captured,Not captured,Not captured,Not captured,9910 Coventry Lane,,Johns Creek,Georgia,30022,,,Not captured,Not captured,djackson0220@gmail.com,Not captured,701935207,,Not captured,Not captured,Not captured,Not captured,Not captured,Not captured,
Not captured,Not captured,05/23/2019,Not captured,Not captured,863949,020,00072,ARS-02-0050174,Beacon America,Not captured,Not captured,Not captured,,,,Svigilsky,Deborah,,03/24/1959,female,Not captured,Not captured,Not captured,Not captured,Not captured,Not captured,Not captured,Not captured,Not captured,Not captured,Not captured,Not captured,Not captured,,,Not captured,Not captured,Not captured,Not captured,San Jos&eacute; de la sierra 99,,Santiago,,99999,,,Not captured,Not captured,s.svigilsky@gmail.com,Not captured,701935206,,Not captured,Not captured,Not captured,Not captured,Not captured,Not captured,
Not captured,Not captured,05/23/2019,Not captured,Not captured,863949,020,00072,ARS-01-0050173,Beacon International,Not captured,Not captured,Not captured,,,,aclander,Jaime,,01/24/1958,male,Not captured,Not captured,Not captured,Not captured,Not captured,Not captured,Not captured,Not captured,Not captured,Not captured,Not captured,Not captured,Not captured,,,Not captured,Not captured,Not captured,Not captured,30 W Yale Loop,,Irvine,California,92604,,,Not captured,Not captured,haim267@yahoo.com,Not captured,701935205,,Not captured,Not captured,Not captured,Not captured,Not captured,Not captured,
Not captured,Not captured,05/22/2019,Not captured,Not captured,863949,020,00072,ARS-01-0050171,Beacon International,Not captured,Not captured,Not captured,,,,Hansen,Elizabeth,,07/28/1979,female,Not captured,Not captured,Not captured,Not captured,Not captured,Not captured,Not captured,Not captured,Not captured,Not captured,Not captured,Not captured,Not captured,,,Not captured,Not captured,Not captured,Not captured,40 Daytona Ave,,Albany,New York,12203,,,Not captured,Not captured,brighteyedea.liz@gmail.com,Not captured,701935125,,Not captured,Not captured,Not captured,Not captured,Not captured,Not captured,
Not captured,Not captured,05/22/2019,Not captured,Not captured,863949,020,00072,ARS-04-0050081,Enhanced America,Not captured,Not captured,Not captured,Passport(521106170),,,Hanson,Grace,Katharina,09/19/1994,female,Not captured,Not captured,Not captured,Not captured,Not captured,Not captured,Not captured,Not captured,Not captured,Not captured,Not captured,Not captured,Not captured,,,Not captured,Not captured,Not captured,Not captured,8069 Woodland Ln,,West Hollywood,California,90046,9174349973,,Not captured,Not captured,gracekatharinah@gmail.com,Not captured,701934882,,Not captured,Not captured,Not captured,Not captured,Not captured,Not captured,
Not captured,Not captured,05/22/2019,Not captured,Not captured,863949,020,00072,ARS-02-0050161,Beacon America,Not captured,Not captured,Not captured,,,,Tanner,David,,03/31/1988,male,Not captured,Not captured,Not captured,Not captured,Not captured,Not captured,Not captured,Not captured,Not captured,Not captured,Not captured,Not captured,Not captured,,,Not captured,Not captured,Not captured,Not captured,20 Garand Court,,London,,N7 8EB,,,Not captured,Not captured,chioma.patrick@hotmail.co.uk,Not captured,701935090,,Not captured,Not captured,Not captured,Not captured,Not captured,Not captured,
Not captured,Not captured,05/22/2019,Not captured,Not captured,863949,020,00072,ARS-01-0050160,Beacon International,Not captured,Not captured,Not captured,,,,Hooper,DeeAnna,,12/10/1964,female,Not captured,Not captured,Not captured,Not captured,Not captured,Not captured,Not captured,Not captured,Not captured,Not captured,Not captured,Not captured,Not captured,,,Not captured,Not captured,Not captured,Not captured,101 Poplar Way,,Dallas,Georgia,30157,,,Not captured,Not captured,dahmgirl@gmail.com,Not captured,701935089,,Not captured,Not captured,Not captured,Not captured,Not captured,Not captured,
Not captured,Not captured,05/22/2019,Not captured,Not captured,863949,020,00072,ARS-01-0050159,Beacon International,Not captured,Not captured,Not captured,,,,Ross,adam,L,09/08/1989,female,Not captured,Not captured,Not captured,Not captured,Not captured,Not captured,Not captured,Not captured,Not captured,Not captured,Not captured,Not captured,Not captured,,,Not captured,Not captured,Not captured,Not captured,41 walter,,commack,Kansas,11725,,,Not captured,Not captured,hmrc67@outlook.com,Not captured,701935088,,Not captured,Not captured,Not captured,Not captured,Not captured,Not captured,
Not captured,Not captured,05/22/2019,Not captured,Not captured,863949,020,00072,ARS-01-0050158,Beacon International,Not captured,Not captured,Not captured,,,,Katz,Harley,,10/02/1990,male,Not captured,Not captured,Not captured,Not captured,Not captured,Not captured,Not captured,Not captured,Not captured,Not captured,Not captured,Not captured,Not captured,,,Not captured,Not captured,Not captured,Not captured,274 Collingwood Street,,San Francisco,California,94114,,,Not captured,Not captured,harley@probablygenetic.com,Not captured,701935087,,Not captured,Not captured,Not captured,Not captured,Not captured,Not captured,
Not captured,Not captured,05/22/2019,Not captured,Not captured,863949,020,00072,ARS-01-0050157,Beacon International,Not captured,Not captured,Not captured,,,,Richards,Mark,,10/01/1967,male,Not captured,Not captured,Not captured,Not captured,Not captured,Not captured,Not captured,Not captured,Not captured,Not captured,Not captured,Not captured,Not captured,,,Not captured,Not captured,Not captured,Not captured,16189 Southwest Snapdragon Lane,,Tigard,Oregon,97223,,,Not captured,Not captured,1967mrr@gmail.com,Not captured,701935086,,Not captured,Not captured,Not captured,Not captured,Not captured,Not captured,
Not captured,Not captured,05/23/2019,Not captured,Not captured,863949,020,00072,ARS-02-0050156,Beacon America,Not captured,Not captured,Not captured,,,,PENG,XIAOHU,E23169672,04/21/1968,male,Not captured,Not captured,Not captured,Not captured,Not captured,Not captured,Not captured,Not captured,Not captured,Not captured,Not captured,Not captured,Not captured,Zhihong Peng,Son,Not captured,Not captured,Not captured,Not captured,37 S 21st St,,San Jose,California,95116,6692042834,,Not captured,Not captured,histeven94@gmail.com,Not captured,701935077,,Not captured,Not captured,Not captured,Not captured,Not captured,Not captured,
Not captured,Not captured,05/23/2019,Not captured,Not captured,863949,020,00072,ARS-02-0050155,Beacon America,Not captured,Not captured,Not captured,Passport(EF4791292),,,Wan,Haiyan,,10/05/1969,female,Not captured,Not captured,Not captured,Not captured,Not captured,Not captured,Not captured,Not captured,Not captured,Not captured,Not captured,Not captured,Not captured,Zhihong Peng,Son,Not captured,Not captured,Not captured,Not captured,37 S 21st St,,San Jose,California,95116,6692042834,,Not captured,Not captured,histeven94@gmail.com,Not captured,701935076,,Not captured,Not captured,Not captured,Not captured,Not captured,Not captured,
Not captured,Not captured,05/23/2019,Not captured,Not captured,863949,020,00072,OVI-28-0050154,OverseasCare Visitors Insurance Plan,Not captured,Not captured,Not captured,Passport(M7804131),,,BABU,SARASWATHY,,01/30/1954,female,Not captured,Not captured,Not captured,Not captured,Not captured,Not captured,Not captured,Not captured,Not captured,Not captured,Not captured,Not captured,Not captured,Kirubakaran Babu,Son,Not captured,Not captured,Not captured,Not captured,3156 LINDENWOOD DR,,DEARBORN,Michigan,48120,+13136900170,,Not captured,Not captured,kirubakaran.babu@live.com,Not captured,701935075,,Not captured,Not captured,Not captured,Not captured,Not captured,Not captured,
Not captured,Not captured,05/23/2019,Not captured,Not captured,863949,020,00072,OVI-28-0050153,OverseasCare Visitors Insurance Plan,Not captured,Not captured,Not captured,Passport(M7804131),,,GOVINDARAJULU NAICKER,BABU,,12/31/1950,male,Not captured,Not captured,Not captured,Not captured,Not captured,Not captured,Not captured,Not captured,Not captured,Not captured,Not captured,Not captured,Not captured,Kirubakaran Babu,Son,Not captured,Not captured,Not captured,Not captured,3156 LINDENWOOD DR,,DEARBORN,Michigan,48120,+13136900170,,Not captured,Not captured,kirubakaran.babu@live.com,Not captured,701935074,,Not captured,Not captured,Not captured,Not captured,Not captured,Not captured,
Not captured,Not captured,05/21/2019,Not captured,Not captured,863949,020,00072,ARS-01-0050152,Beacon International,Not captured,Not captured,Not captured,,,,Weinberger,Abraham,,05/11/1998,male,Not captured,Not captured,Not captured,Not captured,Not captured,Not captured,Not captured,Not captured,Not captured,Not captured,Not captured,Not captured,Not captured,,,Not captured,Not captured,Not captured,Not captured,4 Mordche Scher Blvd #102,,Monroe,New York,10950,,,Not captured,Not captured,cohn3431@gmail.com,Not captured,701935072,,Not captured,Not captured,Not captured,Not captured,Not captured,Not captured,
Not captured,Not captured,05/22/2019,Not captured,Not captured,863949,020,00072,ARS-01-0050147,Beacon International,Not captured,Not captured,Not captured,,,,Greenfield,David,,10/02/1978,male,Not captured,Not captured,Not captured,Not captured,Not captured,Not captured,Not captured,Not captured,Not captured,Not captured,Not captured,Not captured,Not captured,,,Not captured,Not captured,Not captured,Not captured,11 Meron Dr #102,,Monroe,New York,10950,,,Not captured,Not captured,sarah@silbagency.com,Not captured,701935067,,Not captured,Not captured,Not captured,Not captured,Not captured,Not captured,
Not captured,Not captured,05/21/2019,Not captured,Not captured,863949,020,00072,ARS-01-0050146,Beacon International,Not captured,Not captured,Not captured,,,,Coats,Anna,,08/20/1981,female,Not captured,Not captured,Not captured,Not captured,Not captured,Not captured,Not captured,Not captured,Not captured,Not captured,Not captured,Not captured,Not captured,,,Not captured,Not captured,Not captured,Not captured,5340 West Kennedy Blvd #422,,Tampa,Florida,33609,,,Not captured,Not captured,anna@marrymetampabay.com,Not captured,701935066,,Not captured,Not captured,Not captured,Not captured,Not captured,Not captured,
Not captured,Not captured,05/21/2019,Not captured,Not captured,863949,020,00072,ARS-02-0050141,Beacon America,Not captured,Not captured,Not captured,,,,Lancaster,Patrick,,12/26/1969,male,Not captured,Not captured,Not captured,Not captured,Not captured,Not captured,Not captured,Not captured,Not captured,Not captured,Not captured,Not captured,Not captured,,,Not captured,Not captured,Not captured,Not captured,35 Moulton Chase,,Pontefract,,WF9 4DU,,,Not captured,Not captured,patrick.lancaster@rsmconsulting.us,Not captured,701935037,,Not captured,Not captured,Not captured,Not captured,Not captured,Not captured,
Not captured,Not captured,05/21/2019,Not captured,Not captured,863949,020,00072,ARS-01-0050140,Beacon International,Not captured,Not captured,Not captured,,,,Bilbool,Galia,S,02/01/1988,female,Not captured,Not captured,Not captured,Not captured,Not captured,Not captured,Not captured,Not captured,Not captured,Not captured,Not captured,Not captured,Not captured,,,Not captured,Not captured,Not captured,Not captured,78 Manhattan Ave,,New York,New York,10025,,,Not captured,Not captured,galiabilbool@gmail.com,Not captured,701935020,,Not captured,Not captured,Not captured,Not captured,Not captured,Not captured,
Not captured,Not captured,05/21/2019,Not captured,Not captured,863949,020,00072,ARS-01-0050138,Beacon International,Not captured,Not captured,Not captured,,,,Cohn,Shiya,,02/22/1998,male,Not captured,Not captured,Not captured,Not captured,Not captured,Not captured,Not captured,Not captured,Not captured,Not captured,Not captured,Not captured,Not captured,,,Not captured,Not captured,Not captured,Not captured,4 iron hill plaza #204,,Monroe,New York,10950,,,Not captured,Not captured,cohn3431@gmail.com,Not captured,701935012,,Not captured,Not captured,Not captured,Not captured,Not captured,Not captured,
Not captured,Not captured,05/21/2019,Not captured,Not captured,863949,020,00072,ARS-01-0050137,Beacon International,Not captured,Not captured,Not captured,,,,evans,carla,b,08/30/1966,female,Not captured,Not captured,Not captured,Not captured,Not captured,Not captured,Not captured,Not captured,Not captured,Not captured,Not captured,Not captured,Not captured,,,Not captured,Not captured,Not captured,Not captured,5637 clinton avenue,,minneapolis,Minnesota,55419,,,Not captured,Not captured,dhuskiss@gmail.com,Not captured,701935011,,Not captured,Not captured,Not captured,Not captured,Not captured,Not captured,
Not captured,Not captured,05/21/2019,Not captured,Not captured,863949,020,00072,ARS-01-0050136,Beacon International,Not captured,Not captured,Not captured,,,,huskisson,david,p,11/09/1968,male,Not captured,Not captured,Not captured,Not captured,Not captured,Not captured,Not captured,Not captured,Not captured,Not captured,Not captured,Not captured,Not captured,,,Not captured,Not captured,Not captured,Not captured,5637 clinton avenue,,minneapolis,Minnesota,55419,,,Not captured,Not captured,dhuskiss@gmail.com,Not captured,701935010,,Not captured,Not captured,Not captured,Not captured,Not captured,Not captured,
Not captured,Not captured,05/22/2019,Not captured,Not captured,863949,020,00072,OVI-28-0050131,OverseasCare Visitors Insurance Plan,Not captured,Not captured,Not captured,,,,D Bosch,Norma,Blumenfeld,11/01/1929,male,Not captured,Not captured,Not captured,Not captured,Not captured,Not captured,Not captured,Not captured,Not captured,Not captured,Not captured,Not captured,Not captured,Irine Bosch,Daughter,Not captured,Not captured,Not captured,Not captured,166 Clinton Road,,MA,,02445,617-686-1249,,Not captured,Not captured,ibosch@mit.edu,Not captured,701935005,,Not captured,Not captured,Not captured,Not captured,Not captured,Not captured,