EE Transaction Type,Dependent Transaction Type,Effective Date,EE Signature,EE Signature Date,Control,Suffix,Account,Plan Number,Plan Name,Claim Office,Network ID Number,Customer Code,EE SSN,Dependent SSN,Dependent Relationship,Last Name,First Name,Middle Initial,DOB,Gender,Ethnicity,PCP/PCD,PCP/PCD Current Patient,Provider Cap Office Number,COB,Dep Student Indicator,Dep OOA Indicator,EE Prior Coverage Indicator,EE Late Entrant,EE Language Indicator,Hire Date,Earnings,Earnings Frequency,Beneficiary (Last Name First Name MI),Beneficiary Relationship,Continuation of Coverage Expiration Date,Continuation of Coverage Event Date,Continuation of Coverage Length of Coverage,Work Location Zip Code,Street Address Line 1,Street Address Line 2,City,State,Zip Code,Home Phone Number,Work Phone Number,Accept Code,Evidence Code,EE Email Address,Communication Disability Code,EE Alternate ID,Dep Alternate ID,Old Control,Old Suffix,Old Account,New Control,New Suffix,New Account,
Not captured,Not captured,05/12/2019,Not captured,Not captured,863949,020,00072,ARS-01-0049909,Beacon International,Not captured,Not captured,Not captured,,,,McKenna,Sean,,05/31/1994,male,Not captured,Not captured,Not captured,Not captured,Not captured,Not captured,Not captured,Not captured,Not captured,Not captured,Not captured,Not captured,Not captured,,,Not captured,Not captured,Not captured,Not captured,125 sw 5th terrace,,Gainesville,Florida,32601,,,Not captured,Not captured,smmavericks2@gmail.com,Not captured,701934261,,Not captured,Not captured,Not captured,Not captured,Not captured,Not captured,
Not captured,Not captured,05/12/2019,Not captured,Not captured,863949,020,00072,ARS-01-0049906,Beacon International,Not captured,Not captured,Not captured,,,,Ma,Min Min,,12/22/1980,female,Not captured,Not captured,Not captured,Not captured,Not captured,Not captured,Not captured,Not captured,Not captured,Not captured,Not captured,Not captured,Not captured,,,Not captured,Not captured,Not captured,Not captured,34-20 78th st,,Jackson Heights,New York,11372,,,Not captured,Not captured,minmin@glossdossier.com,Not captured,701934252,,Not captured,Not captured,Not captured,Not captured,Not captured,Not captured,
Not captured,Not captured,05/12/2019,Not captured,Not captured,863949,020,00072,ARS-01-0049905,Beacon International,Not captured,Not captured,Not captured,,,,Reding,Alyssa,,10/31/1991,female,Not captured,Not captured,Not captured,Not captured,Not captured,Not captured,Not captured,Not captured,Not captured,Not captured,Not captured,Not captured,Not captured,,,Not captured,Not captured,Not captured,Not captured,2550 University Ave,,Madison,Wisconsin,53705,,,Not captured,Not captured,Bhern09@gmail.com,Not captured,701934251,,Not captured,Not captured,Not captured,Not captured,Not captured,Not captured,
Not captured,Not captured,05/12/2019,Not captured,Not captured,863949,020,00072,ARS-01-0049904,Beacon International,Not captured,Not captured,Not captured,,,,Hernandez,Brandon,A,01/25/1991,male,Not captured,Not captured,Not captured,Not captured,Not captured,Not captured,Not captured,Not captured,Not captured,Not captured,Not captured,Not captured,Not captured,,,Not captured,Not captured,Not captured,Not captured,2550 University Ave,,Madison,Wisconsin,53705,,,Not captured,Not captured,Bhern09@gmail.com,Not captured,701934250,,Not captured,Not captured,Not captured,Not captured,Not captured,Not captured,
Not captured,Not captured,05/12/2019,Not captured,Not captured,863949,020,00072,ARS-01-0049902,Beacon International,Not captured,Not captured,Not captured,,,,Nichols,Diane,T,03/09/1945,female,Not captured,Not captured,Not captured,Not captured,Not captured,Not captured,Not captured,Not captured,Not captured,Not captured,Not captured,Not captured,Not captured,,,Not captured,Not captured,Not captured,Not captured,17338 W Lake Desire Dr SE,,Renton,Washington,98058,,,Not captured,Not captured,dianenicholsleo@hotmail.com,Not captured,701934248,,Not captured,Not captured,Not captured,Not captured,Not captured,Not captured,
Not captured,Not captured,05/12/2019,Not captured,Not captured,863949,020,00072,ARS-01-0049901,Beacon International,Not captured,Not captured,Not captured,,,,Eger,James,D,08/29/1950,male,Not captured,Not captured,Not captured,Not captured,Not captured,Not captured,Not captured,Not captured,Not captured,Not captured,Not captured,Not captured,Not captured,,,Not captured,Not captured,Not captured,Not captured,2706 W Riverwalk Cir,,Littleton,Colorado,80123,,,Not captured,Not captured,jdeger@gmail.com,Not captured,701934247,,Not captured,Not captured,Not captured,Not captured,Not captured,Not captured,
Not captured,Not captured,05/12/2019,Not captured,Not captured,863949,020,00072,ARS-01-0049899,Beacon International,Not captured,Not captured,Not captured,,,,Pearlman,Jeffrey,T,07/13/1977,male,Not captured,Not captured,Not captured,Not captured,Not captured,Not captured,Not captured,Not captured,Not captured,Not captured,Not captured,Not captured,Not captured,,,Not captured,Not captured,Not captured,Not captured,167 Daphne Way,,East Palo Alto,California,94303,,,Not captured,Not captured,dlgoldstein@gmail.com,Not captured,701934245,,Not captured,Not captured,Not captured,Not captured,Not captured,Not captured,
Not captured,Not captured,05/12/2019,Not captured,Not captured,863949,020,00072,ARS-01-0049898,Beacon International,Not captured,Not captured,Not captured,,,,Goldstein,Danielle,L,10/07/1981,female,Not captured,Not captured,Not captured,Not captured,Not captured,Not captured,Not captured,Not captured,Not captured,Not captured,Not captured,Not captured,Not captured,,,Not captured,Not captured,Not captured,Not captured,167 Daphne Way,,East Palo Alto,California,94303,,,Not captured,Not captured,dlgoldstein@gmail.com,Not captured,701934244,,Not captured,Not captured,Not captured,Not captured,Not captured,Not captured,
Not captured,Not captured,05/12/2019,Not captured,Not captured,863949,020,00072,ARS-01-0049896,Beacon International,Not captured,Not captured,Not captured,,,,SWEENY-RYWAK,PATRICIA,A,07/18/1951,female,Not captured,Not captured,Not captured,Not captured,Not captured,Not captured,Not captured,Not captured,Not captured,Not captured,Not captured,Not captured,Not captured,,,Not captured,Not captured,Not captured,Not captured,4020 N Damen Ave,,Chicago,Illinois,60618,,,Not captured,Not captured,sweenymom42@gmail.com,Not captured,701934241,,Not captured,Not captured,Not captured,Not captured,Not captured,Not captured,
Not captured,Not captured,05/12/2019,Not captured,Not captured,863949,020,00072,OVI-28-0049895,OverseasCare Visitors Insurance Plan,Not captured,Not captured,Not captured,Passport(FO669985),,,da Cruz,Eunice,,12/18/1950,female,Not captured,Not captured,Not captured,Not captured,Not captured,Not captured,Not captured,Not captured,Not captured,Not captured,Not captured,Not captured,Not captured,,,Not captured,Not captured,Not captured,Not captured,217 Columbia St 1C,,Ithaca,New York,14850,6072297781,,Not captured,Not captured,eunice.jalberto@gmail.com,Not captured,701934240,,Not captured,Not captured,Not captured,Not captured,Not captured,Not captured,
Not captured,Not captured,05/12/2019,Not captured,Not captured,863949,020,00072,ARS-01-0049894,Beacon International,Not captured,Not captured,Not captured,,,,Bender,Marigene,,04/12/1949,female,Not captured,Not captured,Not captured,Not captured,Not captured,Not captured,Not captured,Not captured,Not captured,Not captured,Not captured,Not captured,Not captured,,,Not captured,Not captured,Not captured,Not captured,1018 Carolyn Dr,,West Chester,Pennsylvania,19382,,,Not captured,Not captured,marigeneb@yahoo.com,Not captured,701934239,,Not captured,Not captured,Not captured,Not captured,Not captured,Not captured,
Not captured,Not captured,05/11/2019,Not captured,Not captured,863949,020,00072,ARS-01-0049893,Beacon International,Not captured,Not captured,Not captured,,,,Shlahman,Ariel,,06/15/1981,male,Not captured,Not captured,Not captured,Not captured,Not captured,Not captured,Not captured,Not captured,Not captured,Not captured,Not captured,Not captured,Not captured,,,Not captured,Not captured,Not captured,Not captured,4862 N Kenmore Ave Apt 2N,,Chicago,Illinois,60640,,,Not captured,Not captured,shlahman@gmail.com,Not captured,701934238,,Not captured,Not captured,Not captured,Not captured,Not captured,Not captured,
Not captured,Not captured,05/11/2019,Not captured,Not captured,863949,020,00072,ARS-01-0049889,Beacon International,Not captured,Not captured,Not captured,,,,Eastman,Jane,M,12/25/1963,female,Not captured,Not captured,Not captured,Not captured,Not captured,Not captured,Not captured,Not captured,Not captured,Not captured,Not captured,Not captured,Not captured,,,Not captured,Not captured,Not captured,Not captured,61 Pecan Dr,,Sylva,North Carolina,28779,,,Not captured,Not captured,Janeeadtman@me.com,Not captured,701934234,,Not captured,Not captured,Not captured,Not captured,Not captured,Not captured,
Not captured,Not captured,05/12/2019,Not captured,Not captured,863949,020,00072,ARS-02-0049888,Beacon America,Not captured,Not captured,Not captured,Passport(H7748190),,,Balakrishna Rao,Malathi,,02/22/1950,female,Not captured,Not captured,Not captured,Not captured,Not captured,Not captured,Not captured,Not captured,Not captured,Not captured,Not captured,Not captured,Not captured,Savitha Balakrishna,Daughter,Not captured,Not captured,Not captured,Not captured,1514 Cherry Hill Drive,,Lufkin,Texas,75904,9366342668,,Not captured,Not captured,kgsrini@gmail.com,Not captured,701934233,,Not captured,Not captured,Not captured,Not captured,Not captured,Not captured,
Not captured,Not captured,05/12/2019,Not captured,Not captured,863949,020,00072,ARS-01-0049886,Beacon International,Not captured,Not captured,Not captured,,,,SARAIVA,ALEXSANDRA,BATISTA,11/30/1965,male,Not captured,Not captured,Not captured,Not captured,Not captured,Not captured,Not captured,Not captured,Not captured,Not captured,Not captured,Not captured,Not captured,Felipe Saraiva dos Santos,Filho,Not captured,Not captured,Not captured,Not captured,SQN 211 BLOCO B APTO 511 ASA NORTE,,BRASILIA,Distrito Federal,70863020,55 61 98161-1200,55 61 3206-4064,Not captured,Not captured,alexsasaraiva@gmail.com,Not captured,701934231,,Not captured,Not captured,Not captured,Not captured,Not captured,Not captured,
Not captured,Not captured,05/10/2019,Not captured,Not captured,863949,020,00072,ARS-01-0049883,Beacon International,Not captured,Not captured,Not captured,,,,Gaarrett,Jonathan,A,05/12/1980,male,Not captured,Not captured,Not captured,Not captured,Not captured,Not captured,Not captured,Not captured,Not captured,Not captured,Not captured,Not captured,Not captured,,,Not captured,Not captured,Not captured,Not captured,160 Newberry Farm Rd Se,,Dalton,Georgia,30721,,,Not captured,Not captured,drewg1311@gmail.com,Not captured,701934228,,Not captured,Not captured,Not captured,Not captured,Not captured,Not captured,
Not captured,Not captured,05/10/2019,Not captured,Not captured,863949,020,00072,ARS-01-0049882,Beacon International,Not captured,Not captured,Not captured,,,,Calloway,Emily,K,01/29/1993,female,Not captured,Not captured,Not captured,Not captured,Not captured,Not captured,Not captured,Not captured,Not captured,Not captured,Not captured,Not captured,Not captured,,,Not captured,Not captured,Not captured,Not captured,165 East Street,,Upton,Massachusetts,01568,,,Not captured,Not captured,joshkerxhallik@gmail.com,Not captured,701934227,,Not captured,Not captured,Not captured,Not captured,Not captured,Not captured,
Not captured,Not captured,05/10/2019,Not captured,Not captured,863949,020,00072,ARS-01-0049881,Beacon International,Not captured,Not captured,Not captured,,,,Kerxhalli-Kleinfield,Joshua,P,10/01/1992,male,Not captured,Not captured,Not captured,Not captured,Not captured,Not captured,Not captured,Not captured,Not captured,Not captured,Not captured,Not captured,Not captured,,,Not captured,Not captured,Not captured,Not captured,165 East Street,,Upton,Massachusetts,01568,,,Not captured,Not captured,joshkerxhallik@gmail.com,Not captured,701934226,,Not captured,Not captured,Not captured,Not captured,Not captured,Not captured,
Not captured,Not captured,05/11/2019,Not captured,Not captured,863949,020,00072,ARS-02-0049880,Beacon America,Not captured,Not captured,Not captured,Passport(144117880),,,Evans Garica,Luis Emmanuel,,11/18/1987,male,Not captured,Not captured,Not captured,Not captured,Not captured,Not captured,Not captured,Not captured,Not captured,Not captured,Not captured,Not captured,Not captured,Marilda de Evans,Mama,Not captured,Not captured,Not captured,Not captured,225 NE 23RD ST APT 904,,Miami,Florida,33137,7867400878,04242831761,Not captured,Not captured,emmanuelevans@gmail.com,Not captured,701934225,,Not captured,Not captured,Not captured,Not captured,Not captured,Not captured,
Not captured,Not captured,05/10/2019,Not captured,Not captured,863949,020,00072,ARS-02-0049874,Beacon America,Not captured,Not captured,Not captured,,,,Perrier,Rachel,,12/03/1989,female,Not captured,Not captured,Not captured,Not captured,Not captured,Not captured,Not captured,Not captured,Not captured,Not captured,Not captured,Not captured,Not captured,,,Not captured,Not captured,Not captured,Not captured,689 Churchill Ave. N,,Ottawa,Ontario,K1Z 5G4,,,Not captured,Not captured,rach.perrier@gmail.com,Not captured,701934218,,Not captured,Not captured,Not captured,Not captured,Not captured,Not captured,
Not captured,Not captured,05/10/2019,Not captured,Not captured,863949,020,00072,ARS-01-0049873,Beacon International,Not captured,Not captured,Not captured,,,,veinberg,haim,,09/10/1978,male,Not captured,Not captured,Not captured,Not captured,Not captured,Not captured,Not captured,Not captured,Not captured,Not captured,Not captured,Not captured,Not captured,,,Not captured,Not captured,Not captured,Not captured,4 eliezrov st,,jerusalem,,95305,,,Not captured,Not captured,tbayer845@gmail.com,Not captured,701934216,,Not captured,Not captured,Not captured,Not captured,Not captured,Not captured,
Not captured,Not captured,05/10/2019,Not captured,Not captured,863949,020,00072,OVI-28-0049871,OverseasCare Visitors Insurance Plan,Not captured,Not captured,Not captured,Passport(K7891309),,,Hasthimull,Padam Chordia,,11/27/1960,male,Not captured,Not captured,Not captured,Not captured,Not captured,Not captured,Not captured,Not captured,Not captured,Not captured,Not captured,Not captured,Not captured,Amith Chordia Padam,Son,Not captured,Not captured,Not captured,Not captured,2670 Fairview Dr,,Avon,Ohio,44011,9372716667,,Not captured,Not captured,amithchordia@gmail.com,Not captured,701934211,,Not captured,Not captured,Not captured,Not captured,Not captured,Not captured,
Not captured,Not captured,05/10/2019,Not captured,Not captured,863949,020,00072,ARS-01-0049870,Beacon International,Not captured,Not captured,Not captured,,,,Gordon,Christopher,,06/03/1983,male,Not captured,Not captured,Not captured,Not captured,Not captured,Not captured,Not captured,Not captured,Not captured,Not captured,Not captured,Not captured,Not captured,,,Not captured,Not captured,Not captured,Not captured,700 s harbor island blvd,,Tampa,Florida,33602,,,Not captured,Not captured,cdgordon83@gmail.com,Not captured,701934210,,Not captured,Not captured,Not captured,Not captured,Not captured,Not captured,
Not captured,Not captured,05/09/2019,Not captured,Not captured,863949,020,00072,ARS-01-0049868,Beacon International,Not captured,Not captured,Not captured,,,,O&apos;Neill,Kelly,,10/03/1985,female,Not captured,Not captured,Not captured,Not captured,Not captured,Not captured,Not captured,Not captured,Not captured,Not captured,Not captured,Not captured,Not captured,,,Not captured,Not captured,Not captured,Not captured,1660 N LaSalle Dr,,Chicago,Illinois,60614,,,Not captured,Not captured,kellyanno@gmail.com,Not captured,701934205,,Not captured,Not captured,Not captured,Not captured,Not captured,Not captured,
Not captured,Not captured,05/09/2019,Not captured,Not captured,863949,020,00072,ARS-01-0049867,Beacon International,Not captured,Not captured,Not captured,,,,Amira,Ortal,,03/15/1988,female,Not captured,Not captured,Not captured,Not captured,Not captured,Not captured,Not captured,Not captured,Not captured,Not captured,Not captured,Not captured,Not captured,,,Not captured,Not captured,Not captured,Not captured,228 w 71st,,New York,New York,10023,,,Not captured,Not captured,danielh-e@hotmail.com,Not captured,701934204,,Not captured,Not captured,Not captured,Not captured,Not captured,Not captured,
Not captured,Not captured,05/09/2019,Not captured,Not captured,863949,020,00072,ARS-01-0049866,Beacon International,Not captured,Not captured,Not captured,,,,Hadow Ericson,Daniel,,12/29/1985,male,Not captured,Not captured,Not captured,Not captured,Not captured,Not captured,Not captured,Not captured,Not captured,Not captured,Not captured,Not captured,Not captured,,,Not captured,Not captured,Not captured,Not captured,228 w 71st,,New York,New York,10023,,,Not captured,Not captured,danielh-e@hotmail.com,Not captured,701934203,,Not captured,Not captured,Not captured,Not captured,Not captured,Not captured,
Not captured,Not captured,05/12/2019,Not captured,Not captured,863949,020,00072,ARS-01-0049861,Beacon International,Not captured,Not captured,Not captured,Passport(F264178),,,Conejo Aguilar,Milena Maria,,03/24/1964,female,Not captured,Not captured,Not captured,Not captured,Not captured,Not captured,Not captured,Not captured,Not captured,Not captured,Not captured,Not captured,Not captured,,,Not captured,Not captured,Not captured,Not captured,2425 Wilson Blvd,,Arlington,Virginia,22201,7038415641,,Not captured,Not captured,pamruthkumar@ncsc.org,Not captured,701934189,,Not captured,Not captured,Not captured,Not captured,Not captured,Not captured,
Not captured,Not captured,05/11/2019,Not captured,Not captured,863949,020,00072,ARS-01-0049860,Beacon International,Not captured,Not captured,Not captured,Passport(AAB528037),,,Breide Obeid,Maximiliano Luis,,11/03/1976,male,Not captured,Not captured,Not captured,Not captured,Not captured,Not captured,Not captured,Not captured,Not captured,Not captured,Not captured,Not captured,Not captured,,,Not captured,Not captured,Not captured,Not captured,2425 Wilson Blvd,,Arlington,Virginia,22201,7038415641,,Not captured,Not captured,pamruthkumar@ncsc.org,Not captured,701934188,,Not captured,Not captured,Not captured,Not captured,Not captured,Not captured,
Not captured,Not captured,05/10/2019,Not captured,Not captured,863949,020,00072,ARS-03-0049854,Essential International,Not captured,Not captured,Not captured,Passport(n/a),,,Makarenko,Estelle,,01/22/1983,female,Not captured,Not captured,Not captured,Not captured,Not captured,Not captured,Not captured,Not captured,Not captured,Not captured,Not captured,Not captured,Not captured,,,Not captured,Not captured,Not captured,Not captured,Appt RA 70th Floor Tower 2,,Le Prestige Lohas Park,New Territories,00000,85264259309,,Not captured,Not captured,john.haisch@taylorbrunswick.com,Not captured,701934149,,Not captured,Not captured,Not captured,Not captured,Not captured,Not captured,
Not captured,Not captured,05/09/2019,Not captured,Not captured,863949,020,00072,ARS-01-0049855,Beacon International,Not captured,Not captured,Not captured,,,,Jhamb,Aroon,,12/17/1986,male,Not captured,Not captured,Not captured,Not captured,Not captured,Not captured,Not captured,Not captured,Not captured,Not captured,Not captured,Not captured,Not captured,,,Not captured,Not captured,Not captured,Not captured,45 Hoyt Street,,Brooklyn,New York,11201,,,Not captured,Not captured,aj1500@nyu.edu,Not captured,701934150,,Not captured,Not captured,Not captured,Not captured,Not captured,Not captured,
Not captured,Not captured,05/09/2019,Not captured,Not captured,863949,020,00072,ARS-01-0049853,Beacon International,Not captured,Not captured,Not captured,,,,Sassoon,Scott,,05/08/1974,male,Not captured,Not captured,Not captured,Not captured,Not captured,Not captured,Not captured,Not captured,Not captured,Not captured,Not captured,Not captured,Not captured,,,Not captured,Not captured,Not captured,Not captured,7 E. 14th St.,,New York,New York,10003,,,Not captured,Not captured,maya.lin@gmail.com,Not captured,701934148,,Not captured,Not captured,Not captured,Not captured,Not captured,Not captured,
Not captured,Not captured,05/09/2019,Not captured,Not captured,863949,020,00072,ARS-01-0049852,Beacon International,Not captured,Not captured,Not captured,,,,Lin,Maya,,03/18/1983,female,Not captured,Not captured,Not captured,Not captured,Not captured,Not captured,Not captured,Not captured,Not captured,Not captured,Not captured,Not captured,Not captured,,,Not captured,Not captured,Not captured,Not captured,7 E. 14th St.,,New York,New York,10003,,,Not captured,Not captured,maya.lin@gmail.com,Not captured,701934147,,Not captured,Not captured,Not captured,Not captured,Not captured,Not captured,
Not captured,Not captured,05/09/2019,Not captured,Not captured,863949,020,00072,ARS-03-0049824,Essential America,Not captured,Not captured,Not captured,Passport(J7850280),,,Geeda,Shravya,,01/22/1992,female,Not captured,Not captured,Not captured,Not captured,Not captured,Not captured,Not captured,Not captured,Not captured,Not captured,Not captured,Not captured,Not captured,,,Not captured,Not captured,Not captured,Not captured,Flat 504-Mr Residency,,Warangal,Andhra Pradesh,00000,0000000,,Not captured,Not captured,reddy.shravya22@gmail.com,Not captured,701934087,,Not captured,Not captured,Not captured,Not captured,Not captured,Not captured,
Not captured,Not captured,05/09/2019,Not captured,Not captured,863949,020,00072,ARS-01-0049849,Beacon International,Not captured,Not captured,Not captured,,,,Schultz,Aylit,,05/09/1975,female,Not captured,Not captured,Not captured,Not captured,Not captured,Not captured,Not captured,Not captured,Not captured,Not captured,Not captured,Not captured,Not captured,,,Not captured,Not captured,Not captured,Not captured,19 Harris Street,,Brookline,Massachusetts,02446,,,Not captured,Not captured,aylitscharf@gmail.com,Not captured,701934113,,Not captured,Not captured,Not captured,Not captured,Not captured,Not captured,
Not captured,Not captured,05/09/2019,Not captured,Not captured,863949,020,00072,ARS-01-0049835,Beacon International,Not captured,Not captured,Not captured,,,,Evans,Nashun,,09/18/1981,male,Not captured,Not captured,Not captured,Not captured,Not captured,Not captured,Not captured,Not captured,Not captured,Not captured,Not captured,Not captured,Not captured,,,Not captured,Not captured,Not captured,Not captured,2611 Ross Ave,,Dallas,Texas,75201,,,Not captured,Not captured,michellej_77026@yahoo.com,Not captured,701934099,,Not captured,Not captured,Not captured,Not captured,Not captured,Not captured,
Not captured,Not captured,05/09/2019,Not captured,Not captured,863949,020,00072,ARS-01-0049834,Beacon International,Not captured,Not captured,Not captured,,,,Jackson,Michelle,,10/18/1975,female,Not captured,Not captured,Not captured,Not captured,Not captured,Not captured,Not captured,Not captured,Not captured,Not captured,Not captured,Not captured,Not captured,,,Not captured,Not captured,Not captured,Not captured,2611 Ross Ave,,Dallas,Texas,75201,,,Not captured,Not captured,michellej_77026@yahoo.com,Not captured,701934098,,Not captured,Not captured,Not captured,Not captured,Not captured,Not captured,