EE Transaction Type,Dependent Transaction Type,Effective Date,EE Signature,EE Signature Date,Control,Suffix,Account,Plan Number,Plan Name,Claim Office,Network ID Number,Customer Code,EE SSN,Dependent SSN,Dependent Relationship,Last Name,First Name,Middle Initial,DOB,Gender,Ethnicity,PCP/PCD,PCP/PCD Current Patient,Provider Cap Office Number,COB,Dep Student Indicator,Dep OOA Indicator,EE Prior Coverage Indicator,EE Late Entrant,EE Language Indicator,Hire Date,Earnings,Earnings Frequency,Beneficiary (Last Name First Name MI),Beneficiary Relationship,Continuation of Coverage Expiration Date,Continuation of Coverage Event Date,Continuation of Coverage Length of Coverage,Work Location Zip Code,Street Address Line 1,Street Address Line 2,City,State,Zip Code,Home Phone Number,Work Phone Number,Accept Code,Evidence Code,EE Email Address,Communication Disability Code,EE Alternate ID,Dep Alternate ID,Old Control,Old Suffix,Old Account,New Control,New Suffix,New Account,
Not captured,Not captured,05/18/2019,Not captured,Not captured,863949,020,00072,ARS-01-0050069,Beacon International,Not captured,Not captured,Not captured,,,,Huang,Jessica,S,08/12/1967,female,Not captured,Not captured,Not captured,Not captured,Not captured,Not captured,Not captured,Not captured,Not captured,Not captured,Not captured,Not captured,Not captured,,,Not captured,Not captured,Not captured,Not captured,1832 Elmhurst Cir,,Claremont,California,91711,,,Not captured,Not captured,jessica@jackco.com,Not captured,701934869,,Not captured,Not captured,Not captured,Not captured,Not captured,Not captured,
Not captured,Not captured,05/18/2019,Not captured,Not captured,863949,020,00072,ARS-01-0050068,Beacon International,Not captured,Not captured,Not captured,,,,Ng,Raymond,W,10/31/1958,male,Not captured,Not captured,Not captured,Not captured,Not captured,Not captured,Not captured,Not captured,Not captured,Not captured,Not captured,Not captured,Not captured,,,Not captured,Not captured,Not captured,Not captured,1832 Elmhurst Cir,,Claremont,California,91711,,,Not captured,Not captured,jessica@jackco.com,Not captured,701934868,,Not captured,Not captured,Not captured,Not captured,Not captured,Not captured,
Not captured,Not captured,05/18/2019,Not captured,Not captured,863949,020,00072,ARS-01-0050066,Beacon International,Not captured,Not captured,Not captured,,,,Budapesti,Ilona,S,03/11/1983,female,Not captured,Not captured,Not captured,Not captured,Not captured,Not captured,Not captured,Not captured,Not captured,Not captured,Not captured,Not captured,Not captured,,,Not captured,Not captured,Not captured,Not captured,310 Crescent Village Circle,,San Jose,California,95134,,,Not captured,Not captured,ilona.budapesti@gmail.com,Not captured,701934866,,Not captured,Not captured,Not captured,Not captured,Not captured,Not captured,
Not captured,Not captured,05/18/2019,Not captured,Not captured,863949,020,00072,ARS-01-0050062,Beacon International,Not captured,Not captured,Not captured,,,,Dunk,Tamara,D,10/23/1957,female,Not captured,Not captured,Not captured,Not captured,Not captured,Not captured,Not captured,Not captured,Not captured,Not captured,Not captured,Not captured,Not captured,,,Not captured,Not captured,Not captured,Not captured,16168 167th Avenue SE,,Renton,Washington,98058-4230,,,Not captured,Not captured,dddunk@gmail.com,Not captured,701934862,,Not captured,Not captured,Not captured,Not captured,Not captured,Not captured,
Not captured,Not captured,05/18/2019,Not captured,Not captured,863949,020,00072,ARS-01-0050061,Beacon International,Not captured,Not captured,Not captured,,,,Dunk,David,D,05/17/1957,male,Not captured,Not captured,Not captured,Not captured,Not captured,Not captured,Not captured,Not captured,Not captured,Not captured,Not captured,Not captured,Not captured,,,Not captured,Not captured,Not captured,Not captured,16168 167th Avenue SE,,Renton,Washington,98058-4230,,,Not captured,Not captured,dddunk@gmail.com,Not captured,701934861,,Not captured,Not captured,Not captured,Not captured,Not captured,Not captured,
Not captured,Not captured,05/18/2019,Not captured,Not captured,863949,020,00072,ARS-01-0050060,Beacon International,Not captured,Not captured,Not captured,,,,Fletcher,Zachery,,08/07/1998,male,Not captured,Not captured,Not captured,Not captured,Not captured,Not captured,Not captured,Not captured,Not captured,Not captured,Not captured,Not captured,Not captured,,,Not captured,Not captured,Not captured,Not captured,PO Box 94,,Indianola,Washington,98342,,,Not captured,Not captured,elirai70@gmail.com,Not captured,701934860,,Not captured,Not captured,Not captured,Not captured,Not captured,Not captured,
Not captured,Not captured,05/18/2019,Not captured,Not captured,863949,020,00072,ARS-01-0050059,Beacon International,Not captured,Not captured,Not captured,,,,Rain,Kira,,02/08/1999,female,Not captured,Not captured,Not captured,Not captured,Not captured,Not captured,Not captured,Not captured,Not captured,Not captured,Not captured,Not captured,Not captured,,,Not captured,Not captured,Not captured,Not captured,PO Box 94,,Indianola,Washington,98342,,,Not captured,Not captured,elirai70@gmail.com,Not captured,701934859,,Not captured,Not captured,Not captured,Not captured,Not captured,Not captured,
Not captured,Not captured,05/18/2019,Not captured,Not captured,863949,020,00072,ARS-01-0050058,Beacon International,Not captured,Not captured,Not captured,,,,Rain,Nils,,10/24/1970,male,Not captured,Not captured,Not captured,Not captured,Not captured,Not captured,Not captured,Not captured,Not captured,Not captured,Not captured,Not captured,Not captured,,,Not captured,Not captured,Not captured,Not captured,PO Box 94,,Indianola,Washington,98342,,,Not captured,Not captured,elirai70@gmail.com,Not captured,701934858,,Not captured,Not captured,Not captured,Not captured,Not captured,Not captured,
Not captured,Not captured,05/18/2019,Not captured,Not captured,863949,020,00072,ARS-01-0050057,Beacon International,Not captured,Not captured,Not captured,,,,Rain,Elisha,,06/20/1970,female,Not captured,Not captured,Not captured,Not captured,Not captured,Not captured,Not captured,Not captured,Not captured,Not captured,Not captured,Not captured,Not captured,,,Not captured,Not captured,Not captured,Not captured,PO Box 94,,Indianola,Washington,98342,,,Not captured,Not captured,elirai70@gmail.com,Not captured,701934857,,Not captured,Not captured,Not captured,Not captured,Not captured,Not captured,
Not captured,Not captured,05/17/2019,Not captured,Not captured,863949,020,00072,ARS-01-0050054,Beacon International,Not captured,Not captured,Not captured,,,,Santi,Candelaria,,09/26/1989,female,Not captured,Not captured,Not captured,Not captured,Not captured,Not captured,Not captured,Not captured,Not captured,Not captured,Not captured,Not captured,Not captured,,,Not captured,Not captured,Not captured,Not captured,1914 Selby Ave,,Los Angeles,California,90025,,,Not captured,Not captured,candelaria.santi@hotmail.com,Not captured,701934854,,Not captured,Not captured,Not captured,Not captured,Not captured,Not captured,
Not captured,Not captured,05/17/2019,Not captured,Not captured,863949,020,00072,ARS-01-0050039,Beacon International,Not captured,Not captured,Not captured,,,,Bonitz,Ryan,,05/02/1996,female,Not captured,Not captured,Not captured,Not captured,Not captured,Not captured,Not captured,Not captured,Not captured,Not captured,Not captured,Not captured,Not captured,,,Not captured,Not captured,Not captured,Not captured,9 Longview Court,,Huntington,New York,11743,,,Not captured,Not captured,bonitz@optonline.net,Not captured,701934703,,Not captured,Not captured,Not captured,Not captured,Not captured,Not captured,
Not captured,Not captured,05/17/2019,Not captured,Not captured,863949,020,00072,ARS-01-0050038,Beacon International,Not captured,Not captured,Not captured,,,,Bonitz,Lynn,,10/13/1962,female,Not captured,Not captured,Not captured,Not captured,Not captured,Not captured,Not captured,Not captured,Not captured,Not captured,Not captured,Not captured,Not captured,,,Not captured,Not captured,Not captured,Not captured,9 Longview Court,,Huntington,New York,11743,,,Not captured,Not captured,bonitz@optonline.net,Not captured,701934702,,Not captured,Not captured,Not captured,Not captured,Not captured,Not captured,
Not captured,Not captured,05/17/2019,Not captured,Not captured,863949,020,00072,ARS-01-0050037,Beacon International,Not captured,Not captured,Not captured,,,,Hanson-Clerc,Kay,E,04/05/1952,female,Not captured,Not captured,Not captured,Not captured,Not captured,Not captured,Not captured,Not captured,Not captured,Not captured,Not captured,Not captured,Not captured,,,Not captured,Not captured,Not captured,Not captured,11430 Lakeside Place Drive,,Houston,Texas,77077,,,Not captured,Not captured,kehclerc@gmail.com,Not captured,701934701,,Not captured,Not captured,Not captured,Not captured,Not captured,Not captured,
Not captured,Not captured,05/17/2019,Not captured,Not captured,863949,020,00072,ARS-01-0050036,Beacon International,Not captured,Not captured,Not captured,,,,Emerick,Patrick,,05/14/1963,male,Not captured,Not captured,Not captured,Not captured,Not captured,Not captured,Not captured,Not captured,Not captured,Not captured,Not captured,Not captured,Not captured,,,Not captured,Not captured,Not captured,Not captured,1623 James Drive,,Carlsbad,California,92008,,,Not captured,Not captured,hlefrois@yahoo.com,Not captured,701934700,,Not captured,Not captured,Not captured,Not captured,Not captured,Not captured,
Not captured,Not captured,05/17/2019,Not captured,Not captured,863949,020,00072,ARS-01-0050035,Beacon International,Not captured,Not captured,Not captured,,,,LeFrois,Holly,,07/24/1963,female,Not captured,Not captured,Not captured,Not captured,Not captured,Not captured,Not captured,Not captured,Not captured,Not captured,Not captured,Not captured,Not captured,,,Not captured,Not captured,Not captured,Not captured,1623 James Drive,,Carlsbad,California,92008,,,Not captured,Not captured,hlefrois@yahoo.com,Not captured,701934699,,Not captured,Not captured,Not captured,Not captured,Not captured,Not captured,
Not captured,Not captured,05/17/2019,Not captured,Not captured,863949,020,00072,ARS-01-0050034,Beacon International,Not captured,Not captured,Not captured,,,,Hilferty,Joanne,K,09/24/1950,male,Not captured,Not captured,Not captured,Not captured,Not captured,Not captured,Not captured,Not captured,Not captured,Not captured,Not captured,Not captured,Not captured,,,Not captured,Not captured,Not captured,Not captured,46 Avon Street,,Cambridge,Massachusetts,02138,,,Not captured,Not captured,joanne.hilferty@gmail.com,Not captured,701934698,,Not captured,Not captured,Not captured,Not captured,Not captured,Not captured,
Not captured,Not captured,05/17/2019,Not captured,Not captured,863949,020,00072,ARS-02-0050033,Beacon America,Not captured,Not captured,Not captured,,,,Jadraque,Nenita,B,02/27/1951,female,Not captured,Not captured,Not captured,Not captured,Not captured,Not captured,Not captured,Not captured,Not captured,Not captured,Not captured,Not captured,Not captured,,,Not captured,Not captured,Not captured,Not captured,414 Fortune Crescent,,Rosetown,Saskatchewan,S0l2v0,,,Not captured,Not captured,glaizatolentino19@yahoo.ca,Not captured,701934697,,Not captured,Not captured,Not captured,Not captured,Not captured,Not captured,
Not captured,Not captured,05/16/2019,Not captured,Not captured,863949,020,00072,ARS-02-0050026,Beacon America,Not captured,Not captured,Not captured,Passport(069678574),,,Landaeta,maria Fernanda,,10/29/1994,female,Not captured,Not captured,Not captured,Not captured,Not captured,Not captured,Not captured,Not captured,Not captured,Not captured,Not captured,Not captured,Not captured,Yalitza Lamus,Madre,Not captured,Not captured,Not captured,Not captured,2490 provence cr,,Weston,Fl,33027,9548516745,,Not captured,Not captured,mafelandaetalamus@gmail.com,Not captured,701934680,,Not captured,Not captured,Not captured,Not captured,Not captured,Not captured,
Not captured,Not captured,05/16/2019,Not captured,Not captured,863949,020,00072,ARS-01-0050025,Beacon International,Not captured,Not captured,Not captured,Passport(069678600),,,Landaeta,maria Alejandra,,10/29/1994,female,Not captured,Not captured,Not captured,Not captured,Not captured,Not captured,Not captured,Not captured,Not captured,Not captured,Not captured,Not captured,Not captured,Yalitza Lamus,Madre,Not captured,Not captured,Not captured,Not captured,8035 nw 117 way,,coral spring,Florida,33076,954 851 6550,,Not captured,Not captured,mariaalandaeta@gmail.com,Not captured,701934679,,Not captured,Not captured,Not captured,Not captured,Not captured,Not captured,
Not captured,Not captured,05/16/2019,Not captured,Not captured,863949,020,00072,ARS-01-0050019,Beacon International,Not captured,Not captured,Not captured,,,,Staples,David,L,09/04/1970,male,Not captured,Not captured,Not captured,Not captured,Not captured,Not captured,Not captured,Not captured,Not captured,Not captured,Not captured,Not captured,Not captured,,,Not captured,Not captured,Not captured,Not captured,1407 Noe Street,,San Francisco,California,94131,,,Not captured,Not captured,davidstaples01@hotmail.com,Not captured,701934619,,Not captured,Not captured,Not captured,Not captured,Not captured,Not captured,
Not captured,Not captured,05/16/2019,Not captured,Not captured,863949,020,00072,ARS-03-0050003,Essential America,Not captured,Not captured,Not captured,Passport(NA),,,GROLLEAU,VICTOR,,09/30/1995,male,Not captured,Not captured,Not captured,Not captured,Not captured,Not captured,Not captured,Not captured,Not captured,Not captured,Not captured,Not captured,Not captured,,,Not captured,Not captured,Not captured,Not captured,2020 N BAYSHORE DR APT 1808,,MIAMI,Florida,33137,3059031109,,Not captured,Not captured,ericgrolleau8@gmail.com,Not captured,701934553,,Not captured,Not captured,Not captured,Not captured,Not captured,Not captured,
Not captured,Not captured,05/16/2019,Not captured,Not captured,863949,020,00072,ARS-01-0050018,Beacon International,Not captured,Not captured,Not captured,,,,Scott,Judith,L,05/31/1954,female,Not captured,Not captured,Not captured,Not captured,Not captured,Not captured,Not captured,Not captured,Not captured,Not captured,Not captured,Not captured,Not captured,,,Not captured,Not captured,Not captured,Not captured,1714 Warwickshire Dr,,Houston,Texas,77077,,,Not captured,Not captured,judithl.scott@gmail.com,Not captured,701934618,,Not captured,Not captured,Not captured,Not captured,Not captured,Not captured,
Not captured,Not captured,05/16/2019,Not captured,Not captured,863949,020,00072,ARS-02-0050017,Beacon America,Not captured,Not captured,Not captured,Passport(104723698),,,Garcia,Manuel,,02/16/1986,male,Not captured,Not captured,Not captured,Not captured,Not captured,Not captured,Not captured,Not captured,Not captured,Not captured,Not captured,Not captured,Not captured,mireya garcia,hermana,Not captured,Not captured,Not captured,Not captured,Av Israel San Francisco Bay torre 500 13-C,,Panama,Panam&aacute;,0831,66444644,,Not captured,Not captured,mjgarcia75@gmail.com,Not captured,701934617,,Not captured,Not captured,Not captured,Not captured,Not captured,Not captured,
Not captured,Not captured,05/15/2019,Not captured,Not captured,863949,020,00072,ARS-01-0050013,Beacon International,Not captured,Not captured,Not captured,,,,itskovits,rachel,,01/08/1993,female,Not captured,Not captured,Not captured,Not captured,Not captured,Not captured,Not captured,Not captured,Not captured,Not captured,Not captured,Not captured,Not captured,,,Not captured,Not captured,Not captured,Not captured,15 getzil berger blvd #202,,monroe,New York,10950,,,Not captured,Not captured,joitsko@hotmail.com,Not captured,701934613,,Not captured,Not captured,Not captured,Not captured,Not captured,Not captured,
Not captured,Not captured,05/15/2019,Not captured,Not captured,863949,020,00072,ARS-01-0050012,Beacon International,Not captured,Not captured,Not captured,,,,itskovits,rifka,,02/14/1973,female,Not captured,Not captured,Not captured,Not captured,Not captured,Not captured,Not captured,Not captured,Not captured,Not captured,Not captured,Not captured,Not captured,,,Not captured,Not captured,Not captured,Not captured,15 getzil berger blvd #202,,monroe,New York,10950,,,Not captured,Not captured,joitsko@hotmail.com,Not captured,701934612,,Not captured,Not captured,Not captured,Not captured,Not captured,Not captured,
Not captured,Not captured,05/15/2019,Not captured,Not captured,863949,020,00072,ARS-01-0050011,Beacon International,Not captured,Not captured,Not captured,,,,itskovits,josef,,05/17/1972,male,Not captured,Not captured,Not captured,Not captured,Not captured,Not captured,Not captured,Not captured,Not captured,Not captured,Not captured,Not captured,Not captured,,,Not captured,Not captured,Not captured,Not captured,15 getzil berger blvd #202,,monroe,New York,10950,,,Not captured,Not captured,joitsko@hotmail.com,Not captured,701934611,,Not captured,Not captured,Not captured,Not captured,Not captured,Not captured,
Not captured,Not captured,05/16/2019,Not captured,Not captured,863949,020,00072,OVI-28-0050009,OverseasCare Visitors Insurance Plan,Not captured,Not captured,Not captured,Passport(L3777457),,,VEDACHALAM,SATHANANDAM,,06/10/1958,male,Not captured,Not captured,Not captured,Not captured,Not captured,Not captured,Not captured,Not captured,Not captured,Not captured,Not captured,Not captured,Not captured,SARANYA SATHANANDAM,DAUGHTER,Not captured,Not captured,Not captured,Not captured,3873 PONDEROSA PEAK DR,,SPRING,Texas,77386,8322746980,,Not captured,Not captured,SSASIKUMAR83@GMAIL.COM,Not captured,701934609,,Not captured,Not captured,Not captured,Not captured,Not captured,Not captured,
Not captured,Not captured,05/17/2019,Not captured,Not captured,863949,020,00072,ARS-01-0050008,Beacon International,Not captured,Not captured,Not captured,Passport(PA8806886),,,Lumley,Philippa,,08/03/1986,female,Not captured,Not captured,Not captured,Not captured,Not captured,Not captured,Not captured,Not captured,Not captured,Not captured,Not captured,Not captured,Not captured,Oliver Wards,Partner,Not captured,Not captured,Not captured,Not captured,403/22 COLGATE AVE,,SYDNEY,New South Wales,2041,+61402923046,,Not captured,Not captured,PHILIPPALUMLEY@GMAIL.COM,Not captured,701934607,,Not captured,Not captured,Not captured,Not captured,Not captured,Not captured,
Not captured,Not captured,05/16/2019,Not captured,Not captured,863949,020,00072,OVI-28-0050007,OverseasCare Visitors Insurance Plan,Not captured,Not captured,Not captured,Passport(N8328294),,,Juturu,Vijaya Lakshmi,,05/31/1964,female,Not captured,Not captured,Not captured,Not captured,Not captured,Not captured,Not captured,Not captured,Not captured,Not captured,Not captured,Not captured,Not captured,Vijaya Lakshmi Juturu,self,Not captured,Not captured,Not captured,Not captured,2229 hunters ct,,Sterling Heights,Michigan,48310,8476877575,,Not captured,Not captured,pvreddie@hotmail.com,Not captured,701934606,,Not captured,Not captured,Not captured,Not captured,Not captured,Not captured,
Not captured,Not captured,05/16/2019,Not captured,Not captured,863949,020,00072,OVI-28-0050006,OverseasCare Visitors Insurance Plan,Not captured,Not captured,Not captured,Passport(N8326480),,,Juturu,Eswara Reddy,,08/01/1963,male,Not captured,Not captured,Not captured,Not captured,Not captured,Not captured,Not captured,Not captured,Not captured,Not captured,Not captured,Not captured,Not captured,Eswar Reddy Juturu,self,Not captured,Not captured,Not captured,Not captured,2229 Hunters Ct,,Sterling Heights,Michigan,48310,8476877575,,Not captured,Not captured,apjuturu@gmail.com,Not captured,701934605,,Not captured,Not captured,Not captured,Not captured,Not captured,Not captured,
Not captured,Not captured,05/16/2019,Not captured,Not captured,863949,020,00072,ARS-01-0050005,Beacon International,Not captured,Not captured,Not captured,,,,Pallett,James,,11/05/1978,male,Not captured,Not captured,Not captured,Not captured,Not captured,Not captured,Not captured,Not captured,Not captured,Not captured,Not captured,Not captured,Not captured,,,Not captured,Not captured,Not captured,Not captured,122 Marsh Drive,,Fairfield,Connecticut,06824-4004,,,Not captured,Not captured,carvalhodavid60@yahoo.com,Not captured,701934555,,Not captured,Not captured,Not captured,Not captured,Not captured,Not captured,
Not captured,Not captured,05/16/2019,Not captured,Not captured,863949,020,00072,ARS-01-0050004,Beacon International,Not captured,Not captured,Not captured,,,,Carvalho,David,,05/18/1977,male,Not captured,Not captured,Not captured,Not captured,Not captured,Not captured,Not captured,Not captured,Not captured,Not captured,Not captured,Not captured,Not captured,,,Not captured,Not captured,Not captured,Not captured,122 Marsh Drive,,Fairfield,Connecticut,06824-4004,,,Not captured,Not captured,carvalhodavid60@yahoo.com,Not captured,701934554,,Not captured,Not captured,Not captured,Not captured,Not captured,Not captured,
Not captured,Not captured,05/15/2019,Not captured,Not captured,863949,020,00072,ARS-03-0049990,Essential America,Not captured,Not captured,Not captured,Passport(NA),,,COWLEY,WILLIAM,,02/19/1989,male,Not captured,Not captured,Not captured,Not captured,Not captured,Not captured,Not captured,Not captured,Not captured,Not captured,Not captured,Not captured,Not captured,,,Not captured,Not captured,Not captured,Not captured,96 DOUGLAS FISH CAMP RD,,WHITE OAK,Georgia,31568,9122227823,,Not captured,Not captured,wpcowley@g.cofc.edu,Not captured,701934457,,Not captured,Not captured,Not captured,Not captured,Not captured,Not captured,
Not captured,Not captured,05/15/2019,Not captured,Not captured,863949,020,00072,ARS-01-0049999,Beacon International,Not captured,Not captured,Not captured,,,,Howard,Glenn,R,08/24/1961,male,Not captured,Not captured,Not captured,Not captured,Not captured,Not captured,Not captured,Not captured,Not captured,Not captured,Not captured,Not captured,Not captured,,,Not captured,Not captured,Not captured,Not captured,237 Addison Way,,Titusville,Florida,32780,,,Not captured,Not captured,howard.glennr@gmail.com,Not captured,701934549,,Not captured,Not captured,Not captured,Not captured,Not captured,Not captured,
Not captured,Not captured,05/15/2019,Not captured,Not captured,863949,020,00072,ARS-01-0049997,Beacon International,Not captured,Not captured,Not captured,,,,Trangmar,Philip,R,06/24/1964,male,Not captured,Not captured,Not captured,Not captured,Not captured,Not captured,Not captured,Not captured,Not captured,Not captured,Not captured,Not captured,Not captured,,,Not captured,Not captured,Not captured,Not captured,Sea Salt,,Saline,,97133,,,Not captured,Not captured,benthemonkeyrock@hotmail.com,Not captured,701934547,,Not captured,Not captured,Not captured,Not captured,Not captured,Not captured,
Not captured,Not captured,05/14/2019,Not captured,Not captured,863949,020,00072,ARS-01-0049995,Beacon International,Not captured,Not captured,Not captured,Passport(565802754),,,Yeganov,Vladislav,L,03/03/1964,male,Not captured,Not captured,Not captured,Not captured,Not captured,Not captured,Not captured,Not captured,Not captured,Not captured,Not captured,Not captured,Not captured,,,Not captured,Not captured,Not captured,Not captured,712 N Washington Ave,,Dallas,Texas,75246,469-360-8468,,Not captured,Not captured,yeganov@sbcglobal.net,Not captured,701934515,,Not captured,Not captured,Not captured,Not captured,Not captured,Not captured,