EE Transaction Type,Dependent Transaction Type,Effective Date,EE Signature,EE Signature Date,Control,Suffix,Account,Plan Number,Plan Name,Claim Office,Network ID Number,Customer Code,EE SSN,Dependent SSN,Dependent Relationship,Last Name,First Name,Middle Initial,DOB,Gender,Ethnicity,PCP/PCD,PCP/PCD Current Patient,Provider Cap Office Number,COB,Dep Student Indicator,Dep OOA Indicator,EE Prior Coverage Indicator,EE Late Entrant,EE Language Indicator,Hire Date,Earnings,Earnings Frequency,Beneficiary (Last Name First Name MI),Beneficiary Relationship,Continuation of Coverage Expiration Date,Continuation of Coverage Event Date,Continuation of Coverage Length of Coverage,Work Location Zip Code,Street Address Line 1,Street Address Line 2,City,State,Zip Code,Home Phone Number,Work Phone Number,Accept Code,Evidence Code,EE Email Address,Communication Disability Code,EE Alternate ID,Dep Alternate ID,Old Control,Old Suffix,Old Account,New Control,New Suffix,New Account,
Not captured,Not captured,05/27/2019,Not captured,Not captured,863949,020,00072,ARS-01-0050321,Beacon International,Not captured,Not captured,Not captured,,,,Kinsberg,Ari,,09/11/1974,male,Not captured,Not captured,Not captured,Not captured,Not captured,Not captured,Not captured,Not captured,Not captured,Not captured,Not captured,Not captured,Not captured,,,Not captured,Not captured,Not captured,Not captured,1852 Madison place,,Brooklyn,New York,11229,,,Not captured,Not captured,amkjudaica@hotmail.com,Not captured,701935485,,Not captured,Not captured,Not captured,Not captured,Not captured,Not captured,
Not captured,Not captured,05/27/2019,Not captured,Not captured,863949,020,00072,ARS-01-0050314,Beacon International,Not captured,Not captured,Not captured,,,,Bailey,William,A,12/09/1970,male,Not captured,Not captured,Not captured,Not captured,Not captured,Not captured,Not captured,Not captured,Not captured,Not captured,Not captured,Not captured,Not captured,,,Not captured,Not captured,Not captured,Not captured,3201 Tam Oshanter Lane,,Birmingham,Alabama,35242,,,Not captured,Not captured,andy@churchofthehighlands.com,Not captured,701935453,,Not captured,Not captured,Not captured,Not captured,Not captured,Not captured,
Not captured,Not captured,05/27/2019,Not captured,Not captured,863949,020,00072,OVI-28-0050312,OverseasCare Visitors Insurance Plan,Not captured,Not captured,Not captured,Passport(P8117419),,,Tamhankar,Gulab,B,11/15/1945,female,Not captured,Not captured,Not captured,Not captured,Not captured,Not captured,Not captured,Not captured,Not captured,Not captured,Not captured,Not captured,Not captured,Santosh B Tamhankar,Son,Not captured,Not captured,Not captured,Not captured,2929 Rancho Rio Chico,,Carlsbad,California,92009,7608283276,7605768086,Not captured,Not captured,santoshbt@hotmail.com,Not captured,701935451,,Not captured,Not captured,Not captured,Not captured,Not captured,Not captured,
Not captured,Not captured,05/27/2019,Not captured,Not captured,863949,020,00072,OVI-28-0050298,OverseasCare Visitors Insurance Plan,Not captured,Not captured,Not captured,Passport(K6581856),,,Tiwari,Vijaya,,08/01/1943,female,Not captured,Not captured,Not captured,Not captured,Not captured,Not captured,Not captured,Not captured,Not captured,Not captured,Not captured,Not captured,Not captured,Shashank Tiwari,Son,Not captured,Not captured,Not captured,Not captured,14923 Blakehill Dr,,Frisco,Texas,75035,7148878032,,Not captured,Not captured,SHASHANK_TIWARI@YAHOO.COM,Not captured,701935436,,Not captured,Not captured,Not captured,Not captured,Not captured,Not captured,
Not captured,Not captured,05/27/2019,Not captured,Not captured,863949,020,00072,OVI-28-0050295,OverseasCare Visitors Insurance Plan,Not captured,Not captured,Not captured,,,,Edupalli,Ramana,,03/10/1950,female,Not captured,Not captured,Not captured,Not captured,Not captured,Not captured,Not captured,Not captured,Not captured,Not captured,Not captured,Not captured,Not captured,srikanth edupalli,son,Not captured,Not captured,Not captured,Not captured,3070 whitfileld ave,,cumming,Georgia,30040,6784851842,,Not captured,Not captured,sriedupalli@gmail.com,Not captured,701935433,,Not captured,Not captured,Not captured,Not captured,Not captured,Not captured,
Not captured,Not captured,05/27/2019,Not captured,Not captured,863949,020,00072,OVI-28-0050294,OverseasCare Visitors Insurance Plan,Not captured,Not captured,Not captured,,,,Edupalli,Venkata Rao,,12/03/1945,male,Not captured,Not captured,Not captured,Not captured,Not captured,Not captured,Not captured,Not captured,Not captured,Not captured,Not captured,Not captured,Not captured,Srikanth Edupalli,Son,Not captured,Not captured,Not captured,Not captured,3070 Whitfield Ave,,Cumming,Georgia,30040,6788905878,,Not captured,Not captured,sriedupalli@gmail.com,Not captured,701935432,,Not captured,Not captured,Not captured,Not captured,Not captured,Not captured,
Not captured,Not captured,05/27/2019,Not captured,Not captured,863949,020,00072,ARS-01-0050254,Beacon International,Not captured,Not captured,Not captured,Passport(595949662),,,Sherman,Ilana,D,05/12/1999,female,Not captured,Not captured,Not captured,Not captured,Not captured,Not captured,Not captured,Not captured,Not captured,Not captured,Not captured,Not captured,Not captured,Andrew Sherman,Parent,Not captured,Not captured,Not captured,Not captured,9 Hyacinth Ct.,,Melville,New York,11747,631-501-0290,5166622608,Not captured,Not captured,andy@healthday.com,Not captured,701935334,,Not captured,Not captured,Not captured,Not captured,Not captured,Not captured,
Not captured,Not captured,05/27/2019,Not captured,Not captured,863949,020,00072,ARS-03-0049727,Essential America,Not captured,Not captured,Not captured,SSN(569717351),,,Presser,Jeremy,Stuart,05/20/1982,male,Not captured,Not captured,Not captured,Not captured,Not captured,Not captured,Not captured,Not captured,Not captured,Not captured,Not captured,Not captured,Not captured,,,Not captured,Not captured,Not captured,Not captured,12074 Summit Circle,,Beverly Hills,California,90210,(310) 271-7091,,Not captured,Not captured,J1press@gmail.com,Not captured,701933863,,Not captured,Not captured,Not captured,Not captured,Not captured,Not captured,
Not captured,Not captured,05/27/2019,Not captured,Not captured,863949,020,00072,ARS-03-0049727,Essential America,Not captured,Not captured,Not captured,,SSN(219130232),Spouse,Murch,Daniela,Miriam,12/27/1986,female,Not captured,Not captured,Not captured,Not captured,Not captured,Not captured,Not captured,Not captured,Not captured,Not captured,Not captured,Not captured,Not captured,,,Not captured,Not captured,Not captured,Not captured,12074 Summit Circle,,Beverly Hills,California,90210,(310) 271-7091,,Not captured,Not captured,J1press@gmail.com,Not captured,,701933864,Not captured,Not captured,Not captured,Not captured,Not captured,Not captured,
Not captured,Not captured,05/27/2019,Not captured,Not captured,863949,020,00072,OVI-28-0049219,OverseasCare Visitors Insurance Plan,Not captured,Not captured,Not captured,,,,Lakamraju,Radha Kumari,,05/28/1960,female,Not captured,Not captured,Not captured,Not captured,Not captured,Not captured,Not captured,Not captured,Not captured,Not captured,Not captured,Not captured,Not captured,Udaya Bhaskara Varma,Spouse,Not captured,Not captured,Not captured,Not captured,10114 Ida Grove Lane,,Austin,Texas,78717,6027403058,,Not captured,Not captured,NarenLV@gmail.com,Not captured,701932834,,Not captured,Not captured,Not captured,Not captured,Not captured,Not captured,
Not captured,Not captured,05/27/2019,Not captured,Not captured,863949,020,00072,OVI-28-0049218,OverseasCare Visitors Insurance Plan,Not captured,Not captured,Not captured,,,,Lakamraju,Udaya Bhaskara,V,07/01/1948,male,Not captured,Not captured,Not captured,Not captured,Not captured,Not captured,Not captured,Not captured,Not captured,Not captured,Not captured,Not captured,Not captured,Udaya Bhaskara Varma,Spouse,Not captured,Not captured,Not captured,Not captured,10114 Ida Grove Lane,,Austin,Texas,78717,6027403058,,Not captured,Not captured,NarenLV@gmail.com,Not captured,701932833,,Not captured,Not captured,Not captured,Not captured,Not captured,Not captured,
Not captured,Not captured,05/27/2019,Not captured,Not captured,863949,020,00072,ARS-01-0048644,Beacon International,Not captured,Not captured,Not captured,,,,Nagel,Lauren,,06/20/2000,female,Not captured,Not captured,Not captured,Not captured,Not captured,Not captured,Not captured,Not captured,Not captured,Not captured,Not captured,Not captured,Not captured,Bret Nagel,Spouse,Not captured,Not captured,Not captured,Not captured,5545 CARPENTER LN,,OZARK,Arkansas,729498039,4796352449,,Not captured,Not captured,tranag@yahoo.com,Not captured,701932023,,Not captured,Not captured,Not captured,Not captured,Not captured,Not captured,
Not captured,Not captured,05/27/2019,Not captured,Not captured,863949,020,00072,ARS-01-0048643,Beacon International,Not captured,Not captured,Not captured,,,,Nagel,Traci,,01/11/1972,female,Not captured,Not captured,Not captured,Not captured,Not captured,Not captured,Not captured,Not captured,Not captured,Not captured,Not captured,Not captured,Not captured,Bret Nagel,Spouse,Not captured,Not captured,Not captured,Not captured,5545 CARPENTER LN,,OZARK,Arkansas,729498039,4796352449,,Not captured,Not captured,tranag@yahoo.com,Not captured,701932022,,Not captured,Not captured,Not captured,Not captured,Not captured,Not captured,
Not captured,Not captured,06/16/2019,Not captured,Not captured,863949,020,00072,BG001030-24-e4bfa386,International Assurance,Not captured,Not captured,Not captured,-,-,,Koscheski,Seth,,08/23/1977,male,Not captured,Not captured,Not captured,Not captured,Not captured,Not captured,Not captured,Not captured,Not captured,Not captured,Not captured,Not captured,Not captured,,,Not captured,Not captured,Not captured,Not captured,P.O. Box 159,,Forsyth,Missouri,65653,4173310327,,Not captured,Not captured,salliehitch@gmail.com,Not captured,701935454,,Not captured,Not captured,Not captured,Not captured,Not captured,Not captured,
Not captured,Not captured,06/16/2019,Not captured,Not captured,863949,020,00072,BG001030-24-e4bfa386,International Assurance,Not captured,Not captured,Not captured,-,-,,Koscheski,Karissa,,12/13/1979,female,Not captured,Not captured,Not captured,Not captured,Not captured,Not captured,Not captured,Not captured,Not captured,Not captured,Not captured,Not captured,Not captured,,,Not captured,Not captured,Not captured,Not captured,P.O. Box 159,,Forsyth,Missouri,65653,4173310327,,Not captured,Not captured,salliehitch@gmail.com,Not captured,701935455,,Not captured,Not captured,Not captured,Not captured,Not captured,Not captured,
Not captured,Not captured,06/16/2019,Not captured,Not captured,863949,020,00072,BG001030-24-e4bfa386,International Assurance,Not captured,Not captured,Not captured,-,-,,Koscheski,Tristan,,07/27/2002,male,Not captured,Not captured,Not captured,Not captured,Not captured,Not captured,Not captured,Not captured,Not captured,Not captured,Not captured,Not captured,Not captured,,,Not captured,Not captured,Not captured,Not captured,P.O. Box 159,,Forsyth,Missouri,65653,4173310327,,Not captured,Not captured,salliehitch@gmail.com,Not captured,701935456,,Not captured,Not captured,Not captured,Not captured,Not captured,Not captured,
Not captured,Not captured,06/16/2019,Not captured,Not captured,863949,020,00072,BG001030-24-e4bfa386,International Assurance,Not captured,Not captured,Not captured,-,-,,Chambers,Jeremy,,07/07/1977,male,Not captured,Not captured,Not captured,Not captured,Not captured,Not captured,Not captured,Not captured,Not captured,Not captured,Not captured,Not captured,Not captured,,,Not captured,Not captured,Not captured,Not captured,P.O. Box 159,,Forsyth,Missouri,65653,4173310327,,Not captured,Not captured,salliehitch@gmail.com,Not captured,701935457,,Not captured,Not captured,Not captured,Not captured,Not captured,Not captured,
Not captured,Not captured,06/16/2019,Not captured,Not captured,863949,020,00072,BG001030-24-e4bfa386,International Assurance,Not captured,Not captured,Not captured,-,-,,Chambers,Karissa,,07/12/2000,female,Not captured,Not captured,Not captured,Not captured,Not captured,Not captured,Not captured,Not captured,Not captured,Not captured,Not captured,Not captured,Not captured,,,Not captured,Not captured,Not captured,Not captured,P.O. Box 159,,Forsyth,Missouri,65653,4173310327,,Not captured,Not captured,salliehitch@gmail.com,Not captured,701935458,,Not captured,Not captured,Not captured,Not captured,Not captured,Not captured,
Not captured,Not captured,06/16/2019,Not captured,Not captured,863949,020,00072,BG001030-24-e4bfa386,International Assurance,Not captured,Not captured,Not captured,-,-,,Chambers,Hunter,,12/19/2004,male,Not captured,Not captured,Not captured,Not captured,Not captured,Not captured,Not captured,Not captured,Not captured,Not captured,Not captured,Not captured,Not captured,,,Not captured,Not captured,Not captured,Not captured,P.O. Box 159,,Forsyth,Missouri,65653,4173310327,,Not captured,Not captured,salliehitch@gmail.com,Not captured,701935459,,Not captured,Not captured,Not captured,Not captured,Not captured,Not captured,
Not captured,Not captured,06/16/2019,Not captured,Not captured,863949,020,00072,BG001030-24-e4bfa386,International Assurance,Not captured,Not captured,Not captured,-,-,,Chambers,Stephanie,,05/01/1978,female,Not captured,Not captured,Not captured,Not captured,Not captured,Not captured,Not captured,Not captured,Not captured,Not captured,Not captured,Not captured,Not captured,,,Not captured,Not captured,Not captured,Not captured,P.O. Box 159,,Forsyth,Missouri,65653,4173310327,,Not captured,Not captured,salliehitch@gmail.com,Not captured,701935460,,Not captured,Not captured,Not captured,Not captured,Not captured,Not captured,
Not captured,Not captured,06/16/2019,Not captured,Not captured,863949,020,00072,BG001030-24-e4bfa386,International Assurance,Not captured,Not captured,Not captured,-,-,,Nuss,Makyla,,12/20/2000,female,Not captured,Not captured,Not captured,Not captured,Not captured,Not captured,Not captured,Not captured,Not captured,Not captured,Not captured,Not captured,Not captured,,,Not captured,Not captured,Not captured,Not captured,P.O. Box 159,,Forsyth,Missouri,65653,4173310327,,Not captured,Not captured,salliehitch@gmail.com,Not captured,701935461,,Not captured,Not captured,Not captured,Not captured,Not captured,Not captured,
Not captured,Not captured,06/16/2019,Not captured,Not captured,863949,020,00072,BG001030-24-e4bfa386,International Assurance,Not captured,Not captured,Not captured,-,-,,Nuss,Makenlee,,05/22/2002,female,Not captured,Not captured,Not captured,Not captured,Not captured,Not captured,Not captured,Not captured,Not captured,Not captured,Not captured,Not captured,Not captured,,,Not captured,Not captured,Not captured,Not captured,P.O. Box 159,,Forsyth,Missouri,65653,4173310327,,Not captured,Not captured,salliehitch@gmail.com,Not captured,701935462,,Not captured,Not captured,Not captured,Not captured,Not captured,Not captured,
Not captured,Not captured,06/16/2019,Not captured,Not captured,863949,020,00072,BG001030-24-e4bfa386,International Assurance,Not captured,Not captured,Not captured,-,-,,Richerson,Tony ,,12/31/1982,male,Not captured,Not captured,Not captured,Not captured,Not captured,Not captured,Not captured,Not captured,Not captured,Not captured,Not captured,Not captured,Not captured,,,Not captured,Not captured,Not captured,Not captured,P.O. Box 159,,Forsyth,Missouri,65653,4173310327,,Not captured,Not captured,salliehitch@gmail.com,Not captured,701935463,,Not captured,Not captured,Not captured,Not captured,Not captured,Not captured,
Not captured,Not captured,06/16/2019,Not captured,Not captured,863949,020,00072,BG001030-24-e4bfa386,International Assurance,Not captured,Not captured,Not captured,-,-,,Lundeen,David,,02/14/1969,male,Not captured,Not captured,Not captured,Not captured,Not captured,Not captured,Not captured,Not captured,Not captured,Not captured,Not captured,Not captured,Not captured,,,Not captured,Not captured,Not captured,Not captured,P.O. Box 159,,Forsyth,Missouri,65653,4173310327,,Not captured,Not captured,salliehitch@gmail.com,Not captured,701935464,,Not captured,Not captured,Not captured,Not captured,Not captured,Not captured,
Not captured,Not captured,06/16/2019,Not captured,Not captured,863949,020,00072,BG001030-24-e4bfa386,International Assurance,Not captured,Not captured,Not captured,-,-,,Lundeen,Staci,,04/04/1973,female,Not captured,Not captured,Not captured,Not captured,Not captured,Not captured,Not captured,Not captured,Not captured,Not captured,Not captured,Not captured,Not captured,,,Not captured,Not captured,Not captured,Not captured,P.O. Box 159,,Forsyth,Missouri,65653,4173310327,,Not captured,Not captured,salliehitch@gmail.com,Not captured,701935465,,Not captured,Not captured,Not captured,Not captured,Not captured,Not captured,
Not captured,Not captured,06/16/2019,Not captured,Not captured,863949,020,00072,BG001030-24-e4bfa386,International Assurance,Not captured,Not captured,Not captured,-,-,,Lundeen,Morgan,,10/12/2000,female,Not captured,Not captured,Not captured,Not captured,Not captured,Not captured,Not captured,Not captured,Not captured,Not captured,Not captured,Not captured,Not captured,,,Not captured,Not captured,Not captured,Not captured,P.O. Box 159,,Forsyth,Missouri,65653,4173310327,,Not captured,Not captured,salliehitch@gmail.com,Not captured,701935466,,Not captured,Not captured,Not captured,Not captured,Not captured,Not captured,
Not captured,Not captured,06/16/2019,Not captured,Not captured,863949,020,00072,BG001030-24-e4bfa386,International Assurance,Not captured,Not captured,Not captured,-,-,,Lundeen,Jackson,,10/01/2001,male,Not captured,Not captured,Not captured,Not captured,Not captured,Not captured,Not captured,Not captured,Not captured,Not captured,Not captured,Not captured,Not captured,,,Not captured,Not captured,Not captured,Not captured,P.O. Box 159,,Forsyth,Missouri,65653,4173310327,,Not captured,Not captured,salliehitch@gmail.com,Not captured,701935467,,Not captured,Not captured,Not captured,Not captured,Not captured,Not captured,
Not captured,Not captured,06/16/2019,Not captured,Not captured,863949,020,00072,BG001030-24-e4bfa386,International Assurance,Not captured,Not captured,Not captured,-,-,,Lundeen,Morgan ,,09/29/2006,female,Not captured,Not captured,Not captured,Not captured,Not captured,Not captured,Not captured,Not captured,Not captured,Not captured,Not captured,Not captured,Not captured,,,Not captured,Not captured,Not captured,Not captured,P.O. Box 159,,Forsyth,Missouri,65653,4173310327,,Not captured,Not captured,salliehitch@gmail.com,Not captured,701935468,,Not captured,Not captured,Not captured,Not captured,Not captured,Not captured,
Not captured,Not captured,06/16/2019,Not captured,Not captured,863949,020,00072,BG001030-24-e4bfa386,International Assurance,Not captured,Not captured,Not captured,-,-,,Hitchcock,Sallie,,06/09/1974,female,Not captured,Not captured,Not captured,Not captured,Not captured,Not captured,Not captured,Not captured,Not captured,Not captured,Not captured,Not captured,Not captured,,,Not captured,Not captured,Not captured,Not captured,P.O. Box 159,,Forsyth,Missouri,65653,4173310327,,Not captured,Not captured,salliehitch@gmail.com,Not captured,701935469,,Not captured,Not captured,Not captured,Not captured,Not captured,Not captured,
Not captured,Not captured,06/16/2019,Not captured,Not captured,863949,020,00072,BG001030-24-e4bfa386,International Assurance,Not captured,Not captured,Not captured,-,-,,Hitchcock,William,,07/18/2000,male,Not captured,Not captured,Not captured,Not captured,Not captured,Not captured,Not captured,Not captured,Not captured,Not captured,Not captured,Not captured,Not captured,,,Not captured,Not captured,Not captured,Not captured,P.O. Box 159,,Forsyth,Missouri,65653,4173310327,,Not captured,Not captured,salliehitch@gmail.com,Not captured,701935470,,Not captured,Not captured,Not captured,Not captured,Not captured,Not captured,
Not captured,Not captured,06/16/2019,Not captured,Not captured,863949,020,00072,BG001030-24-e4bfa386,International Assurance,Not captured,Not captured,Not captured,-,-,,Hitchcock,Mollie,,07/21/2003,female,Not captured,Not captured,Not captured,Not captured,Not captured,Not captured,Not captured,Not captured,Not captured,Not captured,Not captured,Not captured,Not captured,,,Not captured,Not captured,Not captured,Not captured,P.O. Box 159,,Forsyth,Missouri,65653,4173310327,,Not captured,Not captured,salliehitch@gmail.com,Not captured,701935471,,Not captured,Not captured,Not captured,Not captured,Not captured,Not captured,
Not captured,Not captured,06/16/2019,Not captured,Not captured,863949,020,00072,BG001030-24-e4bfa386,International Assurance,Not captured,Not captured,Not captured,-,-,,Winkert,Beverly,,03/14/1964,female,Not captured,Not captured,Not captured,Not captured,Not captured,Not captured,Not captured,Not captured,Not captured,Not captured,Not captured,Not captured,Not captured,,,Not captured,Not captured,Not captured,Not captured,P.O. Box 159,,Forsyth,Missouri,65653,4173310327,,Not captured,Not captured,salliehitch@gmail.com,Not captured,701935472,,Not captured,Not captured,Not captured,Not captured,Not captured,Not captured,
Not captured,Not captured,06/16/2019,Not captured,Not captured,863949,020,00072,BG001030-24-e4bfa386,International Assurance,Not captured,Not captured,Not captured,-,-,,Winkert,Kylee,,11/30/2001,female,Not captured,Not captured,Not captured,Not captured,Not captured,Not captured,Not captured,Not captured,Not captured,Not captured,Not captured,Not captured,Not captured,,,Not captured,Not captured,Not captured,Not captured,P.O. Box 159,,Forsyth,Missouri,65653,4173310327,,Not captured,Not captured,salliehitch@gmail.com,Not captured,701935473,,Not captured,Not captured,Not captured,Not captured,Not captured,Not captured,
Not captured,Not captured,06/16/2019,Not captured,Not captured,863949,020,00072,BG001030-24-e4bfa386,International Assurance,Not captured,Not captured,Not captured,-,-,,Reichard,Peggy,,10/17/1965,female,Not captured,Not captured,Not captured,Not captured,Not captured,Not captured,Not captured,Not captured,Not captured,Not captured,Not captured,Not captured,Not captured,,,Not captured,Not captured,Not captured,Not captured,P.O. Box 159,,Forsyth,Missouri,65653,4173310327,,Not captured,Not captured,salliehitch@gmail.com,Not captured,701935474,,Not captured,Not captured,Not captured,Not captured,Not captured,Not captured