EE Transaction Type,Dependent Transaction Type,Effective Date,EE Signature,EE Signature Date,Control,Suffix,Account,Plan Number,Plan Name,Claim Office,Network ID Number,Customer Code,EE SSN,Dependent SSN,Dependent Relationship,Last Name,First Name,Middle Initial,DOB,Gender,Ethnicity,PCP/PCD,PCP/PCD Current Patient,Provider Cap Office Number,COB,Dep Student Indicator,Dep OOA Indicator,EE Prior Coverage Indicator,EE Late Entrant,EE Language Indicator,Hire Date,Earnings,Earnings Frequency,Beneficiary (Last Name First Name MI),Beneficiary Relationship,Continuation of Coverage Expiration Date,Continuation of Coverage Event Date,Continuation of Coverage Length of Coverage,Work Location Zip Code,Street Address Line 1,Street Address Line 2,City,State,Zip Code,Home Phone Number,Work Phone Number,Accept Code,Evidence Code,EE Email Address,Communication Disability Code,EE Alternate ID,Dep Alternate ID,Old Control,Old Suffix,Old Account,New Control,New Suffix,New Account,
Not captured,Not captured,05/23/2019,Not captured,Not captured,863949,020,00072,ARS-02-0050224,Beacon America,Not captured,Not captured,Not captured,,,,Abbruzzino,Luca,,04/13/1989,male,Not captured,Not captured,Not captured,Not captured,Not captured,Not captured,Not captured,Not captured,Not captured,Not captured,Not captured,Not captured,Not captured,,,Not captured,Not captured,Not captured,Not captured,2550 Fifth Avenue,,San Diego,California,92103,6093735918,,Not captured,Not captured,dario@ildandyrestaurant.com,Not captured,701935267,,Not captured,Not captured,Not captured,Not captured,Not captured,Not captured,
Not captured,Not captured,05/23/2019,Not captured,Not captured,863949,020,00072,ARS-02-0050223,Beacon America,Not captured,Not captured,Not captured,Passport(YA4359921),,,Abbruzzino,Antonio,,01/08/1963,male,Not captured,Not captured,Not captured,Not captured,Not captured,Not captured,Not captured,Not captured,Not captured,Not captured,Not captured,Not captured,Not captured,,,Not captured,Not captured,Not captured,Not captured,2550 Fifth Avenue,,San Diego,California,92103,6093735918,,Not captured,Not captured,dario@ildandyrestaurant.com,Not captured,701935266,,Not captured,Not captured,Not captured,Not captured,Not captured,Not captured,
Not captured,Not captured,05/23/2019,Not captured,Not captured,863949,020,00072,ARS-01-0050221,Beacon International,Not captured,Not captured,Not captured,,,,Ohara,Damian,,07/19/1982,male,Not captured,Not captured,Not captured,Not captured,Not captured,Not captured,Not captured,Not captured,Not captured,Not captured,Not captured,Not captured,Not captured,,,Not captured,Not captured,Not captured,Not captured,1416 Belfast Dr,,Los Angeles,California,90069,,,Not captured,Not captured,emmasidoli_23@hotmail.com,Not captured,701935264,,Not captured,Not captured,Not captured,Not captured,Not captured,Not captured,
Not captured,Not captured,05/23/2019,Not captured,Not captured,863949,020,00072,ARS-01-0050220,Beacon International,Not captured,Not captured,Not captured,,,,Sidoli,Emma,,11/23/1991,female,Not captured,Not captured,Not captured,Not captured,Not captured,Not captured,Not captured,Not captured,Not captured,Not captured,Not captured,Not captured,Not captured,,,Not captured,Not captured,Not captured,Not captured,1416 Belfast Dr,,Los Angeles,California,90069,,,Not captured,Not captured,emmasidoli_23@hotmail.com,Not captured,701935263,,Not captured,Not captured,Not captured,Not captured,Not captured,Not captured,
Not captured,Not captured,05/23/2019,Not captured,Not captured,863949,020,00072,ARS-02-0050199,Beacon America,Not captured,Not captured,Not captured,,,,Barraza,Ricardo,J,11/21/1963,male,Not captured,Not captured,Not captured,Not captured,Not captured,Not captured,Not captured,Not captured,Not captured,Not captured,Not captured,Not captured,Not captured,,,Not captured,Not captured,Not captured,Not captured,AND CRATER MZ 11 16 D3 SUPMZA,,Cancun Benito Juarez,,77511,,,Not captured,Not captured,ricardojbarraza@gmail.com,Not captured,701935231,,Not captured,Not captured,Not captured,Not captured,Not captured,Not captured,
Not captured,Not captured,05/23/2019,Not captured,Not captured,863949,020,00072,ARS-01-0050187,Beacon International,Not captured,Not captured,Not captured,,,,Figueroa Quezada,Norberto,,09/07/1983,male,Not captured,Not captured,Not captured,Not captured,Not captured,Not captured,Not captured,Not captured,Not captured,Not captured,Not captured,Not captured,Not captured,,,Not captured,Not captured,Not captured,Not captured,1172 Jefferson Ave #2,,Brooklyn,New York,11221,,,Not captured,Not captured,nornor01@hotmail.com,Not captured,701935219,,Not captured,Not captured,Not captured,Not captured,Not captured,Not captured,
Not captured,Not captured,05/23/2019,Not captured,Not captured,863949,020,00072,ARS-01-0050185,Beacon International,Not captured,Not captured,Not captured,,,,Gupta,Pratyusha,,02/19/1994,female,Not captured,Not captured,Not captured,Not captured,Not captured,Not captured,Not captured,Not captured,Not captured,Not captured,Not captured,Not captured,Not captured,,,Not captured,Not captured,Not captured,Not captured,240 Meeker Ave,,Brooklyn,New York,11211,,,Not captured,Not captured,dhrupad_bhardwaj@yahoo.com,Not captured,701935217,,Not captured,Not captured,Not captured,Not captured,Not captured,Not captured,
Not captured,Not captured,05/23/2019,Not captured,Not captured,863949,020,00072,ARS-01-0050184,Beacon International,Not captured,Not captured,Not captured,,,,Bhardwaj,Dhrupad,,08/27/1993,male,Not captured,Not captured,Not captured,Not captured,Not captured,Not captured,Not captured,Not captured,Not captured,Not captured,Not captured,Not captured,Not captured,,,Not captured,Not captured,Not captured,Not captured,240 Meeker Ave,,Brooklyn,New York,11211,,,Not captured,Not captured,dhrupad_bhardwaj@yahoo.com,Not captured,701935216,,Not captured,Not captured,Not captured,Not captured,Not captured,Not captured,
Not captured,Not captured,05/23/2019,Not captured,Not captured,863949,020,00072,ARS-01-0050181,Beacon International,Not captured,Not captured,Not captured,,,,Inman,Molly,,11/29/1976,female,Not captured,Not captured,Not captured,Not captured,Not captured,Not captured,Not captured,Not captured,Not captured,Not captured,Not captured,Not captured,Not captured,,,Not captured,Not captured,Not captured,Not captured,1023 Kensington Way,,Annapolis,Maryland,21403,,,Not captured,Not captured,helena.smolich@new-rule.com,Not captured,701935213,,Not captured,Not captured,Not captured,Not captured,Not captured,Not captured,
Not captured,Not captured,05/23/2019,Not captured,Not captured,863949,020,00072,ARS-01-0050176,Beacon International,Not captured,Not captured,Not captured,,,,Jackson,William,V,09/11/1971,male,Not captured,Not captured,Not captured,Not captured,Not captured,Not captured,Not captured,Not captured,Not captured,Not captured,Not captured,Not captured,Not captured,,,Not captured,Not captured,Not captured,Not captured,9910 Coventry Lane,,Johns Creek,Georgia,30022,,,Not captured,Not captured,djackson0220@gmail.com,Not captured,701935208,,Not captured,Not captured,Not captured,Not captured,Not captured,Not captured,
Not captured,Not captured,05/23/2019,Not captured,Not captured,863949,020,00072,ARS-01-0050175,Beacon International,Not captured,Not captured,Not captured,,,,Jackson,Deborah,S,02/20/1968,female,Not captured,Not captured,Not captured,Not captured,Not captured,Not captured,Not captured,Not captured,Not captured,Not captured,Not captured,Not captured,Not captured,,,Not captured,Not captured,Not captured,Not captured,9910 Coventry Lane,,Johns Creek,Georgia,30022,,,Not captured,Not captured,djackson0220@gmail.com,Not captured,701935207,,Not captured,Not captured,Not captured,Not captured,Not captured,Not captured,
Not captured,Not captured,05/23/2019,Not captured,Not captured,863949,020,00072,ARS-02-0050174,Beacon America,Not captured,Not captured,Not captured,,,,Svigilsky,Deborah,,03/24/1959,female,Not captured,Not captured,Not captured,Not captured,Not captured,Not captured,Not captured,Not captured,Not captured,Not captured,Not captured,Not captured,Not captured,,,Not captured,Not captured,Not captured,Not captured,San Jos&eacute; de la sierra 99,,Santiago,,99999,,,Not captured,Not captured,s.svigilsky@gmail.com,Not captured,701935206,,Not captured,Not captured,Not captured,Not captured,Not captured,Not captured,
Not captured,Not captured,05/23/2019,Not captured,Not captured,863949,020,00072,ARS-01-0050173,Beacon International,Not captured,Not captured,Not captured,,,,aclander,Jaime,,01/24/1958,male,Not captured,Not captured,Not captured,Not captured,Not captured,Not captured,Not captured,Not captured,Not captured,Not captured,Not captured,Not captured,Not captured,,,Not captured,Not captured,Not captured,Not captured,30 W Yale Loop,,Irvine,California,92604,,,Not captured,Not captured,haim267@yahoo.com,Not captured,701935205,,Not captured,Not captured,Not captured,Not captured,Not captured,Not captured,
Not captured,Not captured,05/23/2019,Not captured,Not captured,863949,020,00072,ARS-02-0050156,Beacon America,Not captured,Not captured,Not captured,,,,PENG,XIAOHU,E23169672,04/21/1968,male,Not captured,Not captured,Not captured,Not captured,Not captured,Not captured,Not captured,Not captured,Not captured,Not captured,Not captured,Not captured,Not captured,Zhihong Peng,Son,Not captured,Not captured,Not captured,Not captured,37 S 21st St,,San Jose,California,95116,6692042834,,Not captured,Not captured,histeven94@gmail.com,Not captured,701935077,,Not captured,Not captured,Not captured,Not captured,Not captured,Not captured,
Not captured,Not captured,05/23/2019,Not captured,Not captured,863949,020,00072,ARS-02-0050155,Beacon America,Not captured,Not captured,Not captured,Passport(EF4791292),,,Wan,Haiyan,,10/05/1969,female,Not captured,Not captured,Not captured,Not captured,Not captured,Not captured,Not captured,Not captured,Not captured,Not captured,Not captured,Not captured,Not captured,Zhihong Peng,Son,Not captured,Not captured,Not captured,Not captured,37 S 21st St,,San Jose,California,95116,6692042834,,Not captured,Not captured,histeven94@gmail.com,Not captured,701935076,,Not captured,Not captured,Not captured,Not captured,Not captured,Not captured,
Not captured,Not captured,05/23/2019,Not captured,Not captured,863949,020,00072,OVI-28-0050154,OverseasCare Visitors Insurance Plan,Not captured,Not captured,Not captured,Passport(M7804131),,,BABU,SARASWATHY,,01/30/1954,female,Not captured,Not captured,Not captured,Not captured,Not captured,Not captured,Not captured,Not captured,Not captured,Not captured,Not captured,Not captured,Not captured,Kirubakaran Babu,Son,Not captured,Not captured,Not captured,Not captured,3156 LINDENWOOD DR,,DEARBORN,Michigan,48120,+13136900170,,Not captured,Not captured,kirubakaran.babu@live.com,Not captured,701935075,,Not captured,Not captured,Not captured,Not captured,Not captured,Not captured,
Not captured,Not captured,05/23/2019,Not captured,Not captured,863949,020,00072,OVI-28-0050153,OverseasCare Visitors Insurance Plan,Not captured,Not captured,Not captured,Passport(M7804131),,,GOVINDARAJULU NAICKER,BABU,,12/31/1950,male,Not captured,Not captured,Not captured,Not captured,Not captured,Not captured,Not captured,Not captured,Not captured,Not captured,Not captured,Not captured,Not captured,Kirubakaran Babu,Son,Not captured,Not captured,Not captured,Not captured,3156 LINDENWOOD DR,,DEARBORN,Michigan,48120,+13136900170,,Not captured,Not captured,kirubakaran.babu@live.com,Not captured,701935074,,Not captured,Not captured,Not captured,Not captured,Not captured,Not captured,
Not captured,Not captured,05/23/2019,Not captured,Not captured,863949,020,00072,OVI-28-0049968,OverseasCare Visitors Insurance Plan,Not captured,Not captured,Not captured,Passport(S2292307),,,Sajjapur KrishnaMurthy ,Subbalakshmi,,06/08/1967,female,Not captured,Not captured,Not captured,Not captured,Not captured,Not captured,Not captured,Not captured,Not captured,Not captured,Not captured,Not captured,Not captured,Pavan Bangalore Mohan,Son,Not captured,Not captured,Not captured,Not captured,2190 Mindy Lane,,Cumming,Georgia,30041,4708481349,,Not captured,Not captured,pavan.vasist@gmail.com,Not captured,701934348,,Not captured,Not captured,Not captured,Not captured,Not captured,Not captured,
Not captured,Not captured,05/23/2019,Not captured,Not captured,863949,020,00072,OVI-28-0049967,OverseasCare Visitors Insurance Plan,Not captured,Not captured,Not captured,Passport(S2292307),,,Bangalore Jagannatha Rao ,Mohan ,,10/02/1956,male,Not captured,Not captured,Not captured,Not captured,Not captured,Not captured,Not captured,Not captured,Not captured,Not captured,Not captured,Not captured,Not captured,Pavan Bangalore Mohan,Son,Not captured,Not captured,Not captured,Not captured,2190 Mindy Lane,,Cumming,Georgia,30041,4708481349,,Not captured,Not captured,pavan.vasist@gmail.com,Not captured,701934347,,Not captured,Not captured,Not captured,Not captured,Not captured,Not captured,
Not captured,Not captured,05/23/2019,Not captured,Not captured,863949,020,00072,ARS-01-0049947,Beacon International,Not captured,Not captured,Not captured,,,,CHEN,CHLOE,Y,07/01/2017,female,Not captured,Not captured,Not captured,Not captured,Not captured,Not captured,Not captured,Not captured,Not captured,Not captured,Not captured,Not captured,Not captured,,,Not captured,Not captured,Not captured,Not captured,520 LUNALILO HOME ROAD UNIT 8403,,HONOLULU,Hawaii,96825,,,Not captured,Not captured,huijinpark@yahoo.com,Not captured,701934327,,Not captured,Not captured,Not captured,Not captured,Not captured,Not captured,
Not captured,Not captured,05/23/2019,Not captured,Not captured,863949,020,00072,ARS-01-0049946,Beacon International,Not captured,Not captured,Not captured,,,,PARK,HUI JIN,,09/14/1982,female,Not captured,Not captured,Not captured,Not captured,Not captured,Not captured,Not captured,Not captured,Not captured,Not captured,Not captured,Not captured,Not captured,,,Not captured,Not captured,Not captured,Not captured,520 LUNALILO HOME ROAD UNIT 8403,,HONOLULU,Hawaii,96825,,,Not captured,Not captured,huijinpark@yahoo.com,Not captured,701934326,,Not captured,Not captured,Not captured,Not captured,Not captured,Not captured,
Not captured,Not captured,07/06/2019,Not captured,Not captured,863949,020,00072,BG001030-23-29d690c4,International Assurance,Not captured,Not captured,Not captured,-,-,,Baum,Danielle,,11/12/1989,male,Not captured,Not captured,Not captured,Not captured,Not captured,Not captured,Not captured,Not captured,Not captured,Not captured,Not captured,Not captured,Not captured,,,Not captured,Not captured,Not captured,Not captured,563 E Pennsylvania Ave,,Van,Texas,75790,8006474589,,Not captured,Not captured,Teams@nvm.org,Not captured,701935250,,Not captured,Not captured,Not captured,Not captured,Not captured,Not captured,
Not captured,Not captured,07/06/2019,Not captured,Not captured,863949,020,00072,BG001030-23-29d690c4,International Assurance,Not captured,Not captured,Not captured,-,-,,Rennaker,Zachary,,5/18/1986,male,Not captured,Not captured,Not captured,Not captured,Not captured,Not captured,Not captured,Not captured,Not captured,Not captured,Not captured,Not captured,Not captured,,,Not captured,Not captured,Not captured,Not captured,563 E Pennsylvania Ave,,Van,Texas,75790,8006474589,,Not captured,Not captured,Teams@nvm.org,Not captured,701935251,,Not captured,Not captured,Not captured,Not captured,Not captured,Not captured,
Not captured,Not captured,07/06/2019,Not captured,Not captured,863949,020,00072,BG001030-23-29d690c4,International Assurance,Not captured,Not captured,Not captured,-,-,,Wallen,Audrey,,10/29/2003,male,Not captured,Not captured,Not captured,Not captured,Not captured,Not captured,Not captured,Not captured,Not captured,Not captured,Not captured,Not captured,Not captured,,,Not captured,Not captured,Not captured,Not captured,563 E Pennsylvania Ave,,Van,Texas,75790,8006474589,,Not captured,Not captured,Teams@nvm.org,Not captured,701935252,,Not captured,Not captured,Not captured,Not captured,Not captured,Not captured,
Not captured,Not captured,07/06/2019,Not captured,Not captured,863949,020,00072,BG001030-23-29d690c4,International Assurance,Not captured,Not captured,Not captured,-,-,,Estes,Sam,,8/29/2001,male,Not captured,Not captured,Not captured,Not captured,Not captured,Not captured,Not captured,Not captured,Not captured,Not captured,Not captured,Not captured,Not captured,,,Not captured,Not captured,Not captured,Not captured,563 E Pennsylvania Ave,,Van,Texas,75790,8006474589,,Not captured,Not captured,Teams@nvm.org,Not captured,701935253,,Not captured,Not captured,Not captured,Not captured,Not captured,Not captured,
Not captured,Not captured,07/06/2019,Not captured,Not captured,863949,020,00072,BG001030-23-29d690c4,International Assurance,Not captured,Not captured,Not captured,-,-,,Donnelly,Aaron,,3/27/2003,male,Not captured,Not captured,Not captured,Not captured,Not captured,Not captured,Not captured,Not captured,Not captured,Not captured,Not captured,Not captured,Not captured,,,Not captured,Not captured,Not captured,Not captured,563 E Pennsylvania Ave,,Van,Texas,75790,8006474589,,Not captured,Not captured,Teams@nvm.org,Not captured,701935254,,Not captured,Not captured,Not captured,Not captured,Not captured,Not captured,
Not captured,Not captured,07/06/2019,Not captured,Not captured,863949,020,00072,BG001030-23-29d690c4,International Assurance,Not captured,Not captured,Not captured,-,-,,Funk,Noah,,6/9/2001,male,Not captured,Not captured,Not captured,Not captured,Not captured,Not captured,Not captured,Not captured,Not captured,Not captured,Not captured,Not captured,Not captured,,,Not captured,Not captured,Not captured,Not captured,563 E Pennsylvania Ave,,Van,Texas,75790,8006474589,,Not captured,Not captured,Teams@nvm.org,Not captured,701935255,,Not captured,Not captured,Not captured,Not captured,Not captured,Not captured,
Not captured,Not captured,07/06/2019,Not captured,Not captured,863949,020,00072,BG001030-23-29d690c4,International Assurance,Not captured,Not captured,Not captured,-,-,,Ford,Saeli,,2/14/2003,male,Not captured,Not captured,Not captured,Not captured,Not captured,Not captured,Not captured,Not captured,Not captured,Not captured,Not captured,Not captured,Not captured,,,Not captured,Not captured,Not captured,Not captured,563 E Pennsylvania Ave,,Van,Texas,75790,8006474589,,Not captured,Not captured,Teams@nvm.org,Not captured,701935256,,Not captured,Not captured,Not captured,Not captured,Not captured,Not captured,
Not captured,Not captured,07/06/2019,Not captured,Not captured,863949,020,00072,BG001030-23-29d690c4,International Assurance,Not captured,Not captured,Not captured,-,-,,Olges,Garrett,,1/15/2001,male,Not captured,Not captured,Not captured,Not captured,Not captured,Not captured,Not captured,Not captured,Not captured,Not captured,Not captured,Not captured,Not captured,,,Not captured,Not captured,Not captured,Not captured,563 E Pennsylvania Ave,,Van,Texas,75790,8006474589,,Not captured,Not captured,Teams@nvm.org,Not captured,701935257,,Not captured,Not captured,Not captured,Not captured,Not captured,Not captured,
Not captured,Not captured,07/06/2019,Not captured,Not captured,863949,020,00072,BG001030-23-29d690c4,International Assurance,Not captured,Not captured,Not captured,-,-,,St. André,Naomi,,12/7/2004,male,Not captured,Not captured,Not captured,Not captured,Not captured,Not captured,Not captured,Not captured,Not captured,Not captured,Not captured,Not captured,Not captured,,,Not captured,Not captured,Not captured,Not captured,563 E Pennsylvania Ave,,Van,Texas,75790,8006474589,,Not captured,Not captured,Teams@nvm.org,Not captured,701935258,,Not captured,Not captured,Not captured,Not captured,Not captured,Not captured,
Not captured,Not captured,07/06/2019,Not captured,Not captured,863949,020,00072,BG001030-23-29d690c4,International Assurance,Not captured,Not captured,Not captured,-,-,,Loos,Katie,,7/31/2003,male,Not captured,Not captured,Not captured,Not captured,Not captured,Not captured,Not captured,Not captured,Not captured,Not captured,Not captured,Not captured,Not captured,,,Not captured,Not captured,Not captured,Not captured,563 E Pennsylvania Ave,,Van,Texas,75790,8006474589,,Not captured,Not captured,Teams@nvm.org,Not captured,701935259,,Not captured,Not captured,Not captured,Not captured,Not captured,Not captured,
Not captured,Not captured,07/06/2019,Not captured,Not captured,863949,020,00072,BG001030-23-29d690c4,International Assurance,Not captured,Not captured,Not captured,-,-,,Loos,Kendra,,2/4/2001,male,Not captured,Not captured,Not captured,Not captured,Not captured,Not captured,Not captured,Not captured,Not captured,Not captured,Not captured,Not captured,Not captured,,,Not captured,Not captured,Not captured,Not captured,563 E Pennsylvania Ave,,Van,Texas,75790,8006474589,,Not captured,Not captured,Teams@nvm.org,Not captured,701935260,,Not captured,Not captured,Not captured,Not captured,Not captured,Not captured