EE Transaction Type,Dependent Transaction Type,Effective Date,EE Signature,EE Signature Date,Control,Suffix,Account,Plan Number,Plan Name,Claim Office,Network ID Number,Customer Code,EE SSN,Dependent SSN,Dependent Relationship,Last Name,First Name,Middle Initial,DOB,Gender,Ethnicity,PCP/PCD,PCP/PCD Current Patient,Provider Cap Office Number,COB,Dep Student Indicator,Dep OOA Indicator,EE Prior Coverage Indicator,EE Late Entrant,EE Language Indicator,Hire Date,Earnings,Earnings Frequency,Beneficiary (Last Name First Name MI),Beneficiary Relationship,Continuation of Coverage Expiration Date,Continuation of Coverage Event Date,Continuation of Coverage Length of Coverage,Work Location Zip Code,Street Address Line 1,Street Address Line 2,City,State,Zip Code,Home Phone Number,Work Phone Number,Accept Code,Evidence Code,EE Email Address,Communication Disability Code,EE Alternate ID,Dep Alternate ID,Old Control,Old Suffix,Old Account,New Control,New Suffix,New Account,
Not captured,Not captured,05/05/2019,Not captured,Not captured,863949,020,00072,ARS-01-0049753,Beacon International,Not captured,Not captured,Not captured,,,,Cornelius,Rebecca,A,02/20/1976,female,Not captured,Not captured,Not captured,Not captured,Not captured,Not captured,Not captured,Not captured,Not captured,Not captured,Not captured,Not captured,Not captured,,,Not captured,Not captured,Not captured,Not captured,John Cornelius,,CONROE,Texas,77385,,,Not captured,Not captured,wreckers70@yahoo.com,Not captured,701933897,,Not captured,Not captured,Not captured,Not captured,Not captured,Not captured,
Not captured,Not captured,05/05/2019,Not captured,Not captured,863949,020,00072,ARS-01-0049752,Beacon International,Not captured,Not captured,Not captured,,,,Cornelius,John,B,03/23/1979,male,Not captured,Not captured,Not captured,Not captured,Not captured,Not captured,Not captured,Not captured,Not captured,Not captured,Not captured,Not captured,Not captured,,,Not captured,Not captured,Not captured,Not captured,John Cornelius,,CONROE,Texas,77385,,,Not captured,Not captured,wreckers70@yahoo.com,Not captured,701933896,,Not captured,Not captured,Not captured,Not captured,Not captured,Not captured,
Not captured,Not captured,05/04/2019,Not captured,Not captured,863949,020,00072,ARS-01-0049745,Beacon International,Not captured,Not captured,Not captured,,,,Belton,Cecilia,N,08/12/1979,female,Not captured,Not captured,Not captured,Not captured,Not captured,Not captured,Not captured,Not captured,Not captured,Not captured,Not captured,Not captured,Not captured,,,Not captured,Not captured,Not captured,Not captured,698 Georgetown Court,,Jonesboro,Georgia,30236,,,Not captured,Not captured,cecetraveldocs@gmail.com,Not captured,701933882,,Not captured,Not captured,Not captured,Not captured,Not captured,Not captured,
Not captured,Not captured,05/04/2019,Not captured,Not captured,863949,020,00072,ARS-01-0049744,Beacon International,Not captured,Not captured,Not captured,,,,Philis,Otto,C,03/07/1993,male,Not captured,Not captured,Not captured,Not captured,Not captured,Not captured,Not captured,Not captured,Not captured,Not captured,Not captured,Not captured,Not captured,,,Not captured,Not captured,Not captured,Not captured,239 Saint Andrews Street,,Hayward,California,94544,,,Not captured,Not captured,egajirules@hotmail.com,Not captured,701933881,,Not captured,Not captured,Not captured,Not captured,Not captured,Not captured,
Not captured,Not captured,05/04/2019,Not captured,Not captured,863949,020,00072,ARS-01-0049743,Beacon International,Not captured,Not captured,Not captured,,,,Pike,Heidi,J,01/28/1969,female,Not captured,Not captured,Not captured,Not captured,Not captured,Not captured,Not captured,Not captured,Not captured,Not captured,Not captured,Not captured,Not captured,,,Not captured,Not captured,Not captured,Not captured,7521 s Madison cir,,Centennial,Colorado,80112,,,Not captured,Not captured,pikepaul2000@yahoo.com,Not captured,701933880,,Not captured,Not captured,Not captured,Not captured,Not captured,Not captured,
Not captured,Not captured,05/04/2019,Not captured,Not captured,863949,020,00072,ARS-01-0049742,Beacon International,Not captured,Not captured,Not captured,,,,Pike,Paul,S,04/21/1965,male,Not captured,Not captured,Not captured,Not captured,Not captured,Not captured,Not captured,Not captured,Not captured,Not captured,Not captured,Not captured,Not captured,,,Not captured,Not captured,Not captured,Not captured,7521 s Madison cir,,Centennial,Colorado,80112,,,Not captured,Not captured,pikepaul2000@yahoo.com,Not captured,701933879,,Not captured,Not captured,Not captured,Not captured,Not captured,Not captured,
Not captured,Not captured,05/04/2019,Not captured,Not captured,863949,020,00072,ARS-01-0049739,Beacon International,Not captured,Not captured,Not captured,,,,Armstrong,Michael,R,10/30/1946,male,Not captured,Not captured,Not captured,Not captured,Not captured,Not captured,Not captured,Not captured,Not captured,Not captured,Not captured,Not captured,Not captured,,,Not captured,Not captured,Not captured,Not captured,17446 SW Hoodoo Ct,,Beaverton,Oregon,97007,,,Not captured,Not captured,mollex@man.com,Not captured,701933876,,Not captured,Not captured,Not captured,Not captured,Not captured,Not captured,
Not captured,Not captured,05/04/2019,Not captured,Not captured,863949,020,00072,ARS-01-0049738,Beacon International,Not captured,Not captured,Not captured,,,,Hafen,Julia,J,11/14/2001,female,Not captured,Not captured,Not captured,Not captured,Not captured,Not captured,Not captured,Not captured,Not captured,Not captured,Not captured,Not captured,Not captured,,,Not captured,Not captured,Not captured,Not captured,17731 Oak St.,,Fountain Valley,California,92708,,,Not captured,Not captured,paul.hafen@gmail.com,Not captured,701933875,,Not captured,Not captured,Not captured,Not captured,Not captured,Not captured,
Not captured,Not captured,05/04/2019,Not captured,Not captured,863949,020,00072,ARS-01-0049737,Beacon International,Not captured,Not captured,Not captured,,,,Farrell,Emilie,H,11/22/1996,female,Not captured,Not captured,Not captured,Not captured,Not captured,Not captured,Not captured,Not captured,Not captured,Not captured,Not captured,Not captured,Not captured,,,Not captured,Not captured,Not captured,Not captured,17731 Oak St.,,Fountain Valley,California,92708,,,Not captured,Not captured,paul.hafen@gmail.com,Not captured,701933874,,Not captured,Not captured,Not captured,Not captured,Not captured,Not captured,
Not captured,Not captured,05/04/2019,Not captured,Not captured,863949,020,00072,ARS-01-0049736,Beacon International,Not captured,Not captured,Not captured,,,,Farrell,Michael,D,08/08/1993,male,Not captured,Not captured,Not captured,Not captured,Not captured,Not captured,Not captured,Not captured,Not captured,Not captured,Not captured,Not captured,Not captured,,,Not captured,Not captured,Not captured,Not captured,17731 Oak St.,,Fountain Valley,California,92708,,,Not captured,Not captured,paul.hafen@gmail.com,Not captured,701933873,,Not captured,Not captured,Not captured,Not captured,Not captured,Not captured,
Not captured,Not captured,05/04/2019,Not captured,Not captured,863949,020,00072,ARS-01-0049735,Beacon International,Not captured,Not captured,Not captured,,,,Hafen,Logan,T,03/27/1995,male,Not captured,Not captured,Not captured,Not captured,Not captured,Not captured,Not captured,Not captured,Not captured,Not captured,Not captured,Not captured,Not captured,,,Not captured,Not captured,Not captured,Not captured,17731 Oak St.,,Fountain Valley,California,92708,,,Not captured,Not captured,paul.hafen@gmail.com,Not captured,701933872,,Not captured,Not captured,Not captured,Not captured,Not captured,Not captured,
Not captured,Not captured,05/04/2019,Not captured,Not captured,863949,020,00072,ARS-01-0049734,Beacon International,Not captured,Not captured,Not captured,,,,Norris,Shaely,M,08/27/1993,female,Not captured,Not captured,Not captured,Not captured,Not captured,Not captured,Not captured,Not captured,Not captured,Not captured,Not captured,Not captured,Not captured,,,Not captured,Not captured,Not captured,Not captured,17731 Oak St.,,Fountain Valley,California,92708,,,Not captured,Not captured,paul.hafen@gmail.com,Not captured,701933871,,Not captured,Not captured,Not captured,Not captured,Not captured,Not captured,
Not captured,Not captured,05/04/2019,Not captured,Not captured,863949,020,00072,ARS-01-0049733,Beacon International,Not captured,Not captured,Not captured,,,,Hafen,Jennifer,L,06/28/1973,female,Not captured,Not captured,Not captured,Not captured,Not captured,Not captured,Not captured,Not captured,Not captured,Not captured,Not captured,Not captured,Not captured,,,Not captured,Not captured,Not captured,Not captured,17731 Oak St.,,Fountain Valley,California,92708,,,Not captured,Not captured,paul.hafen@gmail.com,Not captured,701933870,,Not captured,Not captured,Not captured,Not captured,Not captured,Not captured,
Not captured,Not captured,05/04/2019,Not captured,Not captured,863949,020,00072,ARS-01-0049732,Beacon International,Not captured,Not captured,Not captured,,,,Hafen,Paul,G,05/02/1971,male,Not captured,Not captured,Not captured,Not captured,Not captured,Not captured,Not captured,Not captured,Not captured,Not captured,Not captured,Not captured,Not captured,,,Not captured,Not captured,Not captured,Not captured,17731 Oak St.,,Fountain Valley,California,92708,,,Not captured,Not captured,paul.hafen@gmail.com,Not captured,701933869,,Not captured,Not captured,Not captured,Not captured,Not captured,Not captured,
Not captured,Not captured,05/04/2019,Not captured,Not captured,863949,020,00072,ARS-01-0049731,Beacon International,Not captured,Not captured,Not captured,,,,Cholewinski,Joanna,E,01/01/1954,female,Not captured,Not captured,Not captured,Not captured,Not captured,Not captured,Not captured,Not captured,Not captured,Not captured,Not captured,Not captured,Not captured,,,Not captured,Not captured,Not captured,Not captured,1932 S. Vine Ave,,PARK RIDGE,Illinois,60068,,,Not captured,Not captured,ewach@comcast.net,Not captured,701933868,,Not captured,Not captured,Not captured,Not captured,Not captured,Not captured,
Not captured,Not captured,05/04/2019,Not captured,Not captured,863949,020,00072,ARS-01-0049730,Beacon International,Not captured,Not captured,Not captured,,,,Segreto,Alessandra,,11/03/1987,female,Not captured,Not captured,Not captured,Not captured,Not captured,Not captured,Not captured,Not captured,Not captured,Not captured,Not captured,Not captured,Not captured,,,Not captured,Not captured,Not captured,Not captured,1245 Filbert St,,San Francisco,California,94109,,,Not captured,Not captured,scooter.sabel@gmail.com,Not captured,701933867,,Not captured,Not captured,Not captured,Not captured,Not captured,Not captured,
Not captured,Not captured,05/04/2019,Not captured,Not captured,863949,020,00072,ARS-01-0049729,Beacon International,Not captured,Not captured,Not captured,,,,Sabel,Andrew,,04/23/1988,male,Not captured,Not captured,Not captured,Not captured,Not captured,Not captured,Not captured,Not captured,Not captured,Not captured,Not captured,Not captured,Not captured,,,Not captured,Not captured,Not captured,Not captured,1245 Filbert St,,San Francisco,California,94109,,,Not captured,Not captured,scooter.sabel@gmail.com,Not captured,701933866,,Not captured,Not captured,Not captured,Not captured,Not captured,Not captured,
Not captured,Not captured,05/03/2019,Not captured,Not captured,863949,020,00072,ARS-01-0049726,Beacon International,Not captured,Not captured,Not captured,,,,simko,stephen,d,08/07/1951,male,Not captured,Not captured,Not captured,Not captured,Not captured,Not captured,Not captured,Not captured,Not captured,Not captured,Not captured,Not captured,Not captured,,,Not captured,Not captured,Not captured,Not captured,po box 1804,,buffalo,Missouri,65622,,,Not captured,Not captured,serotta52@yahoo.com,Not captured,701933862,,Not captured,Not captured,Not captured,Not captured,Not captured,Not captured,
Not captured,Not captured,05/03/2019,Not captured,Not captured,863949,020,00072,ARS-01-0049725,Beacon International,Not captured,Not captured,Not captured,,,,simko,julie,a,08/26/1963,female,Not captured,Not captured,Not captured,Not captured,Not captured,Not captured,Not captured,Not captured,Not captured,Not captured,Not captured,Not captured,Not captured,,,Not captured,Not captured,Not captured,Not captured,po box 1804,,buffalo,Missouri,65622,,,Not captured,Not captured,serotta52@yahoo.com,Not captured,701933861,,Not captured,Not captured,Not captured,Not captured,Not captured,Not captured,
Not captured,Not captured,05/03/2019,Not captured,Not captured,863949,020,00072,ARS-02-0049722,Beacon America,Not captured,Not captured,Not captured,,,,NEUFELD,ANGELIQUE,,07/09/2012,female,Not captured,Not captured,Not captured,Not captured,Not captured,Not captured,Not captured,Not captured,Not captured,Not captured,Not captured,Not captured,Not captured,,,Not captured,Not captured,Not captured,Not captured,1643 S JACKSON PL,,SEATTLE,Washington,98144,,,Not captured,Not captured,garthwneufeld@gmail.com,Not captured,701933858,,Not captured,Not captured,Not captured,Not captured,Not captured,Not captured,
Not captured,Not captured,05/03/2019,Not captured,Not captured,863949,020,00072,ARS-01-0049720,Beacon International,Not captured,Not captured,Not captured,,,,Quille,Mary,M,10/25/1983,female,Not captured,Not captured,Not captured,Not captured,Not captured,Not captured,Not captured,Not captured,Not captured,Not captured,Not captured,Not captured,Not captured,,,Not captured,Not captured,Not captured,Not captured,350 W 85th,,New York,New York,10024,,,Not captured,Not captured,quille1025@gmail.com,Not captured,701933856,,Not captured,Not captured,Not captured,Not captured,Not captured,Not captured,
Not captured,Not captured,05/03/2019,Not captured,Not captured,863949,020,00072,ARS-02-0049718,Beacon America,Not captured,Not captured,Not captured,Passport(14CL28912),,,Roquette,Annie,M,05/04/1992,female,Not captured,Not captured,Not captured,Not captured,Not captured,Not captured,Not captured,Not captured,Not captured,Not captured,Not captured,Not captured,Not captured,Pierre Roquette,Father,Not captured,Not captured,Not captured,Not captured,Vista Linda,,Maria Trinidad Sanchez,Rio San Juan,0824,829-873-5144,0344821762,Not captured,Not captured,annie.roquette@gmail.com,Not captured,701933853,,Not captured,Not captured,Not captured,Not captured,Not captured,Not captured,
Not captured,Not captured,05/03/2019,Not captured,Not captured,863949,020,00072,ARS-01-0049717,Beacon International,Not captured,Not captured,Not captured,,,,Berthrong,Elsie,C,07/11/1946,female,Not captured,Not captured,Not captured,Not captured,Not captured,Not captured,Not captured,Not captured,Not captured,Not captured,Not captured,Not captured,Not captured,,,Not captured,Not captured,Not captured,Not captured,840 foothill drive,,Providence,Utah,84332,,,Not captured,Not captured,cthrong@gmail.com,Not captured,701933837,,Not captured,Not captured,Not captured,Not captured,Not captured,Not captured,
Not captured,Not captured,05/03/2019,Not captured,Not captured,863949,020,00072,ARS-01-0049716,Beacon International,Not captured,Not captured,Not captured,,,,Tewkesbury,Paul,,09/05/1968,male,Not captured,Not captured,Not captured,Not captured,Not captured,Not captured,Not captured,Not captured,Not captured,Not captured,Not captured,Not captured,Not captured,,,Not captured,Not captured,Not captured,Not captured,KH Tower 506,,Seoul,,02452,,,Not captured,Not captured,tater.t@gmail.com,Not captured,701933836,,Not captured,Not captured,Not captured,Not captured,Not captured,Not captured,
Not captured,Not captured,05/02/2019,Not captured,Not captured,863949,020,00072,ARS-01-0049714,Beacon International,Not captured,Not captured,Not captured,,,,Ghosh,Suprateem,,03/31/1987,male,Not captured,Not captured,Not captured,Not captured,Not captured,Not captured,Not captured,Not captured,Not captured,Not captured,Not captured,Not captured,Not captured,,,Not captured,Not captured,Not captured,Not captured,104 Ranch Trail,,Irving,Texas,75063,,,Not captured,Not captured,suprateemghosh@gmail.com,Not captured,701933833,,Not captured,Not captured,Not captured,Not captured,Not captured,Not captured,
Not captured,Not captured,05/02/2019,Not captured,Not captured,863949,020,00072,ARS-01-0049713,Beacon International,Not captured,Not captured,Not captured,,,,Ghosh,Shibanwita,,02/07/1991,female,Not captured,Not captured,Not captured,Not captured,Not captured,Not captured,Not captured,Not captured,Not captured,Not captured,Not captured,Not captured,Not captured,,,Not captured,Not captured,Not captured,Not captured,104 Ranch Trail,,Irving,Texas,75063,,,Not captured,Not captured,suprateemghosh@gmail.com,Not captured,701933832,,Not captured,Not captured,Not captured,Not captured,Not captured,Not captured,
Not captured,Not captured,05/03/2019,Not captured,Not captured,863949,020,00072,ARS-02-0049711,Beacon America,Not captured,Not captured,Not captured,Passport(143319694),,,DIAZ RATTY,ANGINY KARINA,,07/02/1987,female,Not captured,Not captured,Not captured,Not captured,Not captured,Not captured,Not captured,Not captured,Not captured,Not captured,Not captured,Not captured,Not captured,Giovanni Maccarone,Esposo,Not captured,Not captured,Not captured,Not captured,Av. Orinoco Resd. Melani Josefina Piso 8 Apto 8D,,Maturin,Monagas,6201,+584249290210,,Not captured,Not captured,akdiazr@hotmai.com,Not captured,701933830,,Not captured,Not captured,Not captured,Not captured,Not captured,Not captured,
Not captured,Not captured,05/02/2019,Not captured,Not captured,863949,020,00072,ARS-01-0049698,Beacon International,Not captured,Not captured,Not captured,,,,Nikel,Harry,L,11/15/1995,male,Not captured,Not captured,Not captured,Not captured,Not captured,Not captured,Not captured,Not captured,Not captured,Not captured,Not captured,Not captured,Not captured,,,Not captured,Not captured,Not captured,Not captured,12 North Lake Circle,,South Salem,New York,10590,,,Not captured,Not captured,nikel@optonline.net,Not captured,701933810,,Not captured,Not captured,Not captured,Not captured,Not captured,Not captured,
Not captured,Not captured,05/02/2019,Not captured,Not captured,863949,020,00072,ARS-01-0049697,Beacon International,Not captured,Not captured,Not captured,,,,Nikel,Louis,L,09/12/1957,male,Not captured,Not captured,Not captured,Not captured,Not captured,Not captured,Not captured,Not captured,Not captured,Not captured,Not captured,Not captured,Not captured,,,Not captured,Not captured,Not captured,Not captured,12 North Lake Circle,,South Salem,New York,10590,,,Not captured,Not captured,nikel@optonline.net,Not captured,701933809,,Not captured,Not captured,Not captured,Not captured,Not captured,Not captured,
Not captured,Not captured,05/02/2019,Not captured,Not captured,863949,020,00072,ARS-01-0049693,Beacon International,Not captured,Not captured,Not captured,,,,Mouton,Gregory,,12/27/1980,male,Not captured,Not captured,Not captured,Not captured,Not captured,Not captured,Not captured,Not captured,Not captured,Not captured,Not captured,Not captured,Not captured,,,Not captured,Not captured,Not captured,Not captured,305 Broadway 7th Floor,,New York,New York,10007,,,Not captured,Not captured,gregmoutonjr@hotmail.com,Not captured,701933795,,Not captured,Not captured,Not captured,Not captured,Not captured,Not captured,
Not captured,Not captured,05/02/2019,Not captured,Not captured,863949,020,00072,ARS-02-0049692,Beacon America,Not captured,Not captured,Not captured,,,,baron,benjamin,,10/25/1991,male,Not captured,Not captured,Not captured,Not captured,Not captured,Not captured,Not captured,Not captured,Not captured,Not captured,Not captured,Not captured,Not captured,,,Not captured,Not captured,Not captured,Not captured,12a oxenham court,,bristol,,bs57bs,,,Not captured,Not captured,benwbaron@gmail.com,Not captured,701933794,,Not captured,Not captured,Not captured,Not captured,Not captured,Not captured,
Not captured,Not captured,05/02/2019,Not captured,Not captured,863949,020,00072,ARS-01-0049691,Beacon International,Not captured,Not captured,Not captured,,,,Kim,Boeun,,01/15/1994,female,Not captured,Not captured,Not captured,Not captured,Not captured,Not captured,Not captured,Not captured,Not captured,Not captured,Not captured,Not captured,Not captured,,,Not captured,Not captured,Not captured,Not captured,2000 Linwood Ave APT 19F,,Fort Lee,New Jersey,07024,,,Not captured,Not captured,to.mrjae@hotmail.com,Not captured,701933793,,Not captured,Not captured,Not captured,Not captured,Not captured,Not captured,
Not captured,Not captured,05/02/2019,Not captured,Not captured,863949,020,00072,ARS-01-0049690,Beacon International,Not captured,Not captured,Not captured,,,,Lee,Jaehoon,,08/01/1984,male,Not captured,Not captured,Not captured,Not captured,Not captured,Not captured,Not captured,Not captured,Not captured,Not captured,Not captured,Not captured,Not captured,,,Not captured,Not captured,Not captured,Not captured,2000 Linwood Ave APT 19F,,Fort Lee,New Jersey,07024,,,Not captured,Not captured,to.mrjae@hotmail.com,Not captured,701933792,,Not captured,Not captured,Not captured,Not captured,Not captured,Not captured,
Not captured,Not captured,05/02/2019,Not captured,Not captured,863949,020,00072,ARS-01-0049688,Beacon International,Not captured,Not captured,Not captured,,,,Yang krivak,Wei,,10/02/1963,female,Not captured,Not captured,Not captured,Not captured,Not captured,Not captured,Not captured,Not captured,Not captured,Not captured,Not captured,Not captured,Not captured,,,Not captured,Not captured,Not captured,Not captured,1962 coral hts ct,,Oakland park,Florida,33308,,,Not captured,Not captured,weiyang22@hotmail.com,Not captured,701933738,,Not captured,Not captured,Not captured,Not captured,Not captured,Not captured,
Not captured,Not captured,04/30/2019,Not captured,Not captured,863949,020,00072,ARS-03-0049647,Essential International,Not captured,Not captured,Not captured,Passport(492427517),,,Wallerstein,Robert,leon,04/25/1965,male,Not captured,Not captured,Not captured,Not captured,Not captured,Not captured,Not captured,Not captured,Not captured,Not captured,Not captured,Not captured,Not captured,,,Not captured,Not captured,Not captured,Not captured,Lomonossow alle 50,,greifswald,,17464,0123456789,,Not captured,Not captured,rlwallerstein@gmx.de,Not captured,701933610,,Not captured,Not captured,Not captured,Not captured,Not captured,Not captured,
Not captured,Not captured,05/02/2019,Not captured,Not captured,863949,020,00072,ARS-01-0049685,Beacon International,Not captured,Not captured,Not captured,,,,Valenzona,Ilerosa,,11/06/1959,female,Not captured,Not captured,Not captured,Not captured,Not captured,Not captured,Not captured,Not captured,Not captured,Not captured,Not captured,Not captured,Not captured,,,Not captured,Not captured,Not captured,Not captured,Block 3 Lot 20 Daang Bakal Road Burgos,,Rodriguez,,1860,,,Not captured,Not captured,ldalleore@gmail.com,Not captured,701933730,,Not captured,Not captured,Not captured,Not captured,Not captured,Not captured,
Not captured,Not captured,05/02/2019,Not captured,Not captured,863949,020,00072,ARS-01-0049684,Beacon International,Not captured,Not captured,Not captured,,,,Bongbonga,Diorell,,05/06/1988,male,Not captured,Not captured,Not captured,Not captured,Not captured,Not captured,Not captured,Not captured,Not captured,Not captured,Not captured,Not captured,Not captured,,,Not captured,Not captured,Not captured,Not captured,Block 3 Lot 20 Daang Bakal Road Burgos,,Rodriguez,,1860,,,Not captured,Not captured,ldalleore@gmail.com,Not captured,701933729,,Not captured,Not captured,Not captured,Not captured,Not captured,Not captured,