EE Transaction Type,Dependent Transaction Type,Effective Date,EE Signature,EE Signature Date,Control,Suffix,Account,Plan Number,Plan Name,Claim Office,Network ID Number,Customer Code,EE SSN,Dependent SSN,Dependent Relationship,Last Name,First Name,Middle Initial,DOB,Gender,Ethnicity,PCP/PCD,PCP/PCD Current Patient,Provider Cap Office Number,COB,Dep Student Indicator,Dep OOA Indicator,EE Prior Coverage Indicator,EE Late Entrant,EE Language Indicator,Hire Date,Earnings,Earnings Frequency,Beneficiary (Last Name First Name MI),Beneficiary Relationship,Continuation of Coverage Expiration Date,Continuation of Coverage Event Date,Continuation of Coverage Length of Coverage,Work Location Zip Code,Street Address Line 1,Street Address Line 2,City,State,Zip Code,Home Phone Number,Work Phone Number,Accept Code,Evidence Code,EE Email Address,Communication Disability Code,EE Alternate ID,Dep Alternate ID,Old Control,Old Suffix,Old Account,New Control,New Suffix,New Account,
Not captured,Not captured,04/10/2019,Not captured,Not captured,863949,020,00072,ARS-02-0049078,Beacon America,Not captured,Not captured,Not captured,,,,Lim,William,,12/02/1957,male,Not captured,Not captured,Not captured,Not captured,Not captured,Not captured,Not captured,Not captured,Not captured,Not captured,Not captured,Not captured,Not captured,,,Not captured,Not captured,Not captured,Not captured,1111 Drake Rd.,,Arcadia,California,91007,,,Not captured,Not captured,wlim@me.com,Not captured,701932639,,Not captured,Not captured,Not captured,Not captured,Not captured,Not captured,
Not captured,Not captured,04/10/2019,Not captured,Not captured,863949,020,00072,ARS-01-0049076,Beacon International,Not captured,Not captured,Not captured,,,,Mahesri,Ali Asghar,,09/10/1949,male,Not captured,Not captured,Not captured,Not captured,Not captured,Not captured,Not captured,Not captured,Not captured,Not captured,Not captured,Not captured,Not captured,,,Not captured,Not captured,Not captured,Not captured,3597 Estate View,,San Jose,California,95148,,,Not captured,Not captured,sigma1corp@gmail.com,Not captured,701932637,,Not captured,Not captured,Not captured,Not captured,Not captured,Not captured,
Not captured,Not captured,04/10/2019,Not captured,Not captured,863949,020,00072,ARS-01-0049073,Beacon International,Not captured,Not captured,Not captured,,,,Wielheesen,Mirjam,,04/24/1961,female,Not captured,Not captured,Not captured,Not captured,Not captured,Not captured,Not captured,Not captured,Not captured,Not captured,Not captured,Not captured,Not captured,,,Not captured,Not captured,Not captured,Not captured,11014 Brownstone Dr,,Parker,Colorado,80138-8069,,,Not captured,Not captured,janingve@msn.com,Not captured,701932634,,Not captured,Not captured,Not captured,Not captured,Not captured,Not captured,
Not captured,Not captured,04/10/2019,Not captured,Not captured,863949,020,00072,ARS-02-0049072,Beacon America,Not captured,Not captured,Not captured,,,,Sevrin,Alexandra,,09/15/1980,female,Not captured,Not captured,Not captured,Not captured,Not captured,Not captured,Not captured,Not captured,Not captured,Not captured,Not captured,Not captured,Not captured,,,Not captured,Not captured,Not captured,Not captured,3832 Fernleaf rd,,Columbia,,29206,,,Not captured,Not captured,m3gan3vans@gmail.com,Not captured,701932607,,Not captured,Not captured,Not captured,Not captured,Not captured,Not captured,
Not captured,Not captured,04/10/2019,Not captured,Not captured,863949,020,00072,ARS-01-0049069,Beacon International,Not captured,Not captured,Not captured,,,,Wood,Debra,,04/19/1953,female,Not captured,Not captured,Not captured,Not captured,Not captured,Not captured,Not captured,Not captured,Not captured,Not captured,Not captured,Not captured,Not captured,,,Not captured,Not captured,Not captured,Not captured,22573 cass river road,,Macomb,Michigan,48043,,,Not captured,Not captured,debwood@comcast.net,Not captured,701932604,,Not captured,Not captured,Not captured,Not captured,Not captured,Not captured,
Not captured,Not captured,04/10/2019,Not captured,Not captured,863949,020,00072,ARS-01-0049068,Beacon International,Not captured,Not captured,Not captured,,,,Wood,Bruce,,07/16/1953,male,Not captured,Not captured,Not captured,Not captured,Not captured,Not captured,Not captured,Not captured,Not captured,Not captured,Not captured,Not captured,Not captured,,,Not captured,Not captured,Not captured,Not captured,22573 cass river road,,Macomb,Michigan,48043,,,Not captured,Not captured,debwood@comcast.net,Not captured,701932603,,Not captured,Not captured,Not captured,Not captured,Not captured,Not captured,
Not captured,Not captured,04/10/2019,Not captured,Not captured,863949,020,00072,OVI-28-0049055,OverseasCare Visitors Insurance Plan,Not captured,Not captured,Not captured,,,,Munuswamy,Ramu,,08/10/1948,male,Not captured,Not captured,Not captured,Not captured,Not captured,Not captured,Not captured,Not captured,Not captured,Not captured,Not captured,Not captured,Not captured,Jaivijay Ramu,Son,Not captured,Not captured,Not captured,Not captured,3615 Tidalwood Drive,,Manvel,Texas,77578,8324280546,,Not captured,Not captured,jaivijay.ramu@gmail.com,Not captured,701932590,,Not captured,Not captured,Not captured,Not captured,Not captured,Not captured,
Not captured,Not captured,04/10/2019,Not captured,Not captured,863949,020,00072,OVI-28-0049054,OverseasCare Visitors Insurance Plan,Not captured,Not captured,Not captured,,,,Ramu,Uma Maheswari ,,01/27/1954,male,Not captured,Not captured,Not captured,Not captured,Not captured,Not captured,Not captured,Not captured,Not captured,Not captured,Not captured,Not captured,Not captured,Jaivijay Ramu,Son,Not captured,Not captured,Not captured,Not captured,3615 Tidalwood Drive,,Manvel,Texas,77578,8324280546,,Not captured,Not captured,jaivijay.ramu@gmail.com,Not captured,701932589,,Not captured,Not captured,Not captured,Not captured,Not captured,Not captured,
Not captured,Not captured,04/09/2019,Not captured,Not captured,863949,020,00072,ARS-01-0049052,Beacon International,Not captured,Not captured,Not captured,,,,nelson,matthew,d,09/02/1969,male,Not captured,Not captured,Not captured,Not captured,Not captured,Not captured,Not captured,Not captured,Not captured,Not captured,Not captured,Not captured,Not captured,,,Not captured,Not captured,Not captured,Not captured,606 Palomar Drive,,redwood city,California,94062,,,Not captured,Not captured,matthewdnelson@hotmail.com,Not captured,701932587,,Not captured,Not captured,Not captured,Not captured,Not captured,Not captured,
Not captured,Not captured,04/10/2019,Not captured,Not captured,863949,020,00072,ARS-01-0049051,Beacon International,Not captured,Not captured,Not captured,,,,Shaingeerten,Elin,,08/25/1953,female,Not captured,Not captured,Not captured,Not captured,Not captured,Not captured,Not captured,Not captured,Not captured,Not captured,Not captured,Not captured,Not captured,,,Not captured,Not captured,Not captured,Not captured,66 Enclave Blvd,,Lakewood,New Jersey,08701,732-370-6658,,Not captured,Not captured,eshaingarten@gmail.com,Not captured,701932586,,Not captured,Not captured,Not captured,Not captured,Not captured,Not captured,
Not captured,Not captured,04/09/2019,Not captured,Not captured,863949,020,00072,ARS-01-0049042,Beacon International,Not captured,Not captured,Not captured,,,,Simcha,Bunim ,,05/16/2000,male,Not captured,Not captured,Not captured,Not captured,Not captured,Not captured,Not captured,Not captured,Not captured,Not captured,Not captured,Not captured,Not captured,,,Not captured,Not captured,Not captured,Not captured,131 Route 306,,Monsey,New York,10952,845-548-6484,,Not captured,Not captured,devorah222@gmail.com,Not captured,701932577,,Not captured,Not captured,Not captured,Not captured,Not captured,Not captured,
Not captured,Not captured,04/09/2019,Not captured,Not captured,863949,020,00072,ARS-02-0049041,Beacon America,Not captured,Not captured,Not captured,,,,Heidari,Ahmad Shwan,,06/07/1982,male,Not captured,Not captured,Not captured,Not captured,Not captured,Not captured,Not captured,Not captured,Not captured,Not captured,Not captured,Not captured,Not captured,,,Not captured,Not captured,Not captured,Not captured,2537 upland drive,,Vancouver,British Columbia,V5S 2B6,,,Not captured,Not captured,shawnishonan@gmail.com,Not captured,701932576,,Not captured,Not captured,Not captured,Not captured,Not captured,Not captured,
Not captured,Not captured,04/09/2019,Not captured,Not captured,863949,020,00072,ARS-02-0049040,Beacon America,Not captured,Not captured,Not captured,,,,Nishinohara,Matthew,,05/13/1995,male,Not captured,Not captured,Not captured,Not captured,Not captured,Not captured,Not captured,Not captured,Not captured,Not captured,Not captured,Not captured,Not captured,,,Not captured,Not captured,Not captured,Not captured,2537 upland drive,,Vancouver,British Columbia,V5S 2B6,,,Not captured,Not captured,shawnishonan@gmail.com,Not captured,701932575,,Not captured,Not captured,Not captured,Not captured,Not captured,Not captured,
Not captured,Not captured,04/05/2019,Not captured,Not captured,863949,020,00072,ARS-04-0048795,Enhanced America,Not captured,Not captured,Not captured,Passport(656941156),,,Moore,Carter,,03/05/2019,male,Not captured,Not captured,Not captured,Not captured,Not captured,Not captured,Not captured,Not captured,Not captured,Not captured,Not captured,Not captured,Not captured,,,Not captured,Not captured,Not captured,Not captured,Dinostraton 84,,Athens,Attiki,11743,404-935-8555,,Not captured,Not captured,service@azimuthrisk.com,Not captured,701932270,,Not captured,Not captured,Not captured,Not captured,Not captured,Not captured,
Not captured,Not captured,04/09/2019,Not captured,Not captured,863949,020,00072,ARS-01-0049024,Beacon International,Not captured,Not captured,Not captured,,,,Clarke,Heather,,09/13/1974,female,Not captured,Not captured,Not captured,Not captured,Not captured,Not captured,Not captured,Not captured,Not captured,Not captured,Not captured,Not captured,Not captured,,,Not captured,Not captured,Not captured,Not captured,2125 52nd ave sw,,Seattle,Washington,98116,,,Not captured,Not captured,heatherclarkie@gmail.com,Not captured,701932511,,Not captured,Not captured,Not captured,Not captured,Not captured,Not captured,
Not captured,Not captured,04/09/2019,Not captured,Not captured,863949,020,00072,ARS-01-0049023,Beacon International,Not captured,Not captured,Not captured,,,,Ford,Grant,M,10/29/1984,male,Not captured,Not captured,Not captured,Not captured,Not captured,Not captured,Not captured,Not captured,Not captured,Not captured,Not captured,Not captured,Not captured,,,Not captured,Not captured,Not captured,Not captured,1717 WEATHERWOOD DR,,FLOWER MOUND,Texas,75028,,,Not captured,Not captured,gford223@gmail.com,Not captured,701932510,,Not captured,Not captured,Not captured,Not captured,Not captured,Not captured,
Not captured,Not captured,04/09/2019,Not captured,Not captured,863949,020,00072,ARS-01-0049022,Beacon International,Not captured,Not captured,Not captured,,,,Zhydkova,Daria,,10/12/1991,female,Not captured,Not captured,Not captured,Not captured,Not captured,Not captured,Not captured,Not captured,Not captured,Not captured,Not captured,Not captured,Not captured,,,Not captured,Not captured,Not captured,Not captured,96/153 Yuvileiny Ln ap 136,,Kharkiv Ukraine,,61112,,,Not captured,Not captured,dariaignatenko@gmail.com,Not captured,701932509,,Not captured,Not captured,Not captured,Not captured,Not captured,Not captured,
Not captured,Not captured,04/08/2019,Not captured,Not captured,863949,020,00072,ARS-01-0049015,Beacon International,Not captured,Not captured,Not captured,,,,Benoliel,Rina,,08/05/1992,female,Not captured,Not captured,Not captured,Not captured,Not captured,Not captured,Not captured,Not captured,Not captured,Not captured,Not captured,Not captured,Not captured,,,Not captured,Not captured,Not captured,Not captured,1151 E 10th St,,Brooklyn,New York,11230,,,Not captured,Not captured,rinab49@gmail.com,Not captured,701932502,,Not captured,Not captured,Not captured,Not captured,Not captured,Not captured,
Not captured,Not captured,04/10/2019,Not captured,Not captured,863949,020,00072,ARS-01-0049014,Beacon International,Not captured,Not captured,Not captured,,,,Stein,Shmuel,,11/03/1989,male,Not captured,Not captured,Not captured,Not captured,Not captured,Not captured,Not captured,Not captured,Not captured,Not captured,Not captured,Not captured,Not captured,,,Not captured,Not captured,Not captured,Not captured,124 10th Street,,Lakewood,New Jersey,08701,732-407-0586,,Not captured,Not captured,moses12410@yahoo.com,Not captured,701932501,,Not captured,Not captured,Not captured,Not captured,Not captured,Not captured,
Not captured,Not captured,04/08/2019,Not captured,Not captured,863949,020,00072,ARS-02-0049013,Beacon America,Not captured,Not captured,Not captured,,,,RUBIO HERNANDEZ,CARLA SOLEDAD,,05/03/1984,female,Not captured,Not captured,Not captured,Not captured,Not captured,Not captured,Not captured,Not captured,Not captured,Not captured,Not captured,Not captured,Not captured,LUISA HERNANDEZ,MOTHER IN LAW,Not captured,Not captured,Not captured,Not captured,AV PRINCIPAL DE PUEBLO NUEVO URB DO&Ntilde;A EMILIA CASA 2,,SAN CRISTOBAL,Tachira,5001,+584126490161,,Not captured,Not captured,carlasole@gmail.com,Not captured,701932500,,Not captured,Not captured,Not captured,Not captured,Not captured,Not captured,
Not captured,Not captured,04/08/2019,Not captured,Not captured,863949,020,00072,ARS-02-0049012,Beacon America,Not captured,Not captured,Not captured,Passport(112609074),,,GARAVITO COPETE,GIOVANNY FRANCISCO,,06/28/1980,male,Not captured,Not captured,Not captured,Not captured,Not captured,Not captured,Not captured,Not captured,Not captured,Not captured,Not captured,Not captured,Not captured,LUISA HERNANDEZ,MOTHER IN LAW,Not captured,Not captured,Not captured,Not captured,AV PRINCIPAL DE PUEBLO NUEVO URB DO&Ntilde;A EMILIA CASA 2,,SAN CRISTOBAL,Tachira,5001,+584126490161,,Not captured,Not captured,carlasole@gmail.com,Not captured,701932499,,Not captured,Not captured,Not captured,Not captured,Not captured,Not captured,
Not captured,Not captured,04/08/2019,Not captured,Not captured,863949,020,00072,ARS-01-0049009,Beacon International,Not captured,Not captured,Not captured,,,,Trudelle,Marie,,09/09/1992,female,Not captured,Not captured,Not captured,Not captured,Not captured,Not captured,Not captured,Not captured,Not captured,Not captured,Not captured,Not captured,Not captured,,,Not captured,Not captured,Not captured,Not captured,302 Portola Road,,Portola Valley,California,94028,,,Not captured,Not captured,mtrudelle@westmont.edu,Not captured,701932496,,Not captured,Not captured,Not captured,Not captured,Not captured,Not captured,
Not captured,Not captured,04/08/2019,Not captured,Not captured,863949,020,00072,ARS-02-0049007,Beacon America,Not captured,Not captured,Not captured,Passport(A06392853),,,Bezuidenhout,Courtney,J,03/13/1994,female,Not captured,Not captured,Not captured,Not captured,Not captured,Not captured,Not captured,Not captured,Not captured,Not captured,Not captured,Not captured,Not captured,,,Not captured,Not captured,Not captured,Not captured,978 Eulalia Rd NE,,Atlanta,Georgia,30319,4043095268,,Not captured,Not captured,kuds21@gmail.com,Not captured,701932494,,Not captured,Not captured,Not captured,Not captured,Not captured,Not captured,
Not captured,Not captured,04/08/2019,Not captured,Not captured,863949,020,00072,ARS-01-0049002,Beacon International,Not captured,Not captured,Not captured,,,,Jordis,Marion,,04/17/1972,female,Not captured,Not captured,Not captured,Not captured,Not captured,Not captured,Not captured,Not captured,Not captured,Not captured,Not captured,Not captured,Not captured,,,Not captured,Not captured,Not captured,Not captured,Primeira Calle 721,,Guayaquil,,n/a,,,Not captured,Not captured,mjordis@yahoo.co.uk,Not captured,701932489,,Not captured,Not captured,Not captured,Not captured,Not captured,Not captured,
Not captured,Not captured,04/08/2019,Not captured,Not captured,863949,020,00072,ARS-01-0049000,Beacon International,Not captured,Not captured,Not captured,,,,Norris,Clara,A,07/13/1956,female,Not captured,Not captured,Not captured,Not captured,Not captured,Not captured,Not captured,Not captured,Not captured,Not captured,Not captured,Not captured,Not captured,,,Not captured,Not captured,Not captured,Not captured,61930 Scott Street,,South Bend,Indiana,46614,,,Not captured,Not captured,ellienorris44@gmail.com,Not captured,701932487,,Not captured,Not captured,Not captured,Not captured,Not captured,Not captured,
Not captured,Not captured,04/08/2019,Not captured,Not captured,863949,020,00072,ARS-01-0048999,Beacon International,Not captured,Not captured,Not captured,,,,Scott,Janice,M,03/29/1950,female,Not captured,Not captured,Not captured,Not captured,Not captured,Not captured,Not captured,Not captured,Not captured,Not captured,Not captured,Not captured,Not captured,,,Not captured,Not captured,Not captured,Not captured,1124 Holmes Road,,North Pole,Alaska,99705,,,Not captured,Not captured,janscott1.js@gmail.com,Not captured,701932486,,Not captured,Not captured,Not captured,Not captured,Not captured,Not captured,
Not captured,Not captured,04/08/2019,Not captured,Not captured,863949,020,00072,ARS-01-0048998,Beacon International,Not captured,Not captured,Not captured,,,,Parks,Shandra,A,06/13/1988,female,Not captured,Not captured,Not captured,Not captured,Not captured,Not captured,Not captured,Not captured,Not captured,Not captured,Not captured,Not captured,Not captured,,,Not captured,Not captured,Not captured,Not captured,2523 West 18th Place,,Cleveland,Ohio,44113,,,Not captured,Not captured,shandraparks@gmail.com,Not captured,701932485,,Not captured,Not captured,Not captured,Not captured,Not captured,Not captured,
Not captured,Not captured,04/08/2019,Not captured,Not captured,863949,020,00072,ARS-01-0048997,Beacon International,Not captured,Not captured,Not captured,,,,Gibbons,Shea,D,04/30/1992,male,Not captured,Not captured,Not captured,Not captured,Not captured,Not captured,Not captured,Not captured,Not captured,Not captured,Not captured,Not captured,Not captured,,,Not captured,Not captured,Not captured,Not captured,4245 Safford Bryce Rd.,,Safford,Arizona,85546,,,Not captured,Not captured,sheagibbons181@gmail.com,Not captured,701932484,,Not captured,Not captured,Not captured,Not captured,Not captured,Not captured,
Not captured,Not captured,04/07/2019,Not captured,Not captured,863949,020,00072,ARS-01-0048996,Beacon International,Not captured,Not captured,Not captured,,,,Pritchard,Gannon,H,04/22/1984,male,Not captured,Not captured,Not captured,Not captured,Not captured,Not captured,Not captured,Not captured,Not captured,Not captured,Not captured,Not captured,Not captured,,,Not captured,Not captured,Not captured,Not captured,5264 Village Way,,Nashville,Tennessee,37211,,,Not captured,Not captured,GannonPritchard@gmail.com,Not captured,701932483,,Not captured,Not captured,Not captured,Not captured,Not captured,Not captured,
Not captured,Not captured,04/08/2019,Not captured,Not captured,863949,020,00072,ARS-02-0048990,Beacon America,Not captured,Not captured,Not captured,,,,KANKANHALLI,SARASWATI,,06/17/1939,female,Not captured,Not captured,Not captured,Not captured,Not captured,Not captured,Not captured,Not captured,Not captured,Not captured,Not captured,Not captured,Not captured,,,Not captured,Not captured,Not captured,Not captured,43555 Grimmer Blvd,,Fremont,California,94538,4088075982,,Not captured,Not captured,santosh.kankanhalli@gmail.com,Not captured,701932476,,Not captured,Not captured,Not captured,Not captured,Not captured,Not captured,
Not captured,Not captured,04/07/2019,Not captured,Not captured,863949,020,00072,ARS-01-0048989,Beacon International,Not captured,Not captured,Not captured,,,,Jordan,Amanda Thecla,C,03/08/1996,female,Not captured,Not captured,Not captured,Not captured,Not captured,Not captured,Not captured,Not captured,Not captured,Not captured,Not captured,Not captured,Not captured,,,Not captured,Not captured,Not captured,Not captured,302 22nd Ave north,,nashville,Tennessee,37203,,,Not captured,Not captured,amandajordan494@gmail.com,Not captured,701932475,,Not captured,Not captured,Not captured,Not captured,Not captured,Not captured,
Not captured,Not captured,04/07/2019,Not captured,Not captured,863949,020,00072,ARS-02-0048988,Beacon America,Not captured,Not captured,Not captured,,,,EL MAIFI,M&apos;barek,,11/01/1946,male,Not captured,Not captured,Not captured,Not captured,Not captured,Not captured,Not captured,Not captured,Not captured,Not captured,Not captured,Not captured,Not captured,,,Not captured,Not captured,Not captured,Not captured,15 Angle Rue Senegal et Rue Loubnane NO 18,,Rabat,,10040,,,Not captured,Not captured,aelmaifi@gmail.com,Not captured,701932474,,Not captured,Not captured,Not captured,Not captured,Not captured,Not captured,
Not captured,Not captured,04/07/2019,Not captured,Not captured,863949,020,00072,ARS-01-0048987,Beacon International,Not captured,Not captured,Not captured,,,,Webb Araya,Wendy,,03/23/1989,female,Not captured,Not captured,Not captured,Not captured,Not captured,Not captured,Not captured,Not captured,Not captured,Not captured,Not captured,Not captured,Not captured,,,Not captured,Not captured,Not captured,Not captured,Calle 118 Pavas,,San Jos&eacute;,,10109,,,Not captured,Not captured,tavo17cv@gmail.com,Not captured,701932473,,Not captured,Not captured,Not captured,Not captured,Not captured,Not captured,
Not captured,Not captured,04/07/2019,Not captured,Not captured,863949,020,00072,ARS-01-0048986,Beacon International,Not captured,Not captured,Not captured,,,,Corrales Vargas,Gustavo,,12/17/1989,male,Not captured,Not captured,Not captured,Not captured,Not captured,Not captured,Not captured,Not captured,Not captured,Not captured,Not captured,Not captured,Not captured,,,Not captured,Not captured,Not captured,Not captured,Calle 118 Pavas,,San Jos&eacute;,,10109,,,Not captured,Not captured,tavo17cv@gmail.com,Not captured,701932472,,Not captured,Not captured,Not captured,Not captured,Not captured,Not captured,
Not captured,Not captured,04/09/2019,Not captured,Not captured,863949,020,00072,ARS-01-0048984,Beacon International,Not captured,Not captured,Not captured,,,,Acero Alvarado,Iria Israela,,01/05/2009,female,Not captured,Not captured,Not captured,Not captured,Not captured,Not captured,Not captured,Not captured,Not captured,Not captured,Not captured,Not captured,Not captured,,,Not captured,Not captured,Not captured,Not captured,calle 14,,san cristobal,Tachira,5001,4147069647,,Not captured,Not captured,oficinafg2011@hotmail.com,Not captured,701932470,,Not captured,Not captured,Not captured,Not captured,Not captured,Not captured,
Not captured,Not captured,04/09/2019,Not captured,Not captured,863949,020,00072,ARS-01-0048983,Beacon International,Not captured,Not captured,Not captured,,,,Alvarado Castro,Iria Chiquinquira,,11/04/1969,female,Not captured,Not captured,Not captured,Not captured,Not captured,Not captured,Not captured,Not captured,Not captured,Not captured,Not captured,Not captured,Not captured,,,Not captured,Not captured,Not captured,Not captured,calle 14,,san cristobal,Tachira,5001,4147069647,,Not captured,Not captured,oficinafg2011@hotmail.com,Not captured,701932469,,Not captured,Not captured,Not captured,Not captured,Not captured,Not captured,