EE Transaction Type,Dependent Transaction Type,Effective Date,EE Signature,EE Signature Date,Control,Suffix,Account,Plan Number,Plan Name,Claim Office,Network ID Number,Customer Code,EE SSN,Dependent SSN,Dependent Relationship,Last Name,First Name,Middle Initial,DOB,Gender,Ethnicity,PCP/PCD,PCP/PCD Current Patient,Provider Cap Office Number,COB,Dep Student Indicator,Dep OOA Indicator,EE Prior Coverage Indicator,EE Late Entrant,EE Language Indicator,Hire Date,Earnings,Earnings Frequency,Beneficiary (Last Name First Name MI),Beneficiary Relationship,Continuation of Coverage Expiration Date,Continuation of Coverage Event Date,Continuation of Coverage Length of Coverage,Work Location Zip Code,Street Address Line 1,Street Address Line 2,City,State,Zip Code,Home Phone Number,Work Phone Number,Accept Code,Evidence Code,EE Email Address,Communication Disability Code,EE Alternate ID,Dep Alternate ID,Old Control,Old Suffix,Old Account,New Control,New Suffix,New Account,
Not captured,Not captured,04/17/2019,Not captured,Not captured,863949,020,00072,ARS-01-0049356,Beacon International,Not captured,Not captured,Not captured,,,,Baile,Erin,E,03/14/1988,female,Not captured,Not captured,Not captured,Not captured,Not captured,Not captured,Not captured,Not captured,Not captured,Not captured,Not captured,Not captured,Not captured,,,Not captured,Not captured,Not captured,Not captured,5-2225 w1st ave,,Vancouver,British Columbia,V6k1e9,,,Not captured,Not captured,erin.baile@outlook.com,Not captured,701933058,,Not captured,Not captured,Not captured,Not captured,Not captured,Not captured,
Not captured,Not captured,04/17/2019,Not captured,Not captured,863949,020,00072,ARS-01-0049355,Beacon International,Not captured,Not captured,Not captured,,,,Warsman,Chaim,,11/19/2016,male,Not captured,Not captured,Not captured,Not captured,Not captured,Not captured,Not captured,Not captured,Not captured,Not captured,Not captured,Not captured,Not captured,,,Not captured,Not captured,Not captured,Not captured,19 Karlsburg unit 302,,Monroe,New York,10950,845-5530430,,Not captured,Not captured,avrumiw43@gmail.com,Not captured,701933057,,Not captured,Not captured,Not captured,Not captured,Not captured,Not captured,
Not captured,Not captured,04/17/2019,Not captured,Not captured,863949,020,00072,ARS-01-0049354,Beacon International,Not captured,Not captured,Not captured,,,,Warsman,Esther,,03/09/1995,female,Not captured,Not captured,Not captured,Not captured,Not captured,Not captured,Not captured,Not captured,Not captured,Not captured,Not captured,Not captured,Not captured,,,Not captured,Not captured,Not captured,Not captured,19 Karlsburg unit 302,,Monroe,New York,10950,845-5530430,,Not captured,Not captured,avrumiw43@gmail.com,Not captured,701933056,,Not captured,Not captured,Not captured,Not captured,Not captured,Not captured,
Not captured,Not captured,04/17/2019,Not captured,Not captured,863949,020,00072,ARS-01-0049353,Beacon International,Not captured,Not captured,Not captured,,,,Warsman,Dovid,,07/04/1996,male,Not captured,Not captured,Not captured,Not captured,Not captured,Not captured,Not captured,Not captured,Not captured,Not captured,Not captured,Not captured,Not captured,,,Not captured,Not captured,Not captured,Not captured,19 Karlsburg unit 302,,Monroe,New York,10950,845-5530430,,Not captured,Not captured,avrumiw43@gmail.com,Not captured,701933055,,Not captured,Not captured,Not captured,Not captured,Not captured,Not captured,
Not captured,Not captured,04/17/2019,Not captured,Not captured,863949,020,00072,ARS-01-0049343,Beacon International,Not captured,Not captured,Not captured,,,,ezroni,liel,,05/19/2003,female,Not captured,Not captured,Not captured,Not captured,Not captured,Not captured,Not captured,Not captured,Not captured,Not captured,Not captured,Not captured,Not captured,,,Not captured,Not captured,Not captured,Not captured,5 ramsey road,,great neck,New York,11023,,,Not captured,Not captured,shesec@aol.com,Not captured,701933029,,Not captured,Not captured,Not captured,Not captured,Not captured,Not captured,
Not captured,Not captured,04/17/2019,Not captured,Not captured,863949,020,00072,ARS-01-0049342,Beacon International,Not captured,Not captured,Not captured,,,,ezroni,dror,,10/15/1967,male,Not captured,Not captured,Not captured,Not captured,Not captured,Not captured,Not captured,Not captured,Not captured,Not captured,Not captured,Not captured,Not captured,,,Not captured,Not captured,Not captured,Not captured,5 ramsey road,,great neck,New York,11023,,,Not captured,Not captured,shesec@aol.com,Not captured,701933028,,Not captured,Not captured,Not captured,Not captured,Not captured,Not captured,
Not captured,Not captured,04/17/2019,Not captured,Not captured,863949,020,00072,ARS-01-0049341,Beacon International,Not captured,Not captured,Not captured,,,,ezroni,ada,,08/07/1968,female,Not captured,Not captured,Not captured,Not captured,Not captured,Not captured,Not captured,Not captured,Not captured,Not captured,Not captured,Not captured,Not captured,,,Not captured,Not captured,Not captured,Not captured,5 ramsey road,,great neck,New York,11023,,,Not captured,Not captured,shesec@aol.com,Not captured,701933027,,Not captured,Not captured,Not captured,Not captured,Not captured,Not captured,
Not captured,Not captured,04/17/2019,Not captured,Not captured,863949,020,00072,ARS-01-0049334,Beacon International,Not captured,Not captured,Not captured,,,,Whiman,David,,07/07/1950,male,Not captured,Not captured,Not captured,Not captured,Not captured,Not captured,Not captured,Not captured,Not captured,Not captured,Not captured,Not captured,Not captured,,,Not captured,Not captured,Not captured,Not captured,97 Swamp Road,,East Hampton,New York,11937,,,Not captured,Not captured,duvudel@gmail.com,Not captured,701933003,,Not captured,Not captured,Not captured,Not captured,Not captured,Not captured,
Not captured,Not captured,04/17/2019,Not captured,Not captured,863949,020,00072,ARS-01-0049333,Beacon International,Not captured,Not captured,Not captured,,,,Zucker,David,,12/04/1953,male,Not captured,Not captured,Not captured,Not captured,Not captured,Not captured,Not captured,Not captured,Not captured,Not captured,Not captured,Not captured,Not captured,,,Not captured,Not captured,Not captured,Not captured,97 Swamp Road,,East Hampton,New York,11937,,,Not captured,Not captured,duvudel@gmail.com,Not captured,701933002,,Not captured,Not captured,Not captured,Not captured,Not captured,Not captured,
Not captured,Not captured,04/17/2019,Not captured,Not captured,863949,020,00072,ARS-01-0049328,Beacon International,Not captured,Not captured,Not captured,,,,Eisen,Isasbel,D,01/11/1947,female,Not captured,Not captured,Not captured,Not captured,Not captured,Not captured,Not captured,Not captured,Not captured,Not captured,Not captured,Not captured,Not captured,,,Not captured,Not captured,Not captured,Not captured,1 Melby Lane,,Roslyn,New York,11576,,,Not captured,Not captured,bdresdale@aol.com,Not captured,701932997,,Not captured,Not captured,Not captured,Not captured,Not captured,Not captured,
Not captured,Not captured,04/17/2019,Not captured,Not captured,863949,020,00072,ARS-01-0049327,Beacon International,Not captured,Not captured,Not captured,,,,Dresdale,Robert,J,09/17/1946,male,Not captured,Not captured,Not captured,Not captured,Not captured,Not captured,Not captured,Not captured,Not captured,Not captured,Not captured,Not captured,Not captured,,,Not captured,Not captured,Not captured,Not captured,1 Melby Lane,,Roslyn,New York,11576,,,Not captured,Not captured,bdresdale@aol.com,Not captured,701932996,,Not captured,Not captured,Not captured,Not captured,Not captured,Not captured,
Not captured,Not captured,04/17/2019,Not captured,Not captured,863949,020,00072,ARS-01-0049318,Beacon International,Not captured,Not captured,Not captured,,,,Strider,Carol,,04/26/1952,female,Not captured,Not captured,Not captured,Not captured,Not captured,Not captured,Not captured,Not captured,Not captured,Not captured,Not captured,Not captured,Not captured,,,Not captured,Not captured,Not captured,Not captured,1150 4th St SW,,Washington,Dist. of Columbia,20024,,,Not captured,Not captured,cooper.cooper@gmail.com,Not captured,701932987,,Not captured,Not captured,Not captured,Not captured,Not captured,Not captured,
Not captured,Not captured,04/17/2019,Not captured,Not captured,863949,020,00072,ARS-01-0049317,Beacon International,Not captured,Not captured,Not captured,,,,Cooper,Matthew,,07/01/1985,male,Not captured,Not captured,Not captured,Not captured,Not captured,Not captured,Not captured,Not captured,Not captured,Not captured,Not captured,Not captured,Not captured,,,Not captured,Not captured,Not captured,Not captured,1150 4th St SW,,Washington,Dist. of Columbia,20024,,,Not captured,Not captured,cooper.cooper@gmail.com,Not captured,701932986,,Not captured,Not captured,Not captured,Not captured,Not captured,Not captured,
Not captured,Not captured,04/17/2019,Not captured,Not captured,863949,020,00072,ARS-01-0049315,Beacon International,Not captured,Not captured,Not captured,,,,Mavilla,Jonathan,G,06/03/1993,male,Not captured,Not captured,Not captured,Not captured,Not captured,Not captured,Not captured,Not captured,Not captured,Not captured,Not captured,Not captured,Not captured,,,Not captured,Not captured,Not captured,Not captured,7 Danjohn Cres,,Toronto,Ontario,M1V3N2,,,Not captured,Not captured,jgmavilla@hotmail.com,Not captured,701932983,,Not captured,Not captured,Not captured,Not captured,Not captured,Not captured,
Not captured,Not captured,04/16/2019,Not captured,Not captured,863949,020,00072,ARS-01-0049314,Beacon International,Not captured,Not captured,Not captured,,,,Chan,Johnathan,,07/19/1988,male,Not captured,Not captured,Not captured,Not captured,Not captured,Not captured,Not captured,Not captured,Not captured,Not captured,Not captured,Not captured,Not captured,,,Not captured,Not captured,Not captured,Not captured,10724 Greenwood Ave N,,Seattle,Washington,98133,,,Not captured,Not captured,ambercolgrove@gmail.com,Not captured,701932982,,Not captured,Not captured,Not captured,Not captured,Not captured,Not captured,
Not captured,Not captured,04/16/2019,Not captured,Not captured,863949,020,00072,ARS-01-0049313,Beacon International,Not captured,Not captured,Not captured,,,,Colgrove,Amber,,10/13/1987,female,Not captured,Not captured,Not captured,Not captured,Not captured,Not captured,Not captured,Not captured,Not captured,Not captured,Not captured,Not captured,Not captured,,,Not captured,Not captured,Not captured,Not captured,10724 Greenwood Ave N,,Seattle,Washington,98133,,,Not captured,Not captured,ambercolgrove@gmail.com,Not captured,701932981,,Not captured,Not captured,Not captured,Not captured,Not captured,Not captured,
Not captured,Not captured,04/16/2019,Not captured,Not captured,863949,020,00072,ARS-03-0049160,Essential America,Not captured,Not captured,Not captured,Passport(NA),,,CROSS,MARK,CHARLES,03/01/1973,male,Not captured,Not captured,Not captured,Not captured,Not captured,Not captured,Not captured,Not captured,Not captured,Not captured,Not captured,Not captured,Not captured,,,Not captured,Not captured,Not captured,Not captured,339 MIDWAY AVE,,KIRKWOOD,Missouri,63122,8472041818,,Not captured,Not captured,mark.cross@redzonegroup.com,Not captured,701932758,,Not captured,Not captured,Not captured,Not captured,Not captured,Not captured,
Not captured,Not captured,04/17/2019,Not captured,Not captured,863949,020,00072,ARS-02-0049307,Beacon America,Not captured,Not captured,Not captured,,,,Horowitz,Meyer,,08/05/2016,male,Not captured,Not captured,Not captured,Not captured,Not captured,Not captured,Not captured,Not captured,Not captured,Not captured,Not captured,Not captured,Not captured,,,Not captured,Not captured,Not captured,Not captured,406 Ridge Ave,,Lakewood,New Jersey,08701,732-3674194,,Not captured,Not captured,nisihorowitz@gmail.com,Not captured,701932958,,Not captured,Not captured,Not captured,Not captured,Not captured,Not captured,
Not captured,Not captured,04/17/2019,Not captured,Not captured,863949,020,00072,ARS-02-0049306,Beacon America,Not captured,Not captured,Not captured,,,,Horowitz,Binyomin,,04/20/2018,male,Not captured,Not captured,Not captured,Not captured,Not captured,Not captured,Not captured,Not captured,Not captured,Not captured,Not captured,Not captured,Not captured,,,Not captured,Not captured,Not captured,Not captured,406 Ridge Ave,,Lakewood,New Jersey,08701,732-3674194,,Not captured,Not captured,nisihorowitz@gmail.com,Not captured,701932957,,Not captured,Not captured,Not captured,Not captured,Not captured,Not captured,
Not captured,Not captured,04/17/2019,Not captured,Not captured,863949,020,00072,ARS-02-0049305,Beacon America,Not captured,Not captured,Not captured,,,,Horowitz,Baruch,,03/03/1991,male,Not captured,Not captured,Not captured,Not captured,Not captured,Not captured,Not captured,Not captured,Not captured,Not captured,Not captured,Not captured,Not captured,,,Not captured,Not captured,Not captured,Not captured,406 Ridge Ave,,Lakewood,New Jersey,08701,732-3674194,,Not captured,Not captured,nisihorowitz@gmail.com,Not captured,701932956,,Not captured,Not captured,Not captured,Not captured,Not captured,Not captured,
Not captured,Not captured,04/16/2019,Not captured,Not captured,863949,020,00072,ARS-02-0049301,Beacon America,Not captured,Not captured,Not captured,,,,Botma,Marrit,,06/26/1991,female,Not captured,Not captured,Not captured,Not captured,Not captured,Not captured,Not captured,Not captured,Not captured,Not captured,Not captured,Not captured,Not captured,,,Not captured,Not captured,Not captured,Not captured,Eerste Jan Steenstraat 123-3,,Amsterdam,,1072NJ,,,Not captured,Not captured,marrit.botma@gmail.com,Not captured,701932952,,Not captured,Not captured,Not captured,Not captured,Not captured,Not captured,
Not captured,Not captured,04/16/2019,Not captured,Not captured,863949,020,00072,ARS-01-0049283,Beacon International,Not captured,Not captured,Not captured,,,,Jiang,Michael,H,01/19/2001,male,Not captured,Not captured,Not captured,Not captured,Not captured,Not captured,Not captured,Not captured,Not captured,Not captured,Not captured,Not captured,Not captured,,,Not captured,Not captured,Not captured,Not captured,7 Eldridge Street Apt.5f,,Ny,New York,10002,,,Not captured,Not captured,michaelincorporation@gmail.com,Not captured,701932911,,Not captured,Not captured,Not captured,Not captured,Not captured,Not captured,
Not captured,Not captured,04/15/2019,Not captured,Not captured,863949,020,00072,ARS-02-0049281,Beacon America,Not captured,Not captured,Not captured,,,,Rinpoche,Ontul,,07/09/1951,male,Not captured,Not captured,Not captured,Not captured,Not captured,Not captured,Not captured,Not captured,Not captured,Not captured,Not captured,Not captured,Not captured,,,Not captured,Not captured,Not captured,Not captured,Drigung Kagyu Buddhist Monastery,,District. Mandi Himachal Pradesh,,175 023,,,Not captured,Not captured,tashidrolma7@gmail.com,Not captured,701932909,,Not captured,Not captured,Not captured,Not captured,Not captured,Not captured,
Not captured,Not captured,04/15/2019,Not captured,Not captured,863949,020,00072,ARS-02-0049280,Beacon America,Not captured,Not captured,Not captured,,,,Aka,Konchog,,02/15/1988,male,Not captured,Not captured,Not captured,Not captured,Not captured,Not captured,Not captured,Not captured,Not captured,Not captured,Not captured,Not captured,Not captured,,,Not captured,Not captured,Not captured,Not captured,Drigung Kagyu Buddhist Monastery,,District. Mandi Himachal Pradesh,,175 023,,,Not captured,Not captured,tashidrolma7@gmail.com,Not captured,701932908,,Not captured,Not captured,Not captured,Not captured,Not captured,Not captured,
Not captured,Not captured,04/16/2019,Not captured,Not captured,863949,020,00072,ARS-01-0049279,Beacon International,Not captured,Not captured,Not captured,,,,Gorodetsky,Chana,,06/27/2009,female,Not captured,Not captured,Not captured,Not captured,Not captured,Not captured,Not captured,Not captured,Not captured,Not captured,Not captured,Not captured,Not captured,,,Not captured,Not captured,Not captured,Not captured,132 Washington Ave,,Brooklyn,New York,11205,17184151300,,Not captured,Not captured,mendy@asbestway.com,Not captured,701932895,,Not captured,Not captured,Not captured,Not captured,Not captured,Not captured,
Not captured,Not captured,04/16/2019,Not captured,Not captured,863949,020,00072,ARS-01-0049278,Beacon International,Not captured,Not captured,Not captured,,,,Gorodetsky,Sara,,04/05/2004,female,Not captured,Not captured,Not captured,Not captured,Not captured,Not captured,Not captured,Not captured,Not captured,Not captured,Not captured,Not captured,Not captured,,,Not captured,Not captured,Not captured,Not captured,132 Washington Ave,,Brooklyn,New York,11205,17184151300,,Not captured,Not captured,mendy@asbestway.com,Not captured,701932894,,Not captured,Not captured,Not captured,Not captured,Not captured,Not captured,
Not captured,Not captured,04/16/2019,Not captured,Not captured,863949,020,00072,ARS-01-0049277,Beacon International,Not captured,Not captured,Not captured,,,,Bistritzky,Chaya,F,05/29/1977,female,Not captured,Not captured,Not captured,Not captured,Not captured,Not captured,Not captured,Not captured,Not captured,Not captured,Not captured,Not captured,Not captured,,,Not captured,Not captured,Not captured,Not captured,132 Washington Ave,,Brooklyn,New York,11205,17184151300,,Not captured,Not captured,mendy@asbestway.com,Not captured,701932893,,Not captured,Not captured,Not captured,Not captured,Not captured,Not captured,
Not captured,Not captured,04/16/2019,Not captured,Not captured,863949,020,00072,ARS-01-0049276,Beacon International,Not captured,Not captured,Not captured,Passport(537252783),,,Gorodetsky,Mendy,,03/16/1971,male,Not captured,Not captured,Not captured,Not captured,Not captured,Not captured,Not captured,Not captured,Not captured,Not captured,Not captured,Not captured,Not captured,,,Not captured,Not captured,Not captured,Not captured,132 Washington Ave,,Brooklyn,New York,11205,17184151300,,Not captured,Not captured,mendy@asbestway.com,Not captured,701932892,,Not captured,Not captured,Not captured,Not captured,Not captured,Not captured,
Not captured,Not captured,04/16/2019,Not captured,Not captured,863949,020,00072,ARS-01-0049269,Beacon International,Not captured,Not captured,Not captured,,,,Herrea,Ana,M,08/22/1994,female,Not captured,Not captured,Not captured,Not captured,Not captured,Not captured,Not captured,Not captured,Not captured,Not captured,Not captured,Not captured,Not captured,,,Not captured,Not captured,Not captured,Not captured,30 shafer pl,,hackensack,New Jersey,07601,,,Not captured,Not captured,anamhvo@HOTMAIL.COM,Not captured,701932885,,Not captured,Not captured,Not captured,Not captured,Not captured,Not captured,
Not captured,Not captured,04/15/2019,Not captured,Not captured,863949,020,00072,ARS-02-0049261,Beacon America,Not captured,Not captured,Not captured,,,,Langford,Mackenzie,,09/19/1995,female,Not captured,Not captured,Not captured,Not captured,Not captured,Not captured,Not captured,Not captured,Not captured,Not captured,Not captured,Not captured,Not captured,,,Not captured,Not captured,Not captured,Not captured,124 Raglan Street,,Brighton,Ontario,K0K 1H0,,,Not captured,Not captured,mackenzielangford@hotmail.com,Not captured,701932877,,Not captured,Not captured,Not captured,Not captured,Not captured,Not captured,
Not captured,Not captured,04/16/2019,Not captured,Not captured,863949,020,00072,ARS-02-0049260,Beacon America,Not captured,Not captured,Not captured,,,,Stein,Mordechai Y,,07/27/2017,male,Not captured,Not captured,Not captured,Not captured,Not captured,Not captured,Not captured,Not captured,Not captured,Not captured,Not captured,Not captured,Not captured,,,Not captured,Not captured,Not captured,Not captured,36 Flannely Ave,,Lakewood,New Jersey,08701,732-569-2917,,Not captured,Not captured,rochelfischer@gmail.com,Not captured,701932876,,Not captured,Not captured,Not captured,Not captured,Not captured,Not captured,
Not captured,Not captured,04/16/2019,Not captured,Not captured,863949,020,00072,ARS-02-0049259,Beacon America,Not captured,Not captured,Not captured,,,,Stein,Moshe,,02/01/1991,male,Not captured,Not captured,Not captured,Not captured,Not captured,Not captured,Not captured,Not captured,Not captured,Not captured,Not captured,Not captured,Not captured,,,Not captured,Not captured,Not captured,Not captured,36 Flannely Ave,,Lakewood,New Jersey,08701,732-569-2917,,Not captured,Not captured,rochelfischer@gmail.com,Not captured,701932875,,Not captured,Not captured,Not captured,Not captured,Not captured,Not captured,
Not captured,Not captured,04/16/2019,Not captured,Not captured,863949,020,00072,ARS-02-0049256,Beacon America,Not captured,Not captured,Not captured,,,,PLYM,Golda,,03/14/2019,female,Not captured,Not captured,Not captured,Not captured,Not captured,Not captured,Not captured,Not captured,Not captured,Not captured,Not captured,Not captured,Not captured,,,Not captured,Not captured,Not captured,Not captured,74 College Rd,,Monsey,New York,10952,8456411270,,Not captured,Not captured,chedvajacobs@gmail.com,Not captured,701932872,,Not captured,Not captured,Not captured,Not captured,Not captured,Not captured,
Not captured,Not captured,04/15/2019,Not captured,Not captured,863949,020,00072,ARS-03-0049161,Essential America,Not captured,Not captured,Not captured,Passport(NA),,,DUNN,CANDACE,MAERIE,06/07/1985,female,Not captured,Not captured,Not captured,Not captured,Not captured,Not captured,Not captured,Not captured,Not captured,Not captured,Not captured,Not captured,Not captured,,,Not captured,Not captured,Not captured,Not captured,5045 DOVECOTE DR,,NASHVILLE,Tennessee,37220,6158158213,,Not captured,Not captured,candace@redzonegroup.com,Not captured,701932759,,Not captured,Not captured,Not captured,Not captured,Not captured,Not captured,
Not captured,Not captured,04/15/2019,Not captured,Not captured,863949,020,00072,OVI-28-0049229,OverseasCare Visitors Insurance Plan,Not captured,Not captured,Not captured,Passport(G0394828),,,Vasireddy,Anuradha,,05/02/1962,female,Not captured,Not captured,Not captured,Not captured,Not captured,Not captured,Not captured,Not captured,Not captured,Not captured,Not captured,Not captured,Not captured,satyanarana vasireddy,husband,Not captured,Not captured,Not captured,Not captured,13560 technology Drive,,eden prairie,Minnesota,55344,9739795079,,Not captured,Not captured,vjchowdary@gmail.com,Not captured,701932844,,Not captured,Not captured,Not captured,Not captured,Not captured,Not captured,
Not captured,Not captured,04/15/2019,Not captured,Not captured,863949,020,00072,OVI-28-0049228,OverseasCare Visitors Insurance Plan,Not captured,Not captured,Not captured,Passport(G0394828),,,vasireddy,Satayanarayana,,01/01/1949,male,Not captured,Not captured,Not captured,Not captured,Not captured,Not captured,Not captured,Not captured,Not captured,Not captured,Not captured,Not captured,Not captured,satyanarana vasireddy,husband,Not captured,Not captured,Not captured,Not captured,13560 technology Drive,,eden prairie,Minnesota,55344,9739795079,,Not captured,Not captured,vjchowdary@gmail.com,Not captured,701932843,,Not captured,Not captured,Not captured,Not captured,Not captured,Not captured,
Not captured,Not captured,04/15/2019,Not captured,Not captured,863949,020,00072,ARS-01-0049226,Beacon International,Not captured,Not captured,Not captured,Passport(531235562),,,Dewey,Scott,D,11/15/1961,male,Not captured,Not captured,Not captured,Not captured,Not captured,Not captured,Not captured,Not captured,Not captured,Not captured,Not captured,Not captured,Not captured,Melanie Dewey,wife,Not captured,Not captured,Not captured,Not captured,Mercy Ministries,,Evergreen,Colorado,80437,7202619937,,Not captured,Not captured,deweyshop@comcast.net,Not captured,701932841,,Not captured,Not captured,Not captured,Not captured,Not captured,Not captured,