EE Transaction Type,Dependent Transaction Type,Effective Date,EE Signature,EE Signature Date,Control,Suffix,Account,Plan Number,Plan Name,Claim Office,Network ID Number,Customer Code,EE SSN,Dependent SSN,Dependent Relationship,Last Name,First Name,Middle Initial,DOB,Gender,Ethnicity,PCP/PCD,PCP/PCD Current Patient,Provider Cap Office Number,COB,Dep Student Indicator,Dep OOA Indicator,EE Prior Coverage Indicator,EE Late Entrant,EE Language Indicator,Hire Date,Earnings,Earnings Frequency,Beneficiary (Last Name First Name MI),Beneficiary Relationship,Continuation of Coverage Expiration Date,Continuation of Coverage Event Date,Continuation of Coverage Length of Coverage,Work Location Zip Code,Street Address Line 1,Street Address Line 2,City,State,Zip Code,Home Phone Number,Work Phone Number,Accept Code,Evidence Code,EE Email Address,Communication Disability Code,EE Alternate ID,Dep Alternate ID,Old Control,Old Suffix,Old Account,New Control,New Suffix,New Account,
Not captured,Not captured,03/24/2019,Not captured,Not captured,863949,020,00072,ARS-01-0048578,Beacon International,Not captured,Not captured,Not captured,,,,Peer,Reina,K,04/25/2018,female,Not captured,Not captured,Not captured,Not captured,Not captured,Not captured,Not captured,Not captured,Not captured,Not captured,Not captured,Not captured,Not captured,,,Not captured,Not captured,Not captured,Not captured,11 Ashley Road,,West Orange,New Jersey,07052,,,Not captured,Not captured,anna@allenbyny.com,Not captured,701931920,,Not captured,Not captured,Not captured,Not captured,Not captured,Not captured,
Not captured,Not captured,03/24/2019,Not captured,Not captured,863949,020,00072,ARS-01-0048577,Beacon International,Not captured,Not captured,Not captured,,,,Webber,Sylvia,U,08/20/1951,female,Not captured,Not captured,Not captured,Not captured,Not captured,Not captured,Not captured,Not captured,Not captured,Not captured,Not captured,Not captured,Not captured,,,Not captured,Not captured,Not captured,Not captured,11 Ashley Road,,West Orange,New Jersey,07052,,,Not captured,Not captured,anna@allenbyny.com,Not captured,701931919,,Not captured,Not captured,Not captured,Not captured,Not captured,Not captured,
Not captured,Not captured,03/24/2019,Not captured,Not captured,863949,020,00072,ARS-01-0048576,Beacon International,Not captured,Not captured,Not captured,,,,Peer,Eli,,08/19/1970,male,Not captured,Not captured,Not captured,Not captured,Not captured,Not captured,Not captured,Not captured,Not captured,Not captured,Not captured,Not captured,Not captured,,,Not captured,Not captured,Not captured,Not captured,11 Ashley Road,,West Orange,New Jersey,07052,,,Not captured,Not captured,anna@allenbyny.com,Not captured,701931918,,Not captured,Not captured,Not captured,Not captured,Not captured,Not captured,
Not captured,Not captured,03/24/2019,Not captured,Not captured,863949,020,00072,ARS-01-0048575,Beacon International,Not captured,Not captured,Not captured,,,,Peer,Anna,W,03/11/1982,female,Not captured,Not captured,Not captured,Not captured,Not captured,Not captured,Not captured,Not captured,Not captured,Not captured,Not captured,Not captured,Not captured,,,Not captured,Not captured,Not captured,Not captured,11 Ashley Road,,West Orange,New Jersey,07052,,,Not captured,Not captured,anna@allenbyny.com,Not captured,701931917,,Not captured,Not captured,Not captured,Not captured,Not captured,Not captured,
Not captured,Not captured,03/24/2019,Not captured,Not captured,863949,020,00072,ARS-02-0048574,Beacon America,Not captured,Not captured,Not captured,,,,brand,eve,,08/14/1979,female,Not captured,Not captured,Not captured,Not captured,Not captured,Not captured,Not captured,Not captured,Not captured,Not captured,Not captured,Not captured,Not captured,,,Not captured,Not captured,Not captured,Not captured,saadia Hatuka st 44,,yehud,,56100,,,Not captured,Not captured,evebr5@gmail.com,Not captured,701931916,,Not captured,Not captured,Not captured,Not captured,Not captured,Not captured,
Not captured,Not captured,03/24/2019,Not captured,Not captured,863949,020,00072,ARS-01-0048573,Beacon International,Not captured,Not captured,Not captured,,,,Roxin,Alexandra,G,06/07/1989,female,Not captured,Not captured,Not captured,Not captured,Not captured,Not captured,Not captured,Not captured,Not captured,Not captured,Not captured,Not captured,Not captured,,,Not captured,Not captured,Not captured,Not captured,POBox 1110,,Albany,New York,12201,,,Not captured,Not captured,onetosweet@gmail.com,Not captured,701931915,,Not captured,Not captured,Not captured,Not captured,Not captured,Not captured,
Not captured,Not captured,03/23/2019,Not captured,Not captured,863949,020,00072,ARS-01-0048572,Beacon International,Not captured,Not captured,Not captured,,,,Douglas,Robert,S,12/01/1950,male,Not captured,Not captured,Not captured,Not captured,Not captured,Not captured,Not captured,Not captured,Not captured,Not captured,Not captured,Not captured,Not captured,,,Not captured,Not captured,Not captured,Not captured,14204 - 95th Avenue NE,,Kirkland,Washington,98034,,,Not captured,Not captured,sdouglasscott@gmail.com,Not captured,701931914,,Not captured,Not captured,Not captured,Not captured,Not captured,Not captured,
Not captured,Not captured,03/22/2019,Not captured,Not captured,863949,020,00072,ARS-02-0048570,Beacon America,Not captured,Not captured,Not captured,,,,Or,Eliyahu,,09/19/2009,male,Not captured,Not captured,Not captured,Not captured,Not captured,Not captured,Not captured,Not captured,Not captured,Not captured,Not captured,Not captured,Not captured,,,Not captured,Not captured,Not captured,Not captured,510 NW 107th st,,Miami,Florida,33168,,,Not captured,Not captured,yaeli8@hotmail.com,Not captured,701931912,,Not captured,Not captured,Not captured,Not captured,Not captured,Not captured,
Not captured,Not captured,03/23/2019,Not captured,Not captured,863949,020,00072,ARS-01-0048565,Beacon International,Not captured,Not captured,Not captured,,,,Hindle,Veronika,,08/12/1976,female,Not captured,Not captured,Not captured,Not captured,Not captured,Not captured,Not captured,Not captured,Not captured,Not captured,Not captured,Not captured,Not captured,,,Not captured,Not captured,Not captured,Not captured,1128 Gambelli Dr,,Yorktown Heights,New York,10598,,,Not captured,Not captured,veronikahindle@gmail.com,Not captured,701931907,,Not captured,Not captured,Not captured,Not captured,Not captured,Not captured,
Not captured,Not captured,03/23/2019,Not captured,Not captured,863949,020,00072,ARS-01-0048564,Beacon International,Not captured,Not captured,Not captured,,,,Hindle,Holly,,10/03/2010,female,Not captured,Not captured,Not captured,Not captured,Not captured,Not captured,Not captured,Not captured,Not captured,Not captured,Not captured,Not captured,Not captured,,,Not captured,Not captured,Not captured,Not captured,1128 Gambelli Dr,,Yorktown Heights,New York,10598,,,Not captured,Not captured,veronikahindle@gmail.com,Not captured,701931906,,Not captured,Not captured,Not captured,Not captured,Not captured,Not captured,
Not captured,Not captured,03/23/2019,Not captured,Not captured,863949,020,00072,ARS-02-0048560,Beacon America,Not captured,Not captured,Not captured,Passport(HG793748),,,Pelton,Leslie,j,11/26/1977,female,Not captured,Not captured,Not captured,Not captured,Not captured,Not captured,Not captured,Not captured,Not captured,Not captured,Not captured,Not captured,Not captured,,,Not captured,Not captured,Not captured,Not captured,15651 Brookridge Blvd,,Brooksville,FL,34613,,,Not captured,Not captured,lesliep777@gmail.com,Not captured,701931902,,Not captured,Not captured,Not captured,Not captured,Not captured,Not captured,
Not captured,Not captured,03/22/2019,Not captured,Not captured,863949,020,00072,ARS-01-0048553,Beacon International,Not captured,Not captured,Not captured,,,,Zapata Bravo,Amy Romina,,12/17/2012,female,Not captured,Not captured,Not captured,Not captured,Not captured,Not captured,Not captured,Not captured,Not captured,Not captured,Not captured,Not captured,Not captured,,,Not captured,Not captured,Not captured,Not captured,7500 kirby dr,,Houston,,77030,,,Not captured,Not captured,katia.bravo.jaimes@gmail.com,Not captured,701931864,,Not captured,Not captured,Not captured,Not captured,Not captured,Not captured,
Not captured,Not captured,03/22/2019,Not captured,Not captured,863949,020,00072,ARS-01-0048552,Beacon International,Not captured,Not captured,Not captured,,,,Bravo Jaimes,Katia Marisa,,07/25/1988,female,Not captured,Not captured,Not captured,Not captured,Not captured,Not captured,Not captured,Not captured,Not captured,Not captured,Not captured,Not captured,Not captured,,,Not captured,Not captured,Not captured,Not captured,7500 kirby dr,,Houston,,77030,,,Not captured,Not captured,katia.bravo.jaimes@gmail.com,Not captured,701931863,,Not captured,Not captured,Not captured,Not captured,Not captured,Not captured,
Not captured,Not captured,03/22/2019,Not captured,Not captured,863949,020,00072,OVI-28-0048551,OverseasCare Visitors Insurance Plan,Not captured,Not captured,Not captured,Passport(G2167978),,,D,Suhasini,Shah,02/04/1940,female,Not captured,Not captured,Not captured,Not captured,Not captured,Not captured,Not captured,Not captured,Not captured,Not captured,Not captured,Not captured,Not captured,Sanjay Shah,son,Not captured,Not captured,Not captured,Not captured,8906 Kilrenny Drive,,Spring,Texas,77379,281-514-3010,,Not captured,Not captured,sanjay.shah@hpe.com,Not captured,701931862,,Not captured,Not captured,Not captured,Not captured,Not captured,Not captured,
Not captured,Not captured,03/22/2019,Not captured,Not captured,863949,020,00072,ARS-01-0048549,Beacon International,Not captured,Not captured,Not captured,,,,MARU,ANYA,,11/08/2010,female,Not captured,Not captured,Not captured,Not captured,Not captured,Not captured,Not captured,Not captured,Not captured,Not captured,Not captured,Not captured,Not captured,,,Not captured,Not captured,Not captured,Not captured,1269 PEARWOOD CT,,MOUNT PLEASANT,South Carolina,29466,,,Not captured,Not captured,RAJATMARU@YAHOO.CO.IN,Not captured,701931859,,Not captured,Not captured,Not captured,Not captured,Not captured,Not captured,
Not captured,Not captured,03/22/2019,Not captured,Not captured,863949,020,00072,ARS-01-0048548,Beacon International,Not captured,Not captured,Not captured,,,,JAIN,MADHVEE,,10/28/1983,female,Not captured,Not captured,Not captured,Not captured,Not captured,Not captured,Not captured,Not captured,Not captured,Not captured,Not captured,Not captured,Not captured,,,Not captured,Not captured,Not captured,Not captured,1269 PEARWOOD CT,,MOUNT PLEASANT,South Carolina,29466,,,Not captured,Not captured,RAJATMARU@YAHOO.CO.IN,Not captured,701931858,,Not captured,Not captured,Not captured,Not captured,Not captured,Not captured,
Not captured,Not captured,03/22/2019,Not captured,Not captured,863949,020,00072,ARS-01-0048547,Beacon International,Not captured,Not captured,Not captured,,,,MARU,RAJAT,,10/07/1981,male,Not captured,Not captured,Not captured,Not captured,Not captured,Not captured,Not captured,Not captured,Not captured,Not captured,Not captured,Not captured,Not captured,,,Not captured,Not captured,Not captured,Not captured,1269 PEARWOOD CT,,MOUNT PLEASANT,South Carolina,29466,,,Not captured,Not captured,RAJATMARU@YAHOO.CO.IN,Not captured,701931857,,Not captured,Not captured,Not captured,Not captured,Not captured,Not captured,
Not captured,Not captured,03/22/2019,Not captured,Not captured,863949,020,00072,ARS-01-0048546,Beacon International,Not captured,Not captured,Not captured,,,,Pezo Salazar,Alonso,D,01/08/1985,male,Not captured,Not captured,Not captured,Not captured,Not captured,Not captured,Not captured,Not captured,Not captured,Not captured,Not captured,Not captured,Not captured,,,Not captured,Not captured,Not captured,Not captured,5039 Hamilton Wolfe Rd,,San Antonio,Texas,78229,,,Not captured,Not captured,alonso.pezo@gmail.com,Not captured,701931856,,Not captured,Not captured,Not captured,Not captured,Not captured,Not captured,
Not captured,Not captured,03/22/2019,Not captured,Not captured,863949,020,00072,ARS-01-0048545,Beacon International,Not captured,Not captured,Not captured,,,,Reiss,Katja,S,11/25/1967,female,Not captured,Not captured,Not captured,Not captured,Not captured,Not captured,Not captured,Not captured,Not captured,Not captured,Not captured,Not captured,Not captured,,,Not captured,Not captured,Not captured,Not captured,206 Sandler Drive,,Lafayette,Colorado,80026,,,Not captured,Not captured,reisskatja@aol.com,Not captured,701931855,,Not captured,Not captured,Not captured,Not captured,Not captured,Not captured,
Not captured,Not captured,03/21/2019,Not captured,Not captured,863949,020,00072,ARS-02-0048543,Beacon America,Not captured,Not captured,Not captured,,,,Beery,David,F,05/26/1958,male,Not captured,Not captured,Not captured,Not captured,Not captured,Not captured,Not captured,Not captured,Not captured,Not captured,Not captured,Not captured,Not captured,,,Not captured,Not captured,Not captured,Not captured,11266 Marine View Dr. SW,,Seattle,Washington,98146,,,Not captured,Not captured,DFBeery@comcast.net,Not captured,701931853,,Not captured,Not captured,Not captured,Not captured,Not captured,Not captured,
Not captured,Not captured,03/21/2019,Not captured,Not captured,863949,020,00072,ARS-01-0048540,Beacon International,Not captured,Not captured,Not captured,,,,Broadley,Debbie,J,02/05/1960,female,Not captured,Not captured,Not captured,Not captured,Not captured,Not captured,Not captured,Not captured,Not captured,Not captured,Not captured,Not captured,Not captured,,,Not captured,Not captured,Not captured,Not captured,1090 Cape Jellison Road,,Stockton Springs,Maine,04981,,,Not captured,Not captured,dibdebbs@gmail.com,Not captured,701931850,,Not captured,Not captured,Not captured,Not captured,Not captured,Not captured,
Not captured,Not captured,03/21/2019,Not captured,Not captured,863949,020,00072,ARS-01-0048536,Beacon International,Not captured,Not captured,Not captured,,,,De la Cruz Lemus,Marisol,,10/02/1982,female,Not captured,Not captured,Not captured,Not captured,Not captured,Not captured,Not captured,Not captured,Not captured,Not captured,Not captured,Not captured,Not captured,,,Not captured,Not captured,Not captured,Not captured,San Joaqu&iacute;n de Flores,,Heredia,,40802,,,Not captured,Not captured,davidbolanos506@gmail.com,Not captured,701931837,,Not captured,Not captured,Not captured,Not captured,Not captured,Not captured,
Not captured,Not captured,03/21/2019,Not captured,Not captured,863949,020,00072,ARS-01-0048535,Beacon International,Not captured,Not captured,Not captured,,,,Bolanos Quesda,David,,10/02/1988,male,Not captured,Not captured,Not captured,Not captured,Not captured,Not captured,Not captured,Not captured,Not captured,Not captured,Not captured,Not captured,Not captured,,,Not captured,Not captured,Not captured,Not captured,San Joaqu&iacute;n de Flores,,Heredia,,40802,,,Not captured,Not captured,davidbolanos506@gmail.com,Not captured,701931836,,Not captured,Not captured,Not captured,Not captured,Not captured,Not captured,
Not captured,Not captured,03/21/2019,Not captured,Not captured,863949,020,00072,ARS-01-0048533,Beacon International,Not captured,Not captured,Not captured,,,,Lo,Byron,T,04/04/2017,male,Not captured,Not captured,Not captured,Not captured,Not captured,Not captured,Not captured,Not captured,Not captured,Not captured,Not captured,Not captured,Not captured,,,Not captured,Not captured,Not captured,Not captured,13 LEONARD ST,,HUNTINGTON STATION,New York,11746,,,Not captured,Not captured,gfl207@gmail.com,Not captured,701931792,,Not captured,Not captured,Not captured,Not captured,Not captured,Not captured,
Not captured,Not captured,03/21/2019,Not captured,Not captured,863949,020,00072,ARS-01-0048532,Beacon International,Not captured,Not captured,Not captured,,,,Chan,Mei Lin,,10/04/1980,female,Not captured,Not captured,Not captured,Not captured,Not captured,Not captured,Not captured,Not captured,Not captured,Not captured,Not captured,Not captured,Not captured,,,Not captured,Not captured,Not captured,Not captured,13 LEONARD ST,,HUNTINGTON STATION,New York,11746,,,Not captured,Not captured,gfl207@gmail.com,Not captured,701931791,,Not captured,Not captured,Not captured,Not captured,Not captured,Not captured,
Not captured,Not captured,03/21/2019,Not captured,Not captured,863949,020,00072,ARS-01-0048531,Beacon International,Not captured,Not captured,Not captured,,,,Lo,Gar Fai Philip,,06/21/1980,male,Not captured,Not captured,Not captured,Not captured,Not captured,Not captured,Not captured,Not captured,Not captured,Not captured,Not captured,Not captured,Not captured,,,Not captured,Not captured,Not captured,Not captured,13 LEONARD ST,,HUNTINGTON STATION,New York,11746,,,Not captured,Not captured,gfl207@gmail.com,Not captured,701931790,,Not captured,Not captured,Not captured,Not captured,Not captured,Not captured,
Not captured,Not captured,03/21/2019,Not captured,Not captured,863949,020,00072,ARS-02-0048530,Beacon America,Not captured,Not captured,Not captured,Passport(136479660),,,MACARENO,HECTOR,,03/30/1985,male,Not captured,Not captured,Not captured,Not captured,Not captured,Not captured,Not captured,Not captured,Not captured,Not captured,Not captured,Not captured,Not captured,,,Not captured,Not captured,Not captured,Not captured,CALLE SUCRE CON TAMANACO,,SANTA TERESA DEL TUY,Miranda,1215,04124445455,,Not captured,Not captured,naviersalas@gmail.com,Not captured,701931789,,Not captured,Not captured,Not captured,Not captured,Not captured,Not captured,
Not captured,Not captured,03/21/2019,Not captured,Not captured,863949,020,00072,ARS-02-0048529,Beacon America,Not captured,Not captured,Not captured,Passport(078344394),,,PADRON,PATRICIA,,04/26/1978,female,Not captured,Not captured,Not captured,Not captured,Not captured,Not captured,Not captured,Not captured,Not captured,Not captured,Not captured,Not captured,Not captured,,,Not captured,Not captured,Not captured,Not captured,CALLE SUCRE CON TAMANACO,,SANTA TERESA DEL TUY,Miranda,1215,04124445455,,Not captured,Not captured,naviersalas@gmail.com,Not captured,701931788,,Not captured,Not captured,Not captured,Not captured,Not captured,Not captured,
Not captured,Not captured,03/21/2019,Not captured,Not captured,863949,020,00072,ARS-01-0048528,Beacon International,Not captured,Not captured,Not captured,,,,Clarke,Heather,,09/13/1974,female,Not captured,Not captured,Not captured,Not captured,Not captured,Not captured,Not captured,Not captured,Not captured,Not captured,Not captured,Not captured,Not captured,,,Not captured,Not captured,Not captured,Not captured,2125 52nd ave sw,,Seattle,Washington,98116,,,Not captured,Not captured,heatherclarkie@gmail.com,Not captured,701931787,,Not captured,Not captured,Not captured,Not captured,Not captured,Not captured,
Not captured,Not captured,03/21/2019,Not captured,Not captured,863949,020,00072,ARS-01-0048527,Beacon International,Not captured,Not captured,Not captured,,,,Elharrar,Dan,,07/10/1980,male,Not captured,Not captured,Not captured,Not captured,Not captured,Not captured,Not captured,Not captured,Not captured,Not captured,Not captured,Not captured,Not captured,,,Not captured,Not captured,Not captured,Not captured,142 7th ave apt 2,,Brooklyn,New York,11215,,,Not captured,Not captured,doonch@gmail.com,Not captured,701931786,,Not captured,Not captured,Not captured,Not captured,Not captured,Not captured,
Not captured,Not captured,03/21/2019,Not captured,Not captured,863949,020,00072,ARS-01-0048526,Beacon International,Not captured,Not captured,Not captured,,,,Tipping,Rachael,e,07/31/1986,female,Not captured,Not captured,Not captured,Not captured,Not captured,Not captured,Not captured,Not captured,Not captured,Not captured,Not captured,Not captured,Not captured,,,Not captured,Not captured,Not captured,Not captured,92 Ragin Rd,,roscoe,New York,12776,,,Not captured,Not captured,rachael.tipping@gmail.com,Not captured,701931785,,Not captured,Not captured,Not captured,Not captured,Not captured,Not captured,
Not captured,Not captured,03/21/2019,Not captured,Not captured,863949,020,00072,ARS-02-0048524,Beacon America,Not captured,Not captured,Not captured,,,,Overas,Nathaniel,,12/25/2008,male,Not captured,Not captured,Not captured,Not captured,Not captured,Not captured,Not captured,Not captured,Not captured,Not captured,Not captured,Not captured,Not captured,Yasjmine Overas,mother,Not captured,Not captured,Not captured,Not captured,410 SE 11TH Terrace,,Dania Beach,,33004,7542178045,,Not captured,Not captured,yazoveras@gmail.com,Not captured,701931783,,Not captured,Not captured,Not captured,Not captured,Not captured,Not captured,
Not captured,Not captured,03/21/2019,Not captured,Not captured,863949,020,00072,ARS-02-0048523,Beacon America,Not captured,Not captured,Not captured,Passport(32765345),,,Overas,Yasjmine,,02/12/1976,female,Not captured,Not captured,Not captured,Not captured,Not captured,Not captured,Not captured,Not captured,Not captured,Not captured,Not captured,Not captured,Not captured,Yasjmine Overas,mother,Not captured,Not captured,Not captured,Not captured,410 SE 11TH Terrace,,Dania Beach,,33004,7542178045,,Not captured,Not captured,yazoveras@gmail.com,Not captured,701931782,,Not captured,Not captured,Not captured,Not captured,Not captured,Not captured,
Not captured,Not captured,03/21/2019,Not captured,Not captured,863949,020,00072,ARS-02-0048519,Beacon America,Not captured,Not captured,Not captured,Passport(na),,,Poblador Parra,Wilmer Alexander,,07/30/1991,male,Not captured,Not captured,Not captured,Not captured,Not captured,Not captured,Not captured,Not captured,Not captured,Not captured,Not captured,Not captured,Not captured,estate,na,Not captured,Not captured,Not captured,Not captured,National Center for State Courts,,Bogota,Distrito Capltal de Santa Fe de Bogot&atilde;,na,5714898640 115,,Not captured,Not captured,amontoya@ncsc.co,Not captured,701931766,,Not captured,Not captured,Not captured,Not captured,Not captured,Not captured,
Not captured,Not captured,03/21/2019,Not captured,Not captured,863949,020,00072,ARS-02-0048518,Beacon America,Not captured,Not captured,Not captured,Passport(na),,,Hernandez Jimenez,Pedro Nel,,10/29/1983,male,Not captured,Not captured,Not captured,Not captured,Not captured,Not captured,Not captured,Not captured,Not captured,Not captured,Not captured,Not captured,Not captured,estate,na,Not captured,Not captured,Not captured,Not captured,National Center for State Courts,,Bogota,Distrito Capltal de Santa Fe de Bogot&atilde;,na,5714898640 115,,Not captured,Not captured,amontoya@ncsc.co,Not captured,701931765,,Not captured,Not captured,Not captured,Not captured,Not captured,Not captured,
Not captured,Not captured,03/21/2019,Not captured,Not captured,863949,020,00072,ARS-02-0048517,Beacon America,Not captured,Not captured,Not captured,Passport(na),,,Castrillon Giraldo,Oscar Eduardo,,05/06/1985,male,Not captured,Not captured,Not captured,Not captured,Not captured,Not captured,Not captured,Not captured,Not captured,Not captured,Not captured,Not captured,Not captured,estate,na,Not captured,Not captured,Not captured,Not captured,National Center for State Courts,,Bogota,Distrito Capltal de Santa Fe de Bogot&atilde;,na,5714898640 115,,Not captured,Not captured,amontoya@ncsc.co,Not captured,701931764,,Not captured,Not captured,Not captured,Not captured,Not captured,Not captured,