EE Transaction Type,Dependent Transaction Type,Effective Date,EE Signature,EE Signature Date,Control,Suffix,Account,Plan Number,Plan Name,Claim Office,Network ID Number,Customer Code,EE SSN,Dependent SSN,Dependent Relationship,Last Name,First Name,Middle Initial,DOB,Gender,Ethnicity,PCP/PCD,PCP/PCD Current Patient,Provider Cap Office Number,COB,Dep Student Indicator,Dep OOA Indicator,EE Prior Coverage Indicator,EE Late Entrant,EE Language Indicator,Hire Date,Earnings,Earnings Frequency,Beneficiary (Last Name First Name MI),Beneficiary Relationship,Continuation of Coverage Expiration Date,Continuation of Coverage Event Date,Continuation of Coverage Length of Coverage,Work Location Zip Code,Street Address Line 1,Street Address Line 2,City,State,Zip Code,Home Phone Number,Work Phone Number,Accept Code,Evidence Code,EE Email Address,Communication Disability Code,EE Alternate ID,Dep Alternate ID,Old Control,Old Suffix,Old Account,New Control,New Suffix,New Account,
Not captured,Not captured,02/28/2019,Not captured,Not captured,863949,020,00072,ARS-01-0048085,Beacon International,Not captured,Not captured,Not captured,,,,Urrutia,Valerie,,03/19/1990,female,Not captured,Not captured,Not captured,Not captured,Not captured,Not captured,Not captured,Not captured,Not captured,Not captured,Not captured,Not captured,Not captured,,,Not captured,Not captured,Not captured,Not captured,2400 E 2nd St #113,,Long Beach,California,90803,,,Not captured,Not captured,sntran84@yahoo.com,Not captured,701930347,,Not captured,Not captured,Not captured,Not captured,Not captured,Not captured,
Not captured,Not captured,02/28/2019,Not captured,Not captured,863949,020,00072,ARS-01-0048084,Beacon International,Not captured,Not captured,Not captured,,,,Tran,Sandy,,05/16/1984,female,Not captured,Not captured,Not captured,Not captured,Not captured,Not captured,Not captured,Not captured,Not captured,Not captured,Not captured,Not captured,Not captured,,,Not captured,Not captured,Not captured,Not captured,2400 E 2nd St #113,,Long Beach,California,90803,,,Not captured,Not captured,sntran84@yahoo.com,Not captured,701930346,,Not captured,Not captured,Not captured,Not captured,Not captured,Not captured,
Not captured,Not captured,02/28/2019,Not captured,Not captured,863949,020,00072,ARS-02-0048070,Beacon America,Not captured,Not captured,Not captured,,,,Bornstein,Yaakov,,05/08/2010,male,Not captured,Not captured,Not captured,Not captured,Not captured,Not captured,Not captured,Not captured,Not captured,Not captured,Not captured,Not captured,Not captured,,,Not captured,Not captured,Not captured,Not captured,218 Coles Way,,Lakewood,New Jersey,08701,732-833-3778,,Not captured,Not captured,aybornstein@gmail.com,Not captured,701930326,,Not captured,Not captured,Not captured,Not captured,Not captured,Not captured,
Not captured,Not captured,02/28/2019,Not captured,Not captured,863949,020,00072,ARS-02-0048069,Beacon America,Not captured,Not captured,Not captured,,,,Bornstein,Nachama,,08/02/2017,female,Not captured,Not captured,Not captured,Not captured,Not captured,Not captured,Not captured,Not captured,Not captured,Not captured,Not captured,Not captured,Not captured,,,Not captured,Not captured,Not captured,Not captured,218 Coles Way,,Lakewood,New Jersey,08701,732-833-3778,,Not captured,Not captured,aybornstein@gmail.com,Not captured,701930325,,Not captured,Not captured,Not captured,Not captured,Not captured,Not captured,
Not captured,Not captured,02/28/2019,Not captured,Not captured,863949,020,00072,ARS-02-0048068,Beacon America,Not captured,Not captured,Not captured,,,,Bornstein,Mordechai,,07/06/2015,male,Not captured,Not captured,Not captured,Not captured,Not captured,Not captured,Not captured,Not captured,Not captured,Not captured,Not captured,Not captured,Not captured,,,Not captured,Not captured,Not captured,Not captured,218 Coles Way,,Lakewood,New Jersey,08701,732-833-3778,,Not captured,Not captured,aybornstein@gmail.com,Not captured,701930324,,Not captured,Not captured,Not captured,Not captured,Not captured,Not captured,
Not captured,Not captured,02/28/2019,Not captured,Not captured,863949,020,00072,ARS-02-0048067,Beacon America,Not captured,Not captured,Not captured,,,,Bornstein,Naftali,,08/06/2013,male,Not captured,Not captured,Not captured,Not captured,Not captured,Not captured,Not captured,Not captured,Not captured,Not captured,Not captured,Not captured,Not captured,,,Not captured,Not captured,Not captured,Not captured,218 Coles Way,,Lakewood,New Jersey,08701,732-833-3778,,Not captured,Not captured,aybornstein@gmail.com,Not captured,701930323,,Not captured,Not captured,Not captured,Not captured,Not captured,Not captured,
Not captured,Not captured,02/28/2019,Not captured,Not captured,863949,020,00072,ARS-02-0048066,Beacon America,Not captured,Not captured,Not captured,,,,Bornstein,Hinda,,09/19/2011,female,Not captured,Not captured,Not captured,Not captured,Not captured,Not captured,Not captured,Not captured,Not captured,Not captured,Not captured,Not captured,Not captured,,,Not captured,Not captured,Not captured,Not captured,218 Coles Way,,Lakewood,New Jersey,08701,732-833-3778,,Not captured,Not captured,aybornstein@gmail.com,Not captured,701930322,,Not captured,Not captured,Not captured,Not captured,Not captured,Not captured,
Not captured,Not captured,02/28/2019,Not captured,Not captured,863949,020,00072,ARS-02-0048065,Beacon America,Not captured,Not captured,Not captured,,,,Bornstein,Laya,,02/02/1989,female,Not captured,Not captured,Not captured,Not captured,Not captured,Not captured,Not captured,Not captured,Not captured,Not captured,Not captured,Not captured,Not captured,,,Not captured,Not captured,Not captured,Not captured,218 Coles Way,,Lakewood,New Jersey,08701,732-833-3778,,Not captured,Not captured,aybornstein@gmail.com,Not captured,701930321,,Not captured,Not captured,Not captured,Not captured,Not captured,Not captured,
Not captured,Not captured,02/28/2019,Not captured,Not captured,863949,020,00072,ARS-02-0048064,Beacon America,Not captured,Not captured,Not captured,,,,Bornstein,Avrohom,,12/30/1985,male,Not captured,Not captured,Not captured,Not captured,Not captured,Not captured,Not captured,Not captured,Not captured,Not captured,Not captured,Not captured,Not captured,,,Not captured,Not captured,Not captured,Not captured,218 Coles Way,,Lakewood,New Jersey,08701,732-833-3778,,Not captured,Not captured,aybornstein@gmail.com,Not captured,701930320,,Not captured,Not captured,Not captured,Not captured,Not captured,Not captured,
Not captured,Not captured,02/28/2019,Not captured,Not captured,863949,020,00072,ARS-01-0048039,Beacon International,Not captured,Not captured,Not captured,,,,cappelletti,mary,,10/17/1996,female,Not captured,Not captured,Not captured,Not captured,Not captured,Not captured,Not captured,Not captured,Not captured,Not captured,Not captured,Not captured,Not captured,,,Not captured,Not captured,Not captured,Not captured,6594 allegan,,saugatuck,Michigan,49453,,,Not captured,Not captured,anncappelletti@hotmail.com,Not captured,701930228,,Not captured,Not captured,Not captured,Not captured,Not captured,Not captured,
Not captured,Not captured,02/28/2019,Not captured,Not captured,863949,020,00072,OVI-28-0048037,OverseasCare Visitors Insurance Plan,Not captured,Not captured,Not captured,Passport(K1824663),,,Ramachandran,Rajeswari,,10/10/1943,female,Not captured,Not captured,Not captured,Not captured,Not captured,Not captured,Not captured,Not captured,Not captured,Not captured,Not captured,Not captured,Not captured,Somasundaram Ramachandran,Son,Not captured,Not captured,Not captured,Not captured,22 Newman Road,,Kendall Park,New Jersey,08824,3474243663,3474243663,Not captured,Not captured,upendar@gmail.com,Not captured,701930226,,Not captured,Not captured,Not captured,Not captured,Not captured,Not captured,
Not captured,Not captured,02/28/2019,Not captured,Not captured,863949,020,00072,ARS-02-0048036,Beacon America,Not captured,Not captured,Not captured,,,,Hope Simpson,David,,06/04/1965,male,Not captured,Not captured,Not captured,Not captured,Not captured,Not captured,Not captured,Not captured,Not captured,Not captured,Not captured,Not captured,Not captured,,,Not captured,Not captured,Not captured,Not captured,23008 14TH PL W,,BOTHELL,Washington,98021,,,Not captured,Not captured,dhsathome@gmail.com,Not captured,701930225,,Not captured,Not captured,Not captured,Not captured,Not captured,Not captured,
Not captured,Not captured,02/28/2019,Not captured,Not captured,863949,020,00072,ARS-02-0048035,Beacon America,Not captured,Not captured,Not captured,Passport(055943668),,,LOPEZ TARABAY,ALFONSO,,03/31/1965,male,Not captured,Not captured,Not captured,Not captured,Not captured,Not captured,Not captured,Not captured,Not captured,Not captured,Not captured,Not captured,Not captured,CRISEL BAUTISTA,SPOUSE,Not captured,Not captured,Not captured,Not captured,9320 SW 171ST COURT,,MIAMI,FLORIDA,33196,+7868328519,,Not captured,Not captured,alopez@cboxgroup.com,Not captured,701930224,,Not captured,Not captured,Not captured,Not captured,Not captured,Not captured,
Not captured,Not captured,02/28/2019,Not captured,Not captured,863949,020,00072,ARS-01-0048034,Beacon International,Not captured,Not captured,Not captured,,,,Duong,Bang,,03/12/1986,male,Not captured,Not captured,Not captured,Not captured,Not captured,Not captured,Not captured,Not captured,Not captured,Not captured,Not captured,Not captured,Not captured,,,Not captured,Not captured,Not captured,Not captured,7519 JACOBS FORK LN,,CHARLOTTE,North Carolina,28273,,,Not captured,Not captured,bangd41@yahoo.com,Not captured,701930223,,Not captured,Not captured,Not captured,Not captured,Not captured,Not captured,
Not captured,Not captured,02/27/2019,Not captured,Not captured,863949,020,00072,ARS-01-0048030,Beacon International,Not captured,Not captured,Not captured,,,,Allen,Daniel,A,11/15/1981,male,Not captured,Not captured,Not captured,Not captured,Not captured,Not captured,Not captured,Not captured,Not captured,Not captured,Not captured,Not captured,Not captured,,,Not captured,Not captured,Not captured,Not captured,705 Twin Holly Ln,,Silver Spring,Maryland,20910,,,Not captured,Not captured,QA_2@hotmail.com,Not captured,701930218,,Not captured,Not captured,Not captured,Not captured,Not captured,Not captured,
Not captured,Not captured,02/27/2019,Not captured,Not captured,863949,020,00072,ARS-02-0048028,Beacon America,Not captured,Not captured,Not captured,,,,Chaves Lopes,Rafael,,04/03/1982,male,Not captured,Not captured,Not captured,Not captured,Not captured,Not captured,Not captured,Not captured,Not captured,Not captured,Not captured,Not captured,Not captured,,,Not captured,Not captured,Not captured,Not captured,47 Quai de Juillet,,Caen,,14000,,,Not captured,Not captured,rafa@bizu.vc,Not captured,701930216,,Not captured,Not captured,Not captured,Not captured,Not captured,Not captured,
Not captured,Not captured,02/27/2019,Not captured,Not captured,863949,020,00072,ARS-03-0047947,Essential America,Not captured,Not captured,Not captured,Passport(468945748),,,Jacobson,Anna,Ruth,07/09/1992,female,Not captured,Not captured,Not captured,Not captured,Not captured,Not captured,Not captured,Not captured,Not captured,Not captured,Not captured,Not captured,Not captured,,,Not captured,Not captured,Not captured,Not captured,Calle 30 y Flavio Reyes,,Manta,Manab&iacute;,,+593995681662,,Not captured,Not captured,ajacobson@incalink.org,Not captured,701930007,,Not captured,Not captured,Not captured,Not captured,Not captured,Not captured,
Not captured,Not captured,02/27/2019,Not captured,Not captured,863949,020,00072,ARS-01-0048027,Beacon International,Not captured,Not captured,Not captured,,,,McCaleb,David,,06/07/1984,male,Not captured,Not captured,Not captured,Not captured,Not captured,Not captured,Not captured,Not captured,Not captured,Not captured,Not captured,Not captured,Not captured,,,Not captured,Not captured,Not captured,Not captured,1138B 15th Ave,,Seatt;e,Washington,98122,,,Not captured,Not captured,kelxiaj@gmail.com,Not captured,701930215,,Not captured,Not captured,Not captured,Not captured,Not captured,Not captured,
Not captured,Not captured,02/27/2019,Not captured,Not captured,863949,020,00072,ARS-01-0048026,Beacon International,Not captured,Not captured,Not captured,,,,Xia,Li Qing,,01/14/1981,male,Not captured,Not captured,Not captured,Not captured,Not captured,Not captured,Not captured,Not captured,Not captured,Not captured,Not captured,Not captured,Not captured,,,Not captured,Not captured,Not captured,Not captured,1138B 15th Ave,,Seatt;e,Washington,98122,,,Not captured,Not captured,kelxiaj@gmail.com,Not captured,701930214,,Not captured,Not captured,Not captured,Not captured,Not captured,Not captured,
Not captured,Not captured,02/27/2019,Not captured,Not captured,863949,020,00072,ARS-37-0048023,Beacon Student Advantage,Not captured,Not captured,Not captured,Passport(ED4112067),,,HU,Jiale,,11/08/2004,male,Not captured,Not captured,Not captured,Not captured,Not captured,Not captured,Not captured,Not captured,Not captured,Not captured,Not captured,Not captured,Not captured,Jacob Huang,Agent,Not captured,Not captured,Not captured,Not captured,1012 Whitecroft Dr,,Raleigh,North Carolina,27603,8034044015,,Not captured,Not captured,xbhuang4@gmail.com,Not captured,701930210,,Not captured,Not captured,Not captured,Not captured,Not captured,Not captured,
Not captured,Not captured,02/27/2019,Not captured,Not captured,863949,020,00072,ARS-01-0048001,Beacon International,Not captured,Not captured,Not captured,,,,Mathis,Genevieve,,12/26/1988,female,Not captured,Not captured,Not captured,Not captured,Not captured,Not captured,Not captured,Not captured,Not captured,Not captured,Not captured,Not captured,Not captured,,,Not captured,Not captured,Not captured,Not captured,5674 avenue Gatineau,,Montreal,Quebec,H3T 1X7,,,Not captured,Not captured,gmathis@protonmail.com,Not captured,701930181,,Not captured,Not captured,Not captured,Not captured,Not captured,Not captured,
Not captured,Not captured,02/26/2019,Not captured,Not captured,863949,020,00072,ARS-01-0048000,Beacon International,Not captured,Not captured,Not captured,,,,Glover,Ian,,07/06/1984,male,Not captured,Not captured,Not captured,Not captured,Not captured,Not captured,Not captured,Not captured,Not captured,Not captured,Not captured,Not captured,Not captured,,,Not captured,Not captured,Not captured,Not captured,708 Willow Ave Apt 1D,,Hoboken,New Jersey,07030,,,Not captured,Not captured,ian.glover.uk.12@gmail.com,Not captured,701930180,,Not captured,Not captured,Not captured,Not captured,Not captured,Not captured,
Not captured,Not captured,02/28/2019,Not captured,Not captured,863949,020,00072,ARS-01-0047995,Beacon International,Not captured,Not captured,Not captured,Passport(K0410231),,,EMAHA,MANNA,DESTA,05/05/1977,female,Not captured,Not captured,Not captured,Not captured,Not captured,Not captured,Not captured,Not captured,Not captured,Not captured,Not captured,Not captured,Not captured,,,Not captured,Not captured,Not captured,Not captured,etsegay75@gmail.com,,ASMARA,Central (Maekel),2433,0712414145,0712414145,Not captured,Not captured,etsegay75@gmail.com,Not captured,701930155,,Not captured,Not captured,Not captured,Not captured,Not captured,Not captured,
Not captured,Not captured,02/28/2019,Not captured,Not captured,863949,020,00072,ARS-01-0047990,Beacon International,Not captured,Not captured,Not captured,Passport(K0347963),,,Wolday,Ghenet,Tesfaghabr,12/01/1973,female,Not captured,Not captured,Not captured,Not captured,Not captured,Not captured,Not captured,Not captured,Not captured,Not captured,Not captured,Not captured,Not captured,,,Not captured,Not captured,Not captured,Not captured,etsegay75@gmail.com,,ASMARA,Central (Maekel),2433,0712413145,0712413145,Not captured,Not captured,etsegay75@gmail.com,Not captured,701930149,,Not captured,Not captured,Not captured,Not captured,Not captured,Not captured,
Not captured,Not captured,02/26/2019,Not captured,Not captured,863949,020,00072,ARS-01-0047989,Beacon International,Not captured,Not captured,Not captured,,,,Koerner,Ronald,,12/23/1959,male,Not captured,Not captured,Not captured,Not captured,Not captured,Not captured,Not captured,Not captured,Not captured,Not captured,Not captured,Not captured,Not captured,,,Not captured,Not captured,Not captured,Not captured,10145 Cottoncreek Drive,,Littleton,Colorado,80130,,,Not captured,Not captured,artsmom@outlook.com,Not captured,701930148,,Not captured,Not captured,Not captured,Not captured,Not captured,Not captured,
Not captured,Not captured,02/26/2019,Not captured,Not captured,863949,020,00072,ARS-01-0047988,Beacon International,Not captured,Not captured,Not captured,,,,Koerner,Lucinda,,09/29/1960,female,Not captured,Not captured,Not captured,Not captured,Not captured,Not captured,Not captured,Not captured,Not captured,Not captured,Not captured,Not captured,Not captured,,,Not captured,Not captured,Not captured,Not captured,10145 Cottoncreek Drive,,Littleton,Colorado,80130,,,Not captured,Not captured,artsmom@outlook.com,Not captured,701930147,,Not captured,Not captured,Not captured,Not captured,Not captured,Not captured,
Not captured,Not captured,02/26/2019,Not captured,Not captured,863949,020,00072,ARS-01-0047986,Beacon International,Not captured,Not captured,Not captured,,,,Bojak,Lawrence,,05/06/1955,male,Not captured,Not captured,Not captured,Not captured,Not captured,Not captured,Not captured,Not captured,Not captured,Not captured,Not captured,Not captured,Not captured,,,Not captured,Not captured,Not captured,Not captured,535 Willowcreek Court,,Clarendon Hills,Illinois,60514,,,Not captured,Not captured,larrybojak@comcast.net,Not captured,701930130,,Not captured,Not captured,Not captured,Not captured,Not captured,Not captured,
Not captured,Not captured,02/26/2019,Not captured,Not captured,863949,020,00072,ARS-01-0047985,Beacon International,Not captured,Not captured,Not captured,,,,Wingerson,Mary,K,10/20/1995,female,Not captured,Not captured,Not captured,Not captured,Not captured,Not captured,Not captured,Not captured,Not captured,Not captured,Not captured,Not captured,Not captured,,,Not captured,Not captured,Not captured,Not captured,8917 SE 74th Place,,Mercer Island,Washington,98040-5769,,,Not captured,Not captured,marywingerson@gmail.com,Not captured,701930129,,Not captured,Not captured,Not captured,Not captured,Not captured,Not captured,
Not captured,Not captured,02/27/2019,Not captured,Not captured,863949,020,00072,ARS-01-0047984,Beacon International,Not captured,Not captured,Not captured,Passport(594337131),,,Deeter,Hannah,G,06/28/1997,female,Not captured,Not captured,Not captured,Not captured,Not captured,Not captured,Not captured,Not captured,Not captured,Not captured,Not captured,Not captured,Not captured,Ronald Deeter,Father,Not captured,Not captured,Not captured,Not captured,9244 E. OSR,,Hearne,Texas,77859,8179076764,,Not captured,Not captured,hannah.deeter97@gmail.com,Not captured,701930128,,Not captured,Not captured,Not captured,Not captured,Not captured,Not captured,
Not captured,Not captured,02/25/2019,Not captured,Not captured,863949,020,00072,ARS-04-0047882,Enhanced America,Not captured,Not captured,Not captured,Passport(550603514),,,THORNTON,HARLAND,WAYNE,10/26/1961,male,Not captured,Not captured,Not captured,Not captured,Not captured,Not captured,Not captured,Not captured,Not captured,Not captured,Not captured,Not captured,Not captured,,,Not captured,Not captured,Not captured,Not captured,PERLA MARINA BLUE FISH W3,,PUERTA PLATA,CABARETE,57000,2817095457,,Not captured,Not captured,wthornton1026@gmail.com,Not captured,701929817,,Not captured,Not captured,Not captured,Not captured,Not captured,Not captured,
Not captured,Not captured,02/20/2019,Not captured,Not captured,863949,020,00072,ARS-03-0047865,Essential International,Not captured,Not captured,Not captured,Passport(474157791),,,Bland ,Annie ,Gabrielle ,04/25/1990,female,Not captured,Not captured,Not captured,Not captured,Not captured,Not captured,Not captured,Not captured,Not captured,Not captured,Not captured,Not captured,Not captured,,,Not captured,Not captured,Not captured,Not captured,Reparto Monserrath,,Chinandega,,,7705726953,,Not captured,Not captured,annie@amigosforchrist.org,Not captured,701929668,,Not captured,Not captured,Not captured,Not captured,Not captured,Not captured,
Not captured,Not captured,02/20/2019,Not captured,Not captured,863949,020,00072,ARS-03-0047865,Essential International,Not captured,Not captured,Not captured,,Passport(545475483),Dependant,Corrales Bland ,Isabella ,Marie ,12/27/2015,female,Not captured,Not captured,Not captured,Not captured,Not captured,Not captured,Not captured,Not captured,Not captured,Not captured,Not captured,Not captured,Not captured,,,Not captured,Not captured,Not captured,Not captured,Reparto Monserrath,,Chinandega,,,7705726953,,Not captured,Not captured,annie@amigosforchrist.org,Not captured,,701929669,Not captured,Not captured,Not captured,Not captured,Not captured,Not captured,
Not captured,Not captured,02/20/2019,Not captured,Not captured,863949,020,00072,ARS-03-0047865,Essential International,Not captured,Not captured,Not captured,,Passport(642442780),Dependant,Corrales Bland ,Owen ,David ,08/21/2018,male,Not captured,Not captured,Not captured,Not captured,Not captured,Not captured,Not captured,Not captured,Not captured,Not captured,Not captured,Not captured,Not captured,,,Not captured,Not captured,Not captured,Not captured,Reparto Monserrath,,Chinandega,,,7705726953,,Not captured,Not captured,annie@amigosforchrist.org,Not captured,,701929670,Not captured,Not captured,Not captured,Not captured,Not captured,Not captured,
Not captured,Not captured,02/18/2019,Not captured,Not captured,863949,020,00072,ARS-04-0047784,Enhanced America,Not captured,Not captured,Not captured,Passport(RO986913),,,yong,brian,henry,04/19/1971,male,Not captured,Not captured,Not captured,Not captured,Not captured,Not captured,Not captured,Not captured,Not captured,Not captured,Not captured,Not captured,Not captured,,,Not captured,Not captured,Not captured,Not captured,239 Quamina Street,,Georgtown,Demerara-Mahaica,,5926565376,,Not captured,Not captured,bhy@mac.com,Not captured,701929421,,Not captured,Not captured,Not captured,Not captured,Not captured,Not captured,
Not captured,Not captured,02/22/2019,Not captured,Not captured,863949,020,00072,ARS-05-0047298,Clear America,Not captured,Not captured,Not captured,Passport(S5313915),,,Chiguluri,Hema,,10/14/1964,female,Not captured,Not captured,Not captured,Not captured,Not captured,Not captured,Not captured,Not captured,Not captured,Not captured,Not captured,Not captured,Not captured,,,Not captured,Not captured,Not captured,Not captured,191 B Palomino Trail,,Ridgeway,Colorado,81432,9703181147,,Not captured,Not captured,karla@visionnationals.org,Not captured,701928326,,Not captured,Not captured,Not captured,Not captured,Not captured,Not captured,
Not captured,Not captured,02/26/2019,Not captured,Not captured,863949,020,00072,ARS-02-0047977,Beacon America,Not captured,Not captured,Not captured,Passport(GJ588636),,,Samuel,Anna,C,05/12/1949,female,Not captured,Not captured,Not captured,Not captured,Not captured,Not captured,Not captured,Not captured,Not captured,Not captured,Not captured,Not captured,Not captured,Francis Samuel,Spouse,Not captured,Not captured,Not captured,Not captured,1-69 Chapman Ave,,Toronto,Ontario,M4B 1C6,4163153981,,Not captured,Not captured,anna.samuel2080@gmail.com,Not captured,701930066,,Not captured,Not captured,Not captured,Not captured,Not captured,Not captured,