EE Transaction Type,Dependent Transaction Type,Effective Date,EE Signature,EE Signature Date,Control,Suffix,Account,Plan Number,Plan Name,Claim Office,Network ID Number,Customer Code,EE SSN,Dependent SSN,Dependent Relationship,Last Name,First Name,Middle Initial,DOB,Gender,Ethnicity,PCP/PCD,PCP/PCD Current Patient,Provider Cap Office Number,COB,Dep Student Indicator,Dep OOA Indicator,EE Prior Coverage Indicator,EE Late Entrant,EE Language Indicator,Hire Date,Earnings,Earnings Frequency,Beneficiary (Last Name First Name MI),Beneficiary Relationship,Continuation of Coverage Expiration Date,Continuation of Coverage Event Date,Continuation of Coverage Length of Coverage,Work Location Zip Code,Street Address Line 1,Street Address Line 2,City,State,Zip Code,Home Phone Number,Work Phone Number,Accept Code,Evidence Code,EE Email Address,Communication Disability Code,EE Alternate ID,Dep Alternate ID,Old Control,Old Suffix,Old Account,New Control,New Suffix,New Account,
Not captured,Not captured,02/12/2019,Not captured,Not captured,863949,020,00072,ARS-01-0047697,Beacon International,Not captured,Not captured,Not captured,,,,Kennedy,Tiffany,A,08/02/1989,female,Not captured,Not captured,Not captured,Not captured,Not captured,Not captured,Not captured,Not captured,Not captured,Not captured,Not captured,Not captured,Not captured,,,Not captured,Not captured,Not captured,Not captured,18041 E. Santa Clara Ave.,,North Tustin,California,92705,,,Not captured,Not captured,tmbalthaser@gmail.com,Not captured,701929276,,Not captured,Not captured,Not captured,Not captured,Not captured,Not captured,
Not captured,Not captured,02/12/2019,Not captured,Not captured,863949,020,00072,ARS-01-0047696,Beacon International,Not captured,Not captured,Not captured,,,,Balthaser,Tyler,M,08/06/1989,male,Not captured,Not captured,Not captured,Not captured,Not captured,Not captured,Not captured,Not captured,Not captured,Not captured,Not captured,Not captured,Not captured,,,Not captured,Not captured,Not captured,Not captured,18041 E. Santa Clara Ave.,,North Tustin,California,92705,,,Not captured,Not captured,tmbalthaser@gmail.com,Not captured,701929275,,Not captured,Not captured,Not captured,Not captured,Not captured,Not captured,
Not captured,Not captured,02/12/2019,Not captured,Not captured,863949,020,00072,ARS-03-0047672,Essential America,Not captured,Not captured,Not captured,Passport(0000000),,,Swain,Ava,,01/26/2019,female,Not captured,Not captured,Not captured,Not captured,Not captured,Not captured,Not captured,Not captured,Not captured,Not captured,Not captured,Not captured,Not captured,,,Not captured,Not captured,Not captured,Not captured,1712 Weston Road,,Creswell,North Carolina,27928,2523941078,,Not captured,Not captured,,Not captured,701929229,,Not captured,Not captured,Not captured,Not captured,Not captured,Not captured,
Not captured,Not captured,02/12/2019,Not captured,Not captured,863949,020,00072,ARS-03-0047691,Essential America,Not captured,Not captured,Not captured,Driving License(872286),,,Thavenot,Raquel,,05/02/1989,female,Not captured,Not captured,Not captured,Not captured,Not captured,Not captured,Not captured,Not captured,Not captured,Not captured,Not captured,Not captured,Not captured,,,Not captured,Not captured,Not captured,Not captured,37 Ellerslie Park,,Maraval,Maraval,00000,6892400,,Not captured,Not captured,raquelathavenot@hotmail.com,Not captured,701929255,,Not captured,Not captured,Not captured,Not captured,Not captured,Not captured,
Not captured,Not captured,02/12/2019,Not captured,Not captured,863949,020,00072,ARS-03-0047691,Essential America,Not captured,Not captured,Not captured,,Passport(TB454835),Spouse,McQuilkin,Michael,,01/18/1989,male,Not captured,Not captured,Not captured,Not captured,Not captured,Not captured,Not captured,Not captured,Not captured,Not captured,Not captured,Not captured,Not captured,,,Not captured,Not captured,Not captured,Not captured,37 Ellerslie Park,,Maraval,Maraval,00000,6892400,,Not captured,Not captured,raquelathavenot@hotmail.com,Not captured,,701929256,Not captured,Not captured,Not captured,Not captured,Not captured,Not captured,
Not captured,Not captured,02/12/2019,Not captured,Not captured,863949,020,00072,ARS-03-0047691,Essential America,Not captured,Not captured,Not captured,,Passport(AB384988),Dependant,McQuilkin,Jaaden,,10/01/2017,male,Not captured,Not captured,Not captured,Not captured,Not captured,Not captured,Not captured,Not captured,Not captured,Not captured,Not captured,Not captured,Not captured,,,Not captured,Not captured,Not captured,Not captured,37 Ellerslie Park,,Maraval,Maraval,00000,6892400,,Not captured,Not captured,raquelathavenot@hotmail.com,Not captured,,701929257,Not captured,Not captured,Not captured,Not captured,Not captured,Not captured,
Not captured,Not captured,02/12/2019,Not captured,Not captured,863949,020,00072,ARS-02-0047695,Beacon America,Not captured,Not captured,Not captured,,,,Ahsan,Samina,S,09/22/1959,female,Not captured,Not captured,Not captured,Not captured,Not captured,Not captured,Not captured,Not captured,Not captured,Not captured,Not captured,Not captured,Not captured,,,Not captured,Not captured,Not captured,Not captured,430 8th Ave N,,Seattle,WA,98109,2067394321,,Not captured,Not captured,asifjaleel@gmail.com,Not captured,701929272,,Not captured,Not captured,Not captured,Not captured,Not captured,Not captured,
Not captured,Not captured,02/12/2019,Not captured,Not captured,863949,020,00072,ARS-02-0047686,Beacon America,Not captured,Not captured,Not captured,,,,Fontanari,Mauricio,R,06/18/2002,male,Not captured,Not captured,Not captured,Not captured,Not captured,Not captured,Not captured,Not captured,Not captured,Not captured,Not captured,Not captured,Not captured,,,Not captured,Not captured,Not captured,Not captured,Rua Cardoso de Almeida 440,,Campo Grande,,79041,,,Not captured,Not captured,lili.arroyave@gmail.com,Not captured,701929247,,Not captured,Not captured,Not captured,Not captured,Not captured,Not captured,
Not captured,Not captured,02/12/2019,Not captured,Not captured,863949,020,00072,ARS-02-0047685,Beacon America,Not captured,Not captured,Not captured,,,,Wen,Jinzhe,,01/29/2014,male,Not captured,Not captured,Not captured,Not captured,Not captured,Not captured,Not captured,Not captured,Not captured,Not captured,Not captured,Not captured,Not captured,,,Not captured,Not captured,Not captured,Not captured,1907 Holcombe Blvd. #309,,Houston,,77030,,,Not captured,Not captured,yjing0208@gmail.com,Not captured,701929246,,Not captured,Not captured,Not captured,Not captured,Not captured,Not captured,
Not captured,Not captured,02/11/2019,Not captured,Not captured,863949,020,00072,ARS-02-0047684,Beacon America,Not captured,Not captured,Not captured,,,,hevesi,bryan,p,05/13/1959,male,Not captured,Not captured,Not captured,Not captured,Not captured,Not captured,Not captured,Not captured,Not captured,Not captured,Not captured,Not captured,Not captured,,,Not captured,Not captured,Not captured,Not captured,8136 coventry rd. unit57,,niagara falls,Ontario,l2h2x6,,,Not captured,Not captured,bryanhevesi@hotmail.ca,Not captured,701929245,,Not captured,Not captured,Not captured,Not captured,Not captured,Not captured,
Not captured,Not captured,02/11/2019,Not captured,Not captured,863949,020,00072,ARS-01-0047680,Beacon International,Not captured,Not captured,Not captured,,,,Green,Deborah,,04/23/1977,female,Not captured,Not captured,Not captured,Not captured,Not captured,Not captured,Not captured,Not captured,Not captured,Not captured,Not captured,Not captured,Not captured,,,Not captured,Not captured,Not captured,Not captured,127 Highland Crescent,,Lakewood,New Jersey,08701,732-942-1518,,Not captured,Not captured,bg@ggrusa.com,Not captured,701929239,,Not captured,Not captured,Not captured,Not captured,Not captured,Not captured,
Not captured,Not captured,02/12/2019,Not captured,Not captured,863949,020,00072,ARS-01-0047679,Beacon International,Not captured,Not captured,Not captured,,,,Moore,Stephanie,,08/10/1955,female,Not captured,Not captured,Not captured,Not captured,Not captured,Not captured,Not captured,Not captured,Not captured,Not captured,Not captured,Not captured,Not captured,,,Not captured,Not captured,Not captured,Not captured,620 Fairfield Lane,,Louisville,Kentucky,80027,5414101795,,Not captured,Not captured,mcmoore620@comcast.net,Not captured,701929238,,Not captured,Not captured,Not captured,Not captured,Not captured,Not captured,
Not captured,Not captured,02/12/2019,Not captured,Not captured,863949,020,00072,ARS-01-0047678,Beacon International,Not captured,Not captured,Not captured,Passport(572969621),,,Moore,MIchael,,08/03/1953,male,Not captured,Not captured,Not captured,Not captured,Not captured,Not captured,Not captured,Not captured,Not captured,Not captured,Not captured,Not captured,Not captured,,,Not captured,Not captured,Not captured,Not captured,620 Fairfield Lane,,Louisville,Kentucky,80027,5414101795,,Not captured,Not captured,mcmoore620@comcast.net,Not captured,701929237,,Not captured,Not captured,Not captured,Not captured,Not captured,Not captured,
Not captured,Not captured,02/11/2019,Not captured,Not captured,863949,020,00072,ARS-01-0047674,Beacon International,Not captured,Not captured,Not captured,,,,Staff,Evan,I,07/29/1991,male,Not captured,Not captured,Not captured,Not captured,Not captured,Not captured,Not captured,Not captured,Not captured,Not captured,Not captured,Not captured,Not captured,,,Not captured,Not captured,Not captured,Not captured,60 Mulberry Street,,New York,New York,10013,,,Not captured,Not captured,evanstaff@gmail.com,Not captured,701929233,,Not captured,Not captured,Not captured,Not captured,Not captured,Not captured,
Not captured,Not captured,02/07/2019,Not captured,Not captured,863949,020,00072,ARS-03-0047563,Essential America,Not captured,Not captured,Not captured,Passport(794-42-1019),,,Walton,Andrew,,10/23/2018,male,Not captured,Not captured,Not captured,Not captured,Not captured,Not captured,Not captured,Not captured,Not captured,Not captured,Not captured,Not captured,Not captured,,,Not captured,Not captured,Not captured,Not captured,9935 N State Rd 59,,Milton,Wisconsin,53563,35861580608,,Not captured,Not captured,stephen@stephenandalisa.net,Not captured,701928916,,Not captured,Not captured,Not captured,Not captured,Not captured,Not captured,
Not captured,Not captured,02/11/2019,Not captured,Not captured,863949,020,00072,ARS-02-0047671,Beacon America,Not captured,Not captured,Not captured,,,,Malacrino,Antonino,,12/13/1989,male,Not captured,Not captured,Not captured,Not captured,Not captured,Not captured,Not captured,Not captured,Not captured,Not captured,Not captured,Not captured,Not captured,,,Not captured,Not captured,Not captured,Not captured,Contrada Sclano 46,,Cardeto,,89060,,,Not captured,Not captured,antonino.malacrino@gmail.com,Not captured,701929228,,Not captured,Not captured,Not captured,Not captured,Not captured,Not captured,
Not captured,Not captured,02/11/2019,Not captured,Not captured,863949,020,00072,ARS-01-0047668,Beacon International,Not captured,Not captured,Not captured,,,,Cleaver,Owen,,06/10/1985,male,Not captured,Not captured,Not captured,Not captured,Not captured,Not captured,Not captured,Not captured,Not captured,Not captured,Not captured,Not captured,Not captured,,,Not captured,Not captured,Not captured,Not captured,101 Monmouth Street,,Brookline,Massachusetts,02446,,,Not captured,Not captured,oacleaver@gmail.com,Not captured,701929225,,Not captured,Not captured,Not captured,Not captured,Not captured,Not captured,
Not captured,Not captured,02/11/2019,Not captured,Not captured,863949,020,00072,ARS-01-0047659,Beacon International,Not captured,Not captured,Not captured,,,,Stavrou,Loren,k,04/26/1994,male,Not captured,Not captured,Not captured,Not captured,Not captured,Not captured,Not captured,Not captured,Not captured,Not captured,Not captured,Not captured,Not captured,,,Not captured,Not captured,Not captured,Not captured,4207 E 9th st,,Long Beach,California,90804,5627874207,5625520755,Not captured,Not captured,s_stavrou@msn.com,Not captured,701929214,,Not captured,Not captured,Not captured,Not captured,Not captured,Not captured,
Not captured,Not captured,02/11/2019,Not captured,Not captured,863949,020,00072,ARS-01-0047658,Beacon International,Not captured,Not captured,Not captured,,,,Stavrou,Erlinda,i,05/09/1964,female,Not captured,Not captured,Not captured,Not captured,Not captured,Not captured,Not captured,Not captured,Not captured,Not captured,Not captured,Not captured,Not captured,,,Not captured,Not captured,Not captured,Not captured,4207 E 9th st,,Long Beach,California,90804,5627874207,5625520755,Not captured,Not captured,s_stavrou@msn.com,Not captured,701929213,,Not captured,Not captured,Not captured,Not captured,Not captured,Not captured,
Not captured,Not captured,02/11/2019,Not captured,Not captured,863949,020,00072,ARS-01-0047657,Beacon International,Not captured,Not captured,Not captured,Passport(523417882),,,Stavrou,steven,l,05/16/1964,male,Not captured,Not captured,Not captured,Not captured,Not captured,Not captured,Not captured,Not captured,Not captured,Not captured,Not captured,Not captured,Not captured,,,Not captured,Not captured,Not captured,Not captured,4207 E 9th st,,Long Beach,California,90804,5627874207,5625520755,Not captured,Not captured,s_stavrou@msn.com,Not captured,701929212,,Not captured,Not captured,Not captured,Not captured,Not captured,Not captured,
Not captured,Not captured,02/10/2019,Not captured,Not captured,863949,020,00072,ARS-01-0047653,Beacon International,Not captured,Not captured,Not captured,,,,Benus,Tamar,R,03/14/1992,female,Not captured,Not captured,Not captured,Not captured,Not captured,Not captured,Not captured,Not captured,Not captured,Not captured,Not captured,Not captured,Not captured,,,Not captured,Not captured,Not captured,Not captured,425 West 260th Street,,BRONX,New York,10471-1822,,,Not captured,Not captured,mbenus@aol.com,Not captured,701929208,,Not captured,Not captured,Not captured,Not captured,Not captured,Not captured,
Not captured,Not captured,02/10/2019,Not captured,Not captured,863949,020,00072,ARS-01-0047652,Beacon International,Not captured,Not captured,Not captured,,,,Fennimore,Raphael,D,02/09/1987,male,Not captured,Not captured,Not captured,Not captured,Not captured,Not captured,Not captured,Not captured,Not captured,Not captured,Not captured,Not captured,Not captured,,,Not captured,Not captured,Not captured,Not captured,5 Pomeroy Street,,Boston,Massachusetts,02134,,,Not captured,Not captured,raphael.fennimore@gmail.com,Not captured,701929207,,Not captured,Not captured,Not captured,Not captured,Not captured,Not captured,
Not captured,Not captured,02/10/2019,Not captured,Not captured,863949,020,00072,ARS-01-0047650,Beacon International,Not captured,Not captured,Not captured,Passport(727128300),,,KORNILOV ,SERGEY ,,10/12/1970,male,Not captured,Not captured,Not captured,Not captured,Not captured,Not captured,Not captured,Not captured,Not captured,Not captured,Not captured,Not captured,Not captured,Nina Ivanovna Kornilova ,Friend ,Not captured,Not captured,Not captured,Not captured,1st Volokolamskiy proezd ,,Moscow,Moskva,123060 ,+74956455919 ,,Not captured,Not captured,metsaimpex2012@gmail.com,Not captured,701929205,,Not captured,Not captured,Not captured,Not captured,Not captured,Not captured,
Not captured,Not captured,02/09/2019,Not captured,Not captured,863949,020,00072,ARS-02-0047649,Beacon America,Not captured,Not captured,Not captured,Passport(k105875),,,caneda,luis,a,08/19/1963,male,Not captured,Not captured,Not captured,Not captured,Not captured,Not captured,Not captured,Not captured,Not captured,Not captured,Not captured,Not captured,Not captured,maria caneda,wife,Not captured,Not captured,Not captured,Not captured,909 nw 5th ave,,tt lauderdale,,33311,9544634100,305984-3291,Not captured,Not captured,luis@hamofa.com,Not captured,701929204,,Not captured,Not captured,Not captured,Not captured,Not captured,Not captured,
Not captured,Not captured,02/09/2019,Not captured,Not captured,863949,020,00072,ARS-01-0047648,Beacon International,Not captured,Not captured,Not captured,,,,Matych,Christine,M,02/11/1997,female,Not captured,Not captured,Not captured,Not captured,Not captured,Not captured,Not captured,Not captured,Not captured,Not captured,Not captured,Not captured,Not captured,,,Not captured,Not captured,Not captured,Not captured,8704 Chadwick Drive,,Tampa,Florida,33635,,,Not captured,Not captured,cmatych14@gmail.com,Not captured,701929203,,Not captured,Not captured,Not captured,Not captured,Not captured,Not captured,
Not captured,Not captured,02/09/2019,Not captured,Not captured,863949,020,00072,ARS-02-0047647,Beacon America,Not captured,Not captured,Not captured,,,,Bekker Heusler,Yosi,,08/28/1982,male,Not captured,Not captured,Not captured,Not captured,Not captured,Not captured,Not captured,Not captured,Not captured,Not captured,Not captured,Not captured,Not captured,,,Not captured,Not captured,Not captured,Not captured,Rua Brig. Haroldo Veloso 341,,Sao Paulo,,04533-080,,,Not captured,Not captured,yosileonardo@gmail.com,Not captured,701929202,,Not captured,Not captured,Not captured,Not captured,Not captured,Not captured,
Not captured,Not captured,02/09/2019,Not captured,Not captured,863949,020,00072,ARS-01-0047644,Beacon International,Not captured,Not captured,Not captured,,,,Marin Mosquera,Luz,M,01/25/1991,female,Not captured,Not captured,Not captured,Not captured,Not captured,Not captured,Not captured,Not captured,Not captured,Not captured,Not captured,Not captured,Not captured,,,Not captured,Not captured,Not captured,Not captured,carrera 48a 106 26,,Medellin,,05001,,,Not captured,Not captured,luzmelidamm@hotmail.com,Not captured,701929198,,Not captured,Not captured,Not captured,Not captured,Not captured,Not captured,
Not captured,Not captured,02/09/2019,Not captured,Not captured,863949,020,00072,ARS-01-0047642,Beacon International,Not captured,Not captured,Not captured,,,,Cherry,Nathanael,A,02/17/1981,male,Not captured,Not captured,Not captured,Not captured,Not captured,Not captured,Not captured,Not captured,Not captured,Not captured,Not captured,Not captured,Not captured,,,Not captured,Not captured,Not captured,Not captured,15 Haley Dr.,,Hampton,,23661,,,Not captured,Not captured,jbcherry414@gmail.com,Not captured,701929196,,Not captured,Not captured,Not captured,Not captured,Not captured,Not captured,
Not captured,Not captured,02/11/2019,Not captured,Not captured,863949,020,00072,ARS-02-0047640,Beacon America,Not captured,Not captured,Not captured,Passport(055240537),,,csutak,esztera,,10/18/1958,female,Not captured,Not captured,Not captured,Not captured,Not captured,Not captured,Not captured,Not captured,Not captured,Not captured,Not captured,Not captured,Not captured,estate,my estate,Not captured,Not captured,Not captured,Not captured,2 south end ave,,new york,new york,10280,917-359-8568,518-537-9405,Not captured,Not captured,guardall10@aol.com,Not captured,701929194,,Not captured,Not captured,Not captured,Not captured,Not captured,Not captured,
Not captured,Not captured,02/08/2019,Not captured,Not captured,863949,020,00072,ARS-02-0047639,Beacon America,Not captured,Not captured,Not captured,Passport(AU235946),,,GOMEZ GARCIA,JUAN DEJESUS,,03/01/1980,male,Not captured,Not captured,Not captured,Not captured,Not captured,Not captured,Not captured,Not captured,Not captured,Not captured,Not captured,Not captured,Not captured,JUAN DE JESUS GOMEZ COVELLI,PADRE,Not captured,Not captured,Not captured,Not captured,14221 SW 120th ST STE 127 33186,,MIAMI,FL,33186,(786) 554-1076,,Not captured,Not captured,JUANCHOGOMEZ79@HOTMAIL.COM,Not captured,701929193,,Not captured,Not captured,Not captured,Not captured,Not captured,Not captured,
Not captured,Not captured,02/11/2019,Not captured,Not captured,863949,020,00072,OVI-28-0047638,OverseasCare Visitors Insurance Plan,Not captured,Not captured,Not captured,Passport(S8393295),,,Sarangan,Ambuja Usha,,05/05/1950,female,Not captured,Not captured,Not captured,Not captured,Not captured,Not captured,Not captured,Not captured,Not captured,Not captured,Not captured,Not captured,Not captured,Srinivasan,Sarangan,Not captured,Not captured,Not captured,Not captured,3417 Cinnabar Street,,West Lafayette,Indiana,47906,765-807-6433,,Not captured,Not captured,sulini@gmail.com,Not captured,701929192,,Not captured,Not captured,Not captured,Not captured,Not captured,Not captured,
Not captured,Not captured,02/08/2019,Not captured,Not captured,863949,020,00072,ARS-02-0047635,Beacon America,Not captured,Not captured,Not captured,Passport(044271727),,,PEREZ HIDALGO,LUIS EDUARDO,,09/25/1998,male,Not captured,Not captured,Not captured,Not captured,Not captured,Not captured,Not captured,Not captured,Not captured,Not captured,Not captured,Not captured,Not captured,LAURA CRISTINA PEREZ HIDALGO,SISTER,Not captured,Not captured,Not captured,Not captured,AV PRINCIPAL DE PUEBLO NUEVO URB DO&Ntilde;A EMILIA CASA 2,,SAN CRISTOBAL,Tachira,5001,+584126490161,,Not captured,Not captured,gordoph07@gmail.com,Not captured,701929164,,Not captured,Not captured,Not captured,Not captured,Not captured,Not captured,
Not captured,Not captured,02/09/2019,Not captured,Not captured,863949,020,00072,ARS-01-0047634,Beacon International,Not captured,Not captured,Not captured,Passport(NA),,,MELTON,LESLEY,M,03/15/1947,male,Not captured,Not captured,Not captured,Not captured,Not captured,Not captured,Not captured,Not captured,Not captured,Not captured,Not captured,Not captured,Not captured,JONATHAN MACLEOD,SON,Not captured,Not captured,Not captured,Not captured,120 COUNTRY CLUB PLACE,,EDMONTON,Alberta,T6M2H7,7802374818,,Not captured,Not captured,cjam@shaw.ca,Not captured,701929163,,Not captured,Not captured,Not captured,Not captured,Not captured,Not captured,
Not captured,Not captured,02/08/2019,Not captured,Not captured,863949,020,00072,ARS-01-0047632,Beacon International,Not captured,Not captured,Not captured,,,,Ward,Daniel,H,06/02/1985,male,Not captured,Not captured,Not captured,Not captured,Not captured,Not captured,Not captured,Not captured,Not captured,Not captured,Not captured,Not captured,Not captured,,,Not captured,Not captured,Not captured,Not captured,850 E 2nd Ave Unit B,,Escondido,California,92025,,,Not captured,Not captured,danielhward@yahoo.com,Not captured,701929161,,Not captured,Not captured,Not captured,Not captured,Not captured,Not captured,
Not captured,Not captured,02/08/2019,Not captured,Not captured,863949,020,00072,ARS-01-0047631,Beacon International,Not captured,Not captured,Not captured,,,,Ward,Holly,E,08/26/1982,female,Not captured,Not captured,Not captured,Not captured,Not captured,Not captured,Not captured,Not captured,Not captured,Not captured,Not captured,Not captured,Not captured,,,Not captured,Not captured,Not captured,Not captured,850 E 2nd Ave Unit B,,Escondido,California,92025,,,Not captured,Not captured,danielhward@yahoo.com,Not captured,701929160,,Not captured,Not captured,Not captured,Not captured,Not captured,Not captured,
Not captured,Not captured,02/11/2019,Not captured,Not captured,863949,020,00072,OVI-28-0047630,OverseasCare Visitors Insurance Plan,Not captured,Not captured,Not captured,Passport(S8393287),,,Sarangan,Srinivasan,,07/18/1944,male,Not captured,Not captured,Not captured,Not captured,Not captured,Not captured,Not captured,Not captured,Not captured,Not captured,Not captured,Not captured,Not captured,Ambuja Usha Sarangan,Spouse,Not captured,Not captured,Not captured,Not captured,3417 Cinnabar Street,,West Lafayette,Indiana,47906,765-807-6433,,Not captured,Not captured,sulini@gmail.com,Not captured,701929159,,Not captured,Not captured,Not captured,Not captured,Not captured,Not captured,