EE Transaction Type,Dependent Transaction Type,Effective Date,EE Signature,EE Signature Date,Control,Suffix,Account,Plan Number,Plan Name,Claim Office,Network ID Number,Customer Code,EE SSN,Dependent SSN,Dependent Relationship,Last Name,First Name,Middle Initial,DOB,Gender,Ethnicity,PCP/PCD,PCP/PCD Current Patient,Provider Cap Office Number,COB,Dep Student Indicator,Dep OOA Indicator,EE Prior Coverage Indicator,EE Late Entrant,EE Language Indicator,Hire Date,Earnings,Earnings Frequency,Beneficiary (Last Name First Name MI),Beneficiary Relationship,Continuation of Coverage Expiration Date,Continuation of Coverage Event Date,Continuation of Coverage Length of Coverage,Work Location Zip Code,Street Address Line 1,Street Address Line 2,City,State,Zip Code,Home Phone Number,Work Phone Number,Accept Code,Evidence Code,EE Email Address,Communication Disability Code,EE Alternate ID,Dep Alternate ID,Old Control,Old Suffix,Old Account,New Control,New Suffix,New Account,
Not captured,Not captured,01/31/2019,Not captured,Not captured,863949,020,00072,ARS-01-0047474,Beacon International,Not captured,Not captured,Not captured,,,,Spector,Michael,,04/03/1990,male,Not captured,Not captured,Not captured,Not captured,Not captured,Not captured,Not captured,Not captured,Not captured,Not captured,Not captured,Not captured,Not captured,,,Not captured,Not captured,Not captured,Not captured,1530 Michael Lane,,Pacific Palisades,California,90272,,,Not captured,Not captured,mspector.ecology@gmail.com,Not captured,701928645,,Not captured,Not captured,Not captured,Not captured,Not captured,Not captured,
Not captured,Not captured,01/31/2019,Not captured,Not captured,863949,020,00072,ARS-01-0047472,Beacon International,Not captured,Not captured,Not captured,,,,Groenendyk,Ronald,E,10/28/1961,male,Not captured,Not captured,Not captured,Not captured,Not captured,Not captured,Not captured,Not captured,Not captured,Not captured,Not captured,Not captured,Not captured,,,Not captured,Not captured,Not captured,Not captured,585 W 214th Street Apt A,,New York,New York,10034,,,Not captured,Not captured,ronaldeg1@outlook.com,Not captured,701928643,,Not captured,Not captured,Not captured,Not captured,Not captured,Not captured,
Not captured,Not captured,01/31/2019,Not captured,Not captured,863949,020,00072,ARS-02-0047471,Beacon America,Not captured,Not captured,Not captured,,,,Katz,Yerachmiel,,06/11/2018,male,Not captured,Not captured,Not captured,Not captured,Not captured,Not captured,Not captured,Not captured,Not captured,Not captured,Not captured,Not captured,Not captured,,,Not captured,Not captured,Not captured,Not captured,98 Aspen Ct.,,Lakewood,New Jersey,08701,7328867583,,Not captured,Not captured,Doublejkatz@gmail.com,Not captured,701928642,,Not captured,Not captured,Not captured,Not captured,Not captured,Not captured,
Not captured,Not captured,01/31/2019,Not captured,Not captured,863949,020,00072,ARS-02-0047470,Beacon America,Not captured,Not captured,Not captured,,,,Katz,Chaim ,,04/29/2015,male,Not captured,Not captured,Not captured,Not captured,Not captured,Not captured,Not captured,Not captured,Not captured,Not captured,Not captured,Not captured,Not captured,,,Not captured,Not captured,Not captured,Not captured,98 Aspen Ct.,,Lakewood,New Jersey,08701,7328867583,,Not captured,Not captured,Doublejkatz@gmail.com,Not captured,701928641,,Not captured,Not captured,Not captured,Not captured,Not captured,Not captured,
Not captured,Not captured,01/31/2019,Not captured,Not captured,863949,020,00072,ARS-02-0047469,Beacon America,Not captured,Not captured,Not captured,,,,Katz,Esther,,05/22/2013,female,Not captured,Not captured,Not captured,Not captured,Not captured,Not captured,Not captured,Not captured,Not captured,Not captured,Not captured,Not captured,Not captured,,,Not captured,Not captured,Not captured,Not captured,98 Aspen Ct.,,Lakewood,New Jersey,08701,7328867583,,Not captured,Not captured,Doublejkatz@gmail.com,Not captured,701928640,,Not captured,Not captured,Not captured,Not captured,Not captured,Not captured,
Not captured,Not captured,01/31/2019,Not captured,Not captured,863949,020,00072,ARS-02-0047468,Beacon America,Not captured,Not captured,Not captured,,,,Katz,Chaya,,09/15/1983,female,Not captured,Not captured,Not captured,Not captured,Not captured,Not captured,Not captured,Not captured,Not captured,Not captured,Not captured,Not captured,Not captured,,,Not captured,Not captured,Not captured,Not captured,98 Aspen Ct.,,Lakewood,New Jersey,08701,7328867583,,Not captured,Not captured,Doublejkatz@gmail.com,Not captured,701928639,,Not captured,Not captured,Not captured,Not captured,Not captured,Not captured,
Not captured,Not captured,01/31/2019,Not captured,Not captured,863949,020,00072,ARS-02-0047467,Beacon America,Not captured,Not captured,Not captured,,,,Katz,Yaacov,,09/20/1980,male,Not captured,Not captured,Not captured,Not captured,Not captured,Not captured,Not captured,Not captured,Not captured,Not captured,Not captured,Not captured,Not captured,,,Not captured,Not captured,Not captured,Not captured,98 Aspen Ct.,,Lakewood,New Jersey,08701,7328867583,,Not captured,Not captured,Doublejkatz@gmail.com,Not captured,701928638,,Not captured,Not captured,Not captured,Not captured,Not captured,Not captured,
Not captured,Not captured,01/31/2019,Not captured,Not captured,863949,020,00072,ARS-01-0047466,Beacon International,Not captured,Not captured,Not captured,,,,Kennedy,Lukas,,04/29/1990,male,Not captured,Not captured,Not captured,Not captured,Not captured,Not captured,Not captured,Not captured,Not captured,Not captured,Not captured,Not captured,Not captured,,,Not captured,Not captured,Not captured,Not captured,6840 E 11th Ave,,Anchorage,Alaska,99504,,,Not captured,Not captured,surf4luke@gmail.com,Not captured,701928637,,Not captured,Not captured,Not captured,Not captured,Not captured,Not captured,
Not captured,Not captured,01/31/2019,Not captured,Not captured,863949,020,00072,ARS-01-0047452,Beacon International,Not captured,Not captured,Not captured,,,,Marzy,Christian,,06/19/1985,male,Not captured,Not captured,Not captured,Not captured,Not captured,Not captured,Not captured,Not captured,Not captured,Not captured,Not captured,Not captured,Not captured,,,Not captured,Not captured,Not captured,Not captured,79 West Coast Crescent,,Singapore,,126793,,,Not captured,Not captured,jenny.wasner@gmail.com,Not captured,701928567,,Not captured,Not captured,Not captured,Not captured,Not captured,Not captured,
Not captured,Not captured,01/31/2019,Not captured,Not captured,863949,020,00072,ARS-01-0047451,Beacon International,Not captured,Not captured,Not captured,,,,Wasner,Jennifer,,10/07/1986,female,Not captured,Not captured,Not captured,Not captured,Not captured,Not captured,Not captured,Not captured,Not captured,Not captured,Not captured,Not captured,Not captured,,,Not captured,Not captured,Not captured,Not captured,79 West Coast Crescent,,Singapore,,126793,,,Not captured,Not captured,jenny.wasner@gmail.com,Not captured,701928566,,Not captured,Not captured,Not captured,Not captured,Not captured,Not captured,
Not captured,Not captured,01/31/2019,Not captured,Not captured,863949,020,00072,ARS-02-0047449,Beacon America,Not captured,Not captured,Not captured,,,,Wassenaar,Mollie,L,03/11/1992,female,Not captured,Not captured,Not captured,Not captured,Not captured,Not captured,Not captured,Not captured,Not captured,Not captured,Not captured,Not captured,Not captured,,,Not captured,Not captured,Not captured,Not captured,7929 111 Street NW,,Edmonton,Alberta,T6G 1H4,,,Not captured,Not captured,dan.wassenaar@gmail.com,Not captured,701928564,,Not captured,Not captured,Not captured,Not captured,Not captured,Not captured,
Not captured,Not captured,01/31/2019,Not captured,Not captured,863949,020,00072,ARS-02-0047448,Beacon America,Not captured,Not captured,Not captured,,,,Wassenaar,Daniel,N,08/27/1992,male,Not captured,Not captured,Not captured,Not captured,Not captured,Not captured,Not captured,Not captured,Not captured,Not captured,Not captured,Not captured,Not captured,,,Not captured,Not captured,Not captured,Not captured,7929 111 Street NW,,Edmonton,Alberta,T6G 1H4,,,Not captured,Not captured,dan.wassenaar@gmail.com,Not captured,701928563,,Not captured,Not captured,Not captured,Not captured,Not captured,Not captured,
Not captured,Not captured,01/30/2019,Not captured,Not captured,863949,020,00072,ARS-01-0047443,Beacon International,Not captured,Not captured,Not captured,,,,Gold,Yitzchak,,10/25/1989,male,Not captured,Not captured,Not captured,Not captured,Not captured,Not captured,Not captured,Not captured,Not captured,Not captured,Not captured,Not captured,Not captured,,,Not captured,Not captured,Not captured,Not captured,3815 12th ave,,Brooklyn,New York,11218,7186860250,,Not captured,Not captured,yitzchakgold@gmail.com,Not captured,701928558,,Not captured,Not captured,Not captured,Not captured,Not captured,Not captured,
Not captured,Not captured,01/31/2019,Not captured,Not captured,863949,020,00072,ARS-01-0047442,Beacon International,Not captured,Not captured,Not captured,Passport(530025015),,,Wells,Michael,,04/15/1991,male,Not captured,Not captured,Not captured,Not captured,Not captured,Not captured,Not captured,Not captured,Not captured,Not captured,Not captured,Not captured,Not captured,Elena Wells,Spouse,Not captured,Not captured,Not captured,Not captured,1494 Fayne Rd,,Brighton,Tennessee,38011,9015049474,,Not captured,Not captured,michael.wells0415@gmail.com,Not captured,701928557,,Not captured,Not captured,Not captured,Not captured,Not captured,Not captured,
Not captured,Not captured,01/31/2019,Not captured,Not captured,863949,020,00072,ARS-02-0047439,Beacon America,Not captured,Not captured,Not captured,Passport(P547535),,,pestana da silva,maria zizelda,z,12/24/1950,female,Not captured,Not captured,Not captured,Not captured,Not captured,Not captured,Not captured,Not captured,Not captured,Not captured,Not captured,Not captured,Not captured,heidee Gacia Pestana,daughter,Not captured,Not captured,Not captured,Not captured,2720 State st ,,Hamden,Connecticut,06517,2035439408,,Not captured,Not captured,hhhggg28@hotmail.com,Not captured,701928554,,Not captured,Not captured,Not captured,Not captured,Not captured,Not captured,
Not captured,Not captured,01/31/2019,Not captured,Not captured,863949,020,00072,ARS-01-0047430,Beacon International,Not captured,Not captured,Not captured,,,,Nayman,Solomom,,01/08/1946,male,Not captured,Not captured,Not captured,Not captured,Not captured,Not captured,Not captured,Not captured,Not captured,Not captured,Not captured,Not captured,Not captured,,,Not captured,Not captured,Not captured,Not captured,3 Beechwood Drive,,Lawrence,New York,11599,516-680-8443,,Not captured,Not captured,s.j.nayman@gmail.com,Not captured,701928545,,Not captured,Not captured,Not captured,Not captured,Not captured,Not captured,
Not captured,Not captured,01/30/2019,Not captured,Not captured,863949,020,00072,ARS-02-0047427,Beacon America,Not captured,Not captured,Not captured,,,,Harden,Chrisnalyn,,12/19/1985,female,Not captured,Not captured,Not captured,Not captured,Not captured,Not captured,Not captured,Not captured,Not captured,Not captured,Not captured,Not captured,Not captured,,,Not captured,Not captured,Not captured,Not captured,17100-B Bear Valley Rd,,Victorville,California,92395,,,Not captured,Not captured,hardenbride@charter.net,Not captured,701928527,,Not captured,Not captured,Not captured,Not captured,Not captured,Not captured,
Not captured,Not captured,01/30/2019,Not captured,Not captured,863949,020,00072,ARS-01-0047421,Beacon International,Not captured,Not captured,Not captured,,,,Leichtling,Michelle,K,02/07/1978,female,Not captured,Not captured,Not captured,Not captured,Not captured,Not captured,Not captured,Not captured,Not captured,Not captured,Not captured,Not captured,Not captured,,,Not captured,Not captured,Not captured,Not captured,321 west 82nd,,New York,New York,10023,,,Not captured,Not captured,m.leichtling81@gmail.com,Not captured,701928517,,Not captured,Not captured,Not captured,Not captured,Not captured,Not captured,
Not captured,Not captured,01/30/2019,Not captured,Not captured,863949,020,00072,ARS-01-0047420,Beacon International,Not captured,Not captured,Not captured,,,,Jacoby,Matthew,S,05/06/1980,male,Not captured,Not captured,Not captured,Not captured,Not captured,Not captured,Not captured,Not captured,Not captured,Not captured,Not captured,Not captured,Not captured,,,Not captured,Not captured,Not captured,Not captured,2657 Barclay Drive,,Nashville,Tennessee,37206,,,Not captured,Not captured,jacobymatt@gmail.com,Not captured,701928516,,Not captured,Not captured,Not captured,Not captured,Not captured,Not captured,
Not captured,Not captured,01/30/2019,Not captured,Not captured,863949,020,00072,ARS-01-0047419,Beacon International,Not captured,Not captured,Not captured,,,,Spilman,Dov,,11/25/1974,male,Not captured,Not captured,Not captured,Not captured,Not captured,Not captured,Not captured,Not captured,Not captured,Not captured,Not captured,Not captured,Not captured,,,Not captured,Not captured,Not captured,Not captured,22 Engleberg Terrace,,Lakewood,New Jersey,08701,,,Not captured,Not captured,dovspil@gmail.com,Not captured,701928515,,Not captured,Not captured,Not captured,Not captured,Not captured,Not captured,
Not captured,Not captured,01/31/2019,Not captured,Not captured,863949,020,00072,ARS-01-0047418,Beacon International,Not captured,Not captured,Not captured,Passport(535796080),,,Twisdale,Ronald,K,05/13/1978,male,Not captured,Not captured,Not captured,Not captured,Not captured,Not captured,Not captured,Not captured,Not captured,Not captured,Not captured,Not captured,Not captured,Susan Elaine Twisdale,Wife,Not captured,Not captured,Not captured,Not captured,3945 Gainsville Rd,,Mason,Tennessee,38049,9018261877,,Not captured,Not captured,ktwisdale@rittermail.com,Not captured,701928483,,Not captured,Not captured,Not captured,Not captured,Not captured,Not captured,
Not captured,Not captured,01/30/2019,Not captured,Not captured,863949,020,00072,ARS-01-0047417,Beacon International,Not captured,Not captured,Not captured,,,,Ottman,Michael,J,02/10/1990,male,Not captured,Not captured,Not captured,Not captured,Not captured,Not captured,Not captured,Not captured,Not captured,Not captured,Not captured,Not captured,Not captured,,,Not captured,Not captured,Not captured,Not captured,425 Zircon Lane North,,Plymouth,Minnesota,55447,,,Not captured,Not captured,mottman10@gmail.com,Not captured,701928482,,Not captured,Not captured,Not captured,Not captured,Not captured,Not captured,
Not captured,Not captured,01/30/2019,Not captured,Not captured,863949,020,00072,ARS-01-0047411,Beacon International,Not captured,Not captured,Not captured,,,,Hirschler ,Zissel,,11/06/1996,female,Not captured,Not captured,Not captured,Not captured,Not captured,Not captured,Not captured,Not captured,Not captured,Not captured,Not captured,Not captured,Not captured,,,Not captured,Not captured,Not captured,Not captured,32 Ostilla Ave.,,Spring Valley,New York,10977,845-354-5389,,Not captured,Not captured,3621175@gmail.com,Not captured,701928476,,Not captured,Not captured,Not captured,Not captured,Not captured,Not captured,
Not captured,Not captured,01/30/2019,Not captured,Not captured,863949,020,00072,ARS-01-0047410,Beacon International,Not captured,Not captured,Not captured,,,,Hirshler ,Mordechai ,,03/13/1998,male,Not captured,Not captured,Not captured,Not captured,Not captured,Not captured,Not captured,Not captured,Not captured,Not captured,Not captured,Not captured,Not captured,,,Not captured,Not captured,Not captured,Not captured,32 Ostilla Ave.,,Spring Valley,New York,10977,845-354-5389,,Not captured,Not captured,3621175@gmail.com,Not captured,701928475,,Not captured,Not captured,Not captured,Not captured,Not captured,Not captured,
Not captured,Not captured,01/29/2019,Not captured,Not captured,863949,020,00072,ARS-01-0047407,Beacon International,Not captured,Not captured,Not captured,Passport(562837289),,,Covert,Donna,D,12/01/1969,female,Not captured,Not captured,Not captured,Not captured,Not captured,Not captured,Not captured,Not captured,Not captured,Not captured,Not captured,Not captured,Not captured,Linda Dod,Sister,Not captured,Not captured,Not captured,Not captured,103 South Liberty Street,,Harrison,Arkansas,72601,9184130932,,Not captured,Not captured,cdonna77@gmail.com,Not captured,701928472,,Not captured,Not captured,Not captured,Not captured,Not captured,Not captured,
Not captured,Not captured,01/29/2019,Not captured,Not captured,863949,020,00072,ARS-01-0047396,Beacon International,Not captured,Not captured,Not captured,,,,Kocunova,Veronika,,01/19/1987,female,Not captured,Not captured,Not captured,Not captured,Not captured,Not captured,Not captured,Not captured,Not captured,Not captured,Not captured,Not captured,Not captured,,,Not captured,Not captured,Not captured,Not captured,25-87 42nd Street,,Astoria,New York,11103,,,Not captured,Not captured,veronikakk@gmail.com,Not captured,701928454,,Not captured,Not captured,Not captured,Not captured,Not captured,Not captured,
Not captured,Not captured,01/29/2019,Not captured,Not captured,863949,020,00072,ARS-01-0047378,Beacon International,Not captured,Not captured,Not captured,,,,MATTOX,Judith,A,01/27/1946,female,Not captured,Not captured,Not captured,Not captured,Not captured,Not captured,Not captured,Not captured,Not captured,Not captured,Not captured,Not captured,Not captured,,,Not captured,Not captured,Not captured,Not captured,15 Morning Star Drive,,Leicester,North Carolina,28748,,,Not captured,Not captured,kenbrame10@gmail.com,Not captured,701928431,,Not captured,Not captured,Not captured,Not captured,Not captured,Not captured,
Not captured,Not captured,01/29/2019,Not captured,Not captured,863949,020,00072,ARS-01-0047377,Beacon International,Not captured,Not captured,Not captured,,,,Brame,Kenneth,L,10/07/1947,male,Not captured,Not captured,Not captured,Not captured,Not captured,Not captured,Not captured,Not captured,Not captured,Not captured,Not captured,Not captured,Not captured,,,Not captured,Not captured,Not captured,Not captured,15 Morning Star Drive,,Leicester,North Carolina,28748,,,Not captured,Not captured,kenbrame10@gmail.com,Not captured,701928430,,Not captured,Not captured,Not captured,Not captured,Not captured,Not captured,
Not captured,Not captured,01/29/2019,Not captured,Not captured,863949,020,00072,ARS-02-0047373,Beacon America,Not captured,Not captured,Not captured,,,,Visocnik,Ruta,,10/16/1971,female,Not captured,Not captured,Not captured,Not captured,Not captured,Not captured,Not captured,Not captured,Not captured,Not captured,Not captured,Not captured,Not captured,,,Not captured,Not captured,Not captured,Not captured,Laisves al. 2/4,,Kaunas,,44215,,,Not captured,Not captured,tomviso@gmail.com,Not captured,701928422,,Not captured,Not captured,Not captured,Not captured,Not captured,Not captured,
Not captured,Not captured,01/29/2019,Not captured,Not captured,863949,020,00072,ARS-02-0047372,Beacon America,Not captured,Not captured,Not captured,,,,Visocnik,Tomaz,,03/20/1959,male,Not captured,Not captured,Not captured,Not captured,Not captured,Not captured,Not captured,Not captured,Not captured,Not captured,Not captured,Not captured,Not captured,,,Not captured,Not captured,Not captured,Not captured,Laisves al. 2/4,,Kaunas,,44215,,,Not captured,Not captured,tomviso@gmail.com,Not captured,701928421,,Not captured,Not captured,Not captured,Not captured,Not captured,Not captured,
Not captured,Not captured,01/29/2019,Not captured,Not captured,863949,020,00072,ARS-01-0047370,Beacon International,Not captured,Not captured,Not captured,,,,Martin,Lawrence,A,04/19/1974,male,Not captured,Not captured,Not captured,Not captured,Not captured,Not captured,Not captured,Not captured,Not captured,Not captured,Not captured,Not captured,Not captured,,,Not captured,Not captured,Not captured,Not captured,715 NE 63rd Ave,,Portland,Oregon,97213,,,Not captured,Not captured,drewmerget@hotmail.com,Not captured,701928419,,Not captured,Not captured,Not captured,Not captured,Not captured,Not captured,
Not captured,Not captured,01/29/2019,Not captured,Not captured,863949,020,00072,ARS-01-0047369,Beacon International,Not captured,Not captured,Not captured,,,,Merget,Andrew,J,04/26/1965,male,Not captured,Not captured,Not captured,Not captured,Not captured,Not captured,Not captured,Not captured,Not captured,Not captured,Not captured,Not captured,Not captured,,,Not captured,Not captured,Not captured,Not captured,715 NE 63rd Ave,,Portland,Oregon,97213,,,Not captured,Not captured,drewmerget@hotmail.com,Not captured,701928418,,Not captured,Not captured,Not captured,Not captured,Not captured,Not captured,
Not captured,Not captured,01/30/2019,Not captured,Not captured,863949,020,00072,ARS-01-0047365,Beacon International,Not captured,Not captured,Not captured,,,,Zelig, Aaron ,reinman,01/06/1989,male,Not captured,Not captured,Not captured,Not captured,Not captured,Not captured,Not captured,Not captured,Not captured,Not captured,Not captured,Not captured,Not captured,,,Not captured,Not captured,Not captured,Not captured,1466 44 st,,Brooklyn,New York,11219,9174740562,,Not captured,Not captured,aronzelig@gmail.com,Not captured,701928414,,Not captured,Not captured,Not captured,Not captured,Not captured,Not captured,
Not captured,Not captured,01/30/2019,Not captured,Not captured,863949,020,00072,ARS-02-0047362,Beacon America,Not captured,Not captured,Not captured,,,,Katz,Minna,,04/01/2018,female,Not captured,Not captured,Not captured,Not captured,Not captured,Not captured,Not captured,Not captured,Not captured,Not captured,Not captured,Not captured,Not captured,,,Not captured,Not captured,Not captured,Not captured,51 East 8th Street,,Lakewood,New Jersey,08701,,,Not captured,Not captured,katzruchama@gmail.com,Not captured,701928409,,Not captured,Not captured,Not captured,Not captured,Not captured,Not captured,
Not captured,Not captured,01/30/2019,Not captured,Not captured,863949,020,00072,ARS-02-0047361,Beacon America,Not captured,Not captured,Not captured,,,,Katz,Ruchama,,06/03/1996,female,Not captured,Not captured,Not captured,Not captured,Not captured,Not captured,Not captured,Not captured,Not captured,Not captured,Not captured,Not captured,Not captured,,,Not captured,Not captured,Not captured,Not captured,51 East 8th Street,,Lakewood,New Jersey,08701,,,Not captured,Not captured,katzruchama@gmail.com,Not captured,701928408,,Not captured,Not captured,Not captured,Not captured,Not captured,Not captured,
Not captured,Not captured,01/30/2019,Not captured,Not captured,863949,020,00072,ARS-01-0047353,Beacon International,Not captured,Not captured,Not captured,Passport(R523662410050),,,Knight,Peter,,01/05/1941,male,Not captured,Not captured,Not captured,Not captured,Not captured,Not captured,Not captured,Not captured,Not captured,Not captured,Not captured,Not captured,Not captured,,,Not captured,Not captured,Not captured,Not captured,242 NW 56th Court,,Miami,Florida,33126,5613027704,,Not captured,Not captured,holapeterdr@yahoo.com,Not captured,701928389,,Not captured,Not captured,Not captured,Not captured,Not captured,Not captured,
Not captured,Not captured,01/29/2019,Not captured,Not captured,863949,020,00072,ARS-01-0047351,Beacon International,Not captured,Not captured,Not captured,,,,Spitz,Toby,,03/07/1978,female,Not captured,Not captured,Not captured,Not captured,Not captured,Not captured,Not captured,Not captured,Not captured,Not captured,Not captured,Not captured,Not captured,,,Not captured,Not captured,Not captured,Not captured,118 bates Dr,,Monsey,New York,10952,,,Not captured,Not captured,josephspitz149@gmail.com,Not captured,701928387,,Not captured,Not captured,Not captured,Not captured,Not captured,Not captured,