EE Transaction Type,Dependent Transaction Type,Effective Date,EE Signature,EE Signature Date,Control,Suffix,Account,Plan Number,Plan Name,Claim Office,Network ID Number,Customer Code,EE SSN,Dependent SSN,Dependent Relationship,Last Name,First Name,Middle Initial,DOB,Gender,Ethnicity,PCP/PCD,PCP/PCD Current Patient,Provider Cap Office Number,COB,Dep Student Indicator,Dep OOA Indicator,EE Prior Coverage Indicator,EE Late Entrant,EE Language Indicator,Hire Date,Earnings,Earnings Frequency,Beneficiary (Last Name First Name MI),Beneficiary Relationship,Continuation of Coverage Expiration Date,Continuation of Coverage Event Date,Continuation of Coverage Length of Coverage,Work Location Zip Code,Street Address Line 1,Street Address Line 2,City,State,Zip Code,Home Phone Number,Work Phone Number,Accept Code,Evidence Code,EE Email Address,Communication Disability Code,EE Alternate ID,Dep Alternate ID,Old Control,Old Suffix,Old Account,New Control,New Suffix,New Account,
Not captured,Not captured,01/15/2019,Not captured,Not captured,863949,020,00072,ARS-01-0047126,Beacon International,Not captured,Not captured,Not captured,,,,Neudorf,Victoria,H,06/20/1993,female,Not captured,Not captured,Not captured,Not captured,Not captured,Not captured,Not captured,Not captured,Not captured,Not captured,Not captured,Not captured,Not captured,,,Not captured,Not captured,Not captured,Not captured,Po box 1078,,La crete,Alberta,T0h2h0,,,Not captured,Not captured,vickyneudorf@yahoo.ca,Not captured,701927920,,Not captured,Not captured,Not captured,Not captured,Not captured,Not captured,
Not captured,Not captured,01/15/2019,Not captured,Not captured,863949,020,00072,ARS-01-0047125,Beacon International,Not captured,Not captured,Not captured,,,,Parks,William,M,01/17/1977,male,Not captured,Not captured,Not captured,Not captured,Not captured,Not captured,Not captured,Not captured,Not captured,Not captured,Not captured,Not captured,Not captured,,,Not captured,Not captured,Not captured,Not captured,120B Via Estrada,,Laguna Woods,California,92067,,,Not captured,Not captured,mitchell_parks@hotmail.com,Not captured,701927919,,Not captured,Not captured,Not captured,Not captured,Not captured,Not captured,
Not captured,Not captured,01/15/2019,Not captured,Not captured,863949,020,00072,ARS-01-0047110,Beacon International,Not captured,Not captured,Not captured,Passport(568188232),,,Glanzer,Hirsch,,03/15/1948,male,Not captured,Not captured,Not captured,Not captured,Not captured,Not captured,Not captured,Not captured,Not captured,Not captured,Not captured,Not captured,Not captured,,,Not captured,Not captured,Not captured,Not captured,1430 49th Street,,Brooklyn,New York,11219,7189720275,,Not captured,Not captured,hirsch.glanzer3@verizon.net,Not captured,701927857,,Not captured,Not captured,Not captured,Not captured,Not captured,Not captured,
Not captured,Not captured,01/15/2019,Not captured,Not captured,863949,020,00072,ARS-01-0047107,Beacon International,Not captured,Not captured,Not captured,Passport(545786977),,,bell,stacy,l,12/16/1983,female,Not captured,Not captured,Not captured,Not captured,Not captured,Not captured,Not captured,Not captured,Not captured,Not captured,Not captured,Not captured,Not captured,linda bell,parent,Not captured,Not captured,Not captured,Not captured,10 delancey st,,new york,New York,10002,447538917024,,Not captured,Not captured,stacyleebell66@gmail.com,Not captured,701927842,,Not captured,Not captured,Not captured,Not captured,Not captured,Not captured,
Not captured,Not captured,01/15/2019,Not captured,Not captured,863949,020,00072,ARS-01-0047105,Beacon International,Not captured,Not captured,Not captured,,,,Ryzenkov,Anton,,04/18/1990,male,Not captured,Not captured,Not captured,Not captured,Not captured,Not captured,Not captured,Not captured,Not captured,Not captured,Not captured,Not captured,Not captured,,,Not captured,Not captured,Not captured,Not captured,8612 lodestone circle,,elk grove,California,95624,,,Not captured,Not captured,antonryzenkov2@gmail.com,Not captured,701927840,,Not captured,Not captured,Not captured,Not captured,Not captured,Not captured,
Not captured,Not captured,01/14/2019,Not captured,Not captured,863949,020,00072,ARS-01-0047097,Beacon International,Not captured,Not captured,Not captured,Passport(081155484),,,SLEIMAN MONTAGNA,INDHIRA VICTORIA,,03/13/2000,female,Not captured,Not captured,Not captured,Not captured,Not captured,Not captured,Not captured,Not captured,Not captured,Not captured,Not captured,Not captured,Not captured,ARIADNA MONTAGNA,MADRE,Not captured,Not captured,Not captured,Not captured,6714 mission club blvd.,,ORLANDO,Florida,32821,3212301798,+582763569875,Not captured,Not captured,oficinafg2011@hotmail.com,Not captured,701927820,,Not captured,Not captured,Not captured,Not captured,Not captured,Not captured,
Not captured,Not captured,01/14/2019,Not captured,Not captured,863949,020,00072,ARS-02-0047094,Beacon America,Not captured,Not captured,Not captured,,,,Maldonado,Bryant,,01/08/1989,male,Not captured,Not captured,Not captured,Not captured,Not captured,Not captured,Not captured,Not captured,Not captured,Not captured,Not captured,Not captured,Not captured,,,Not captured,Not captured,Not captured,Not captured,3602 E Desert Willow Rd,,Phoenix,Arizona,85044-7130,,,Not captured,Not captured,squaremouth@nirdvana.com,Not captured,701927817,,Not captured,Not captured,Not captured,Not captured,Not captured,Not captured,
Not captured,Not captured,01/14/2019,Not captured,Not captured,863949,020,00072,ARS-02-0047093,Beacon America,Not captured,Not captured,Not captured,,,,Style,Tyler,,08/22/1973,male,Not captured,Not captured,Not captured,Not captured,Not captured,Not captured,Not captured,Not captured,Not captured,Not captured,Not captured,Not captured,Not captured,,,Not captured,Not captured,Not captured,Not captured,3602 E Desert Willow Rd,,Phoenix,Arizona,85044-7130,,,Not captured,Not captured,squaremouth@nirdvana.com,Not captured,701927816,,Not captured,Not captured,Not captured,Not captured,Not captured,Not captured,
Not captured,Not captured,01/14/2019,Not captured,Not captured,863949,020,00072,ARS-03-0046812,Essential America,Not captured,Not captured,Not captured,Passport(481270659),,,Brown,Elizabeth,DuBose,02/21/1966,female,Not captured,Not captured,Not captured,Not captured,Not captured,Not captured,Not captured,Not captured,Not captured,Not captured,Not captured,Not captured,Not captured,,,Not captured,Not captured,Not captured,Not captured,6495 Frank Gardner Way,,Parker,Colorado,80134,+1 503 580 2311,,Not captured,Not captured,bethb2311@gmail.com,Not captured,701927146,,Not captured,Not captured,Not captured,Not captured,Not captured,Not captured,
Not captured,Not captured,01/14/2019,Not captured,Not captured,863949,020,00072,ARS-02-0047069,Beacon America,Not captured,Not captured,Not captured,,,,Peng,Yinghua,,12/31/1952,female,Not captured,Not captured,Not captured,Not captured,Not captured,Not captured,Not captured,Not captured,Not captured,Not captured,Not captured,Not captured,Not captured,Jingbo Cai,Daughter ,Not captured,Not captured,Not captured,Not captured,13308 Midland Rd #1874,,Poway,California,92074,4154250809,,Not captured,Not captured,jing_bobo@yahoo.com,Not captured,701927787,,Not captured,Not captured,Not captured,Not captured,Not captured,Not captured,
Not captured,Not captured,01/14/2019,Not captured,Not captured,863949,020,00072,ARS-01-0047068,Beacon International,Not captured,Not captured,Not captured,,,,Shannon,Vanessa,M,12/08/1996,female,Not captured,Not captured,Not captured,Not captured,Not captured,Not captured,Not captured,Not captured,Not captured,Not captured,Not captured,Not captured,Not captured,,,Not captured,Not captured,Not captured,Not captured,11625 Crestridge Loop,,Trinity,Florida,34655,,,Not captured,Not captured,rjashannon@msn.com,Not captured,701927786,,Not captured,Not captured,Not captured,Not captured,Not captured,Not captured,
Not captured,Not captured,01/13/2019,Not captured,Not captured,863949,020,00072,ARS-01-0047067,Beacon International,Not captured,Not captured,Not captured,,,,Paffrath,Brittany,,11/18/1996,female,Not captured,Not captured,Not captured,Not captured,Not captured,Not captured,Not captured,Not captured,Not captured,Not captured,Not captured,Not captured,Not captured,,,Not captured,Not captured,Not captured,Not captured,245 W Loraine Street,,Glendale,California,91202,,,Not captured,Not captured,williecwatkins@gmail.com,Not captured,701927782,,Not captured,Not captured,Not captured,Not captured,Not captured,Not captured,
Not captured,Not captured,01/13/2019,Not captured,Not captured,863949,020,00072,ARS-01-0047066,Beacon International,Not captured,Not captured,Not captured,,,,Watkins,William,,03/28/1993,male,Not captured,Not captured,Not captured,Not captured,Not captured,Not captured,Not captured,Not captured,Not captured,Not captured,Not captured,Not captured,Not captured,,,Not captured,Not captured,Not captured,Not captured,245 W Loraine Street,,Glendale,California,91202,,,Not captured,Not captured,williecwatkins@gmail.com,Not captured,701927781,,Not captured,Not captured,Not captured,Not captured,Not captured,Not captured,
Not captured,Not captured,01/14/2019,Not captured,Not captured,863949,020,00072,OVI-28-0047065,OverseasCare Visitors Insurance Plan,Not captured,Not captured,Not captured,Passport(J7886659),,,SURE,PADMAVATHI,,07/01/1949,female,Not captured,Not captured,Not captured,Not captured,Not captured,Not captured,Not captured,Not captured,Not captured,Not captured,Not captured,Not captured,Not captured,SUBHASH SURE,SON,Not captured,Not captured,Not captured,Not captured,43150 STARR ST,,FREMONT,California,94539,5106760615,4088063089,Not captured,Not captured,sure.subhash@gmail.com,Not captured,701927780,,Not captured,Not captured,Not captured,Not captured,Not captured,Not captured,
Not captured,Not captured,01/14/2019,Not captured,Not captured,863949,020,00072,OVI-28-0047064,OverseasCare Visitors Insurance Plan,Not captured,Not captured,Not captured,Passport(k2935284),,,Goyal,Pushpa,,07/22/1942,female,Not captured,Not captured,Not captured,Not captured,Not captured,Not captured,Not captured,Not captured,Not captured,Not captured,Not captured,Not captured,Not captured,,,Not captured,Not captured,Not captured,Not captured,819 Ridgewood Rd,,Millburn,New Jersey,07041,8188498843,,Not captured,Not captured,neeraj.nagpal@outlook.com,Not captured,701927779,,Not captured,Not captured,Not captured,Not captured,Not captured,Not captured,
Not captured,Not captured,01/14/2019,Not captured,Not captured,863949,020,00072,OVI-28-0047063,OverseasCare Visitors Insurance Plan,Not captured,Not captured,Not captured,Passport(k2935284),,,Das Goyal,Lakshman,,07/11/1942,male,Not captured,Not captured,Not captured,Not captured,Not captured,Not captured,Not captured,Not captured,Not captured,Not captured,Not captured,Not captured,Not captured,,,Not captured,Not captured,Not captured,Not captured,819 Ridgewood Rd,,Millburn,New Jersey,07041,8188498843,,Not captured,Not captured,neeraj.nagpal@outlook.com,Not captured,701927778,,Not captured,Not captured,Not captured,Not captured,Not captured,Not captured,
Not captured,Not captured,01/13/2019,Not captured,Not captured,863949,020,00072,ARS-02-0047061,Beacon America,Not captured,Not captured,Not captured,,,,Davai,Christopher,,09/02/1991,male,Not captured,Not captured,Not captured,Not captured,Not captured,Not captured,Not captured,Not captured,Not captured,Not captured,Not captured,Not captured,Not captured,,,Not captured,Not captured,Not captured,Not captured,1391 Dundas St. W.,,New Orleans,Ontario,M6J 1Y4,,,Not captured,Not captured,chris_davai@hotmail.com,Not captured,701927776,,Not captured,Not captured,Not captured,Not captured,Not captured,Not captured,
Not captured,Not captured,01/13/2019,Not captured,Not captured,863949,020,00072,ARS-01-0047060,Beacon International,Not captured,Not captured,Not captured,,,,sabel,leon,,05/27/1976,male,Not captured,Not captured,Not captured,Not captured,Not captured,Not captured,Not captured,Not captured,Not captured,Not captured,Not captured,Not captured,Not captured,,,Not captured,Not captured,Not captured,Not captured,2 paiken drive,,spring valley,New York,10977,,,Not captured,Not captured,leon@crosstownglass.com,Not captured,701927775,,Not captured,Not captured,Not captured,Not captured,Not captured,Not captured,
Not captured,Not captured,01/13/2019,Not captured,Not captured,863949,020,00072,ARS-01-0047059,Beacon International,Not captured,Not captured,Not captured,,,,Coopersmith,Jacob ,,11/18/2005,male,Not captured,Not captured,Not captured,Not captured,Not captured,Not captured,Not captured,Not captured,Not captured,Not captured,Not captured,Not captured,Not captured,,,Not captured,Not captured,Not captured,Not captured,2086 e 22 st,,Brooklyn,New York,11229,3473028743,,Not captured,Not captured,Micoope@yahoo.com,Not captured,701927774,,Not captured,Not captured,Not captured,Not captured,Not captured,Not captured,
Not captured,Not captured,01/13/2019,Not captured,Not captured,863949,020,00072,ARS-01-0047058,Beacon International,Not captured,Not captured,Not captured,,,,Coopersmith,Ellie,,03/21/2003,female,Not captured,Not captured,Not captured,Not captured,Not captured,Not captured,Not captured,Not captured,Not captured,Not captured,Not captured,Not captured,Not captured,,,Not captured,Not captured,Not captured,Not captured,2086 e 22 st,,Brooklyn,New York,11229,3473028743,,Not captured,Not captured,Micoope@yahoo.com,Not captured,701927773,,Not captured,Not captured,Not captured,Not captured,Not captured,Not captured,
Not captured,Not captured,01/13/2019,Not captured,Not captured,863949,020,00072,ARS-01-0047057,Beacon International,Not captured,Not captured,Not captured,,,,Coopersmith,Rebecca ,,11/18/2001,female,Not captured,Not captured,Not captured,Not captured,Not captured,Not captured,Not captured,Not captured,Not captured,Not captured,Not captured,Not captured,Not captured,,,Not captured,Not captured,Not captured,Not captured,2086 e 22 st,,Brooklyn,New York,11229,3473028743,,Not captured,Not captured,Micoope@yahoo.com,Not captured,701927772,,Not captured,Not captured,Not captured,Not captured,Not captured,Not captured,
Not captured,Not captured,01/13/2019,Not captured,Not captured,863949,020,00072,ARS-01-0047056,Beacon International,Not captured,Not captured,Not captured,,,,Coopersmith,Deborah ,,05/12/1999,female,Not captured,Not captured,Not captured,Not captured,Not captured,Not captured,Not captured,Not captured,Not captured,Not captured,Not captured,Not captured,Not captured,,,Not captured,Not captured,Not captured,Not captured,2086 e 22 st,,Brooklyn,New York,11229,3473028743,,Not captured,Not captured,Micoope@yahoo.com,Not captured,701927771,,Not captured,Not captured,Not captured,Not captured,Not captured,Not captured,
Not captured,Not captured,01/13/2019,Not captured,Not captured,863949,020,00072,ARS-01-0047055,Beacon International,Not captured,Not captured,Not captured,,,,Coopersmith,Sarah ,,03/07/1998,female,Not captured,Not captured,Not captured,Not captured,Not captured,Not captured,Not captured,Not captured,Not captured,Not captured,Not captured,Not captured,Not captured,,,Not captured,Not captured,Not captured,Not captured,2086 e 22 st,,Brooklyn,New York,11229,3473028743,,Not captured,Not captured,Micoope@yahoo.com,Not captured,701927770,,Not captured,Not captured,Not captured,Not captured,Not captured,Not captured,
Not captured,Not captured,01/13/2019,Not captured,Not captured,863949,020,00072,ARS-01-0047054,Beacon International,Not captured,Not captured,Not captured,,,,Coopersmith,Robin,,05/11/1972,female,Not captured,Not captured,Not captured,Not captured,Not captured,Not captured,Not captured,Not captured,Not captured,Not captured,Not captured,Not captured,Not captured,,,Not captured,Not captured,Not captured,Not captured,2086 e 22 st,,Brooklyn,New York,11229,3473028743,,Not captured,Not captured,Micoope@yahoo.com,Not captured,701927769,,Not captured,Not captured,Not captured,Not captured,Not captured,Not captured,
Not captured,Not captured,01/13/2019,Not captured,Not captured,863949,020,00072,ARS-01-0047053,Beacon International,Not captured,Not captured,Not captured,,,,Coopersmith ,Mitchell ,,08/09/1970,male,Not captured,Not captured,Not captured,Not captured,Not captured,Not captured,Not captured,Not captured,Not captured,Not captured,Not captured,Not captured,Not captured,,,Not captured,Not captured,Not captured,Not captured,2086 e 22 st,,Brooklyn,New York,11229,3473028743,,Not captured,Not captured,Micoope@yahoo.com,Not captured,701927768,,Not captured,Not captured,Not captured,Not captured,Not captured,Not captured,
Not captured,Not captured,01/13/2019,Not captured,Not captured,863949,020,00072,ARS-01-0047051,Beacon International,Not captured,Not captured,Not captured,,,,Klingler,Robert,W,08/19/1957,male,Not captured,Not captured,Not captured,Not captured,Not captured,Not captured,Not captured,Not captured,Not captured,Not captured,Not captured,Not captured,Not captured,,,Not captured,Not captured,Not captured,Not captured,9744 W. Ontario Pl,,Littleton,Colorado,80128,,,Not captured,Not captured,klinglermr@gmail.com,Not captured,701927766,,Not captured,Not captured,Not captured,Not captured,Not captured,Not captured,
Not captured,Not captured,01/13/2019,Not captured,Not captured,863949,020,00072,ARS-01-0047050,Beacon International,Not captured,Not captured,Not captured,,,,Klingler,Marguerite,D,06/12/1957,female,Not captured,Not captured,Not captured,Not captured,Not captured,Not captured,Not captured,Not captured,Not captured,Not captured,Not captured,Not captured,Not captured,,,Not captured,Not captured,Not captured,Not captured,9744 W. Ontario Pl,,Littleton,Colorado,80128,,,Not captured,Not captured,klinglermr@gmail.com,Not captured,701927765,,Not captured,Not captured,Not captured,Not captured,Not captured,Not captured,
Not captured,Not captured,01/13/2019,Not captured,Not captured,863949,020,00072,ARS-01-0047048,Beacon International,Not captured,Not captured,Not captured,,,,Fujimoto,Yurie,,02/05/1991,female,Not captured,Not captured,Not captured,Not captured,Not captured,Not captured,Not captured,Not captured,Not captured,Not captured,Not captured,Not captured,Not captured,,,Not captured,Not captured,Not captured,Not captured,11711 Mayfield Ave. #2,,Los Angeles,California,90049,,,Not captured,Not captured,yurie.fujimoto@gmail.com,Not captured,701927763,,Not captured,Not captured,Not captured,Not captured,Not captured,Not captured,
Not captured,Not captured,01/13/2019,Not captured,Not captured,863949,020,00072,ARS-01-0047047,Beacon International,Not captured,Not captured,Not captured,,,,Fujimoto,Toshiko,,08/26/1961,female,Not captured,Not captured,Not captured,Not captured,Not captured,Not captured,Not captured,Not captured,Not captured,Not captured,Not captured,Not captured,Not captured,,,Not captured,Not captured,Not captured,Not captured,11711 Mayfield Ave. #2,,Los Angeles,California,90049,,,Not captured,Not captured,yurie.fujimoto@gmail.com,Not captured,701927762,,Not captured,Not captured,Not captured,Not captured,Not captured,Not captured,
Not captured,Not captured,01/13/2019,Not captured,Not captured,863949,020,00072,ARS-01-0047046,Beacon International,Not captured,Not captured,Not captured,,,,Holt,Lana,M,06/15/1968,female,Not captured,Not captured,Not captured,Not captured,Not captured,Not captured,Not captured,Not captured,Not captured,Not captured,Not captured,Not captured,Not captured,,,Not captured,Not captured,Not captured,Not captured,2222 E 31st street,,Des Moines,Iowa,50317,,,Not captured,Not captured,lanamholt@outlook.com,Not captured,701927761,,Not captured,Not captured,Not captured,Not captured,Not captured,Not captured,
Not captured,Not captured,01/13/2019,Not captured,Not captured,863949,020,00072,ARS-01-0047045,Beacon International,Not captured,Not captured,Not captured,,,,Bao,Xinge,,01/14/1978,female,Not captured,Not captured,Not captured,Not captured,Not captured,Not captured,Not captured,Not captured,Not captured,Not captured,Not captured,Not captured,Not captured,,,Not captured,Not captured,Not captured,Not captured,2F No.11 Chongshang St. Zuoying Dist.,,Kaohsiung City,,81367,,,Not captured,Not captured,bao7814@gmail.com,Not captured,701927760,,Not captured,Not captured,Not captured,Not captured,Not captured,Not captured,
Not captured,Not captured,01/12/2019,Not captured,Not captured,863949,020,00072,ARS-02-0047044,Beacon America,Not captured,Not captured,Not captured,,,,DIAO,NINA,,04/27/1942,female,Not captured,Not captured,Not captured,Not captured,Not captured,Not captured,Not captured,Not captured,Not captured,Not captured,Not captured,Not captured,Not captured,ECHO YILMAZ,DAUGHTER,Not captured,Not captured,Not captured,Not captured,16093 TAMARIND TER,,LOS ANGELES,,90015,9093250873,,Not captured,Not captured,echojyilmaz@hotmail.com,Not captured,701927759,,Not captured,Not captured,Not captured,Not captured,Not captured,Not captured,
Not captured,Not captured,01/13/2019,Not captured,Not captured,863949,020,00072,ARS-01-0047043,Beacon International,Not captured,Not captured,Not captured,,,,Smith,Luke,A,02/21/1996,male,Not captured,Not captured,Not captured,Not captured,Not captured,Not captured,Not captured,Not captured,Not captured,Not captured,Not captured,Not captured,Not captured,Joy Smith,Mother,Not captured,Not captured,Not captured,Not captured,5167 Poinsetta Ave,,Winter Park,Florida,32792,3216950281,,Not captured,Not captured,barb_micheals@wycliffe.org,Not captured,701927758,,Not captured,Not captured,Not captured,Not captured,Not captured,Not captured,
Not captured,Not captured,01/15/2019,Not captured,Not captured,863949,020,00072,OVI-28-0047042,OverseasCare Visitors Insurance Plan,Not captured,Not captured,Not captured,,,,Garg,Karori,Chand,11/01/1950,male,Not captured,Not captured,Not captured,Not captured,Not captured,Not captured,Not captured,Not captured,Not captured,Not captured,Not captured,Not captured,Not captured,Gaurav Garg,Son,Not captured,Not captured,Not captured,Not captured,197 Bel Ayre Dr,,Santa Clara,California,95050,4082424202,,Not captured,Not captured,mailerg@gmail.com,Not captured,701927757,,Not captured,Not captured,Not captured,Not captured,Not captured,Not captured,
Not captured,Not captured,01/12/2019,Not captured,Not captured,863949,020,00072,ARS-01-0047041,Beacon International,Not captured,Not captured,Not captured,,,,Hollis,Marie,,10/13/1981,female,Not captured,Not captured,Not captured,Not captured,Not captured,Not captured,Not captured,Not captured,Not captured,Not captured,Not captured,Not captured,Not captured,,,Not captured,Not captured,Not captured,Not captured,4011 lake street,,Greenville,Texas,75401,,,Not captured,Not captured,marie_hollis@yahoo.com,Not captured,701927756,,Not captured,Not captured,Not captured,Not captured,Not captured,Not captured,
Not captured,Not captured,01/12/2019,Not captured,Not captured,863949,020,00072,ARS-01-0047040,Beacon International,Not captured,Not captured,Not captured,,,,Avila,Ailleen,M,12/20/1954,female,Not captured,Not captured,Not captured,Not captured,Not captured,Not captured,Not captured,Not captured,Not captured,Not captured,Not captured,Not captured,Not captured,,,Not captured,Not captured,Not captured,Not captured,3005 Decker Field Ln.,,Pearland,Texas,77584,,,Not captured,Not captured,ragrillo@yahoo.com,Not captured,701927755,,Not captured,Not captured,Not captured,Not captured,Not captured,Not captured,