EE Transaction Type,Dependent Transaction Type,Effective Date,EE Signature,EE Signature Date,Control,Suffix,Account,Plan Number,Plan Name,Claim Office,Network ID Number,Customer Code,EE SSN,Dependent SSN,Dependent Relationship,Last Name,First Name,Middle Initial,DOB,Gender,Ethnicity,PCP/PCD,PCP/PCD Current Patient,Provider Cap Office Number,COB,Dep Student Indicator,Dep OOA Indicator,EE Prior Coverage Indicator,EE Late Entrant,EE Language Indicator,Hire Date,Earnings,Earnings Frequency,Beneficiary (Last Name First Name MI),Beneficiary Relationship,Continuation of Coverage Expiration Date,Continuation of Coverage Event Date,Continuation of Coverage Length of Coverage,Work Location Zip Code,Street Address Line 1,Street Address Line 2,City,State,Zip Code,Home Phone Number,Work Phone Number,Accept Code,Evidence Code,EE Email Address,Communication Disability Code,EE Alternate ID,Dep Alternate ID,Old Control,Old Suffix,Old Account,New Control,New Suffix,New Account,
Not captured,Not captured,12/05/2018,Not captured,Not captured,863949,020,00072,ARS-02-0046159,Beacon America,Not captured,Not captured,Not captured,Passport(1556592),,,GONZALEZ DE SANCHEZ,IRAIZA,,05/28/1940,female,Not captured,Not captured,Not captured,Not captured,Not captured,Not captured,Not captured,Not captured,Not captured,Not captured,Not captured,Not captured,Not captured,MARIA HORTENCIA SANCHEZ ,HIJA,Not captured,Not captured,Not captured,Not captured,14221 SW 120 ST. SUITE 127 MIAMI FL:33186,,miami,Florida,33186,3053785210,,Not captured,Not captured,MARIHORTS@GMAIL.COM,Not captured,701825976,,Not captured,Not captured,Not captured,Not captured,Not captured,Not captured,
Not captured,Not captured,12/05/2018,Not captured,Not captured,863949,020,00072,ARS-02-0046158,Beacon America,Not captured,Not captured,Not captured,,,,SANCHEZ DE RAVELO,IRAIZA JOSEFINA,,07/20/1965,female,Not captured,Not captured,Not captured,Not captured,Not captured,Not captured,Not captured,Not captured,Not captured,Not captured,Not captured,Not captured,Not captured,SIMON DAVID BRICENO SANCHEZ,HIJO,Not captured,Not captured,Not captured,Not captured,14221 SW 120th ST STE 127,,Miami,Florida,33186,3053785210,,Not captured,Not captured,MARIHORTS@GMAIL.COM,Not captured,701825975,,Not captured,Not captured,Not captured,Not captured,Not captured,Not captured,
Not captured,Not captured,12/05/2018,Not captured,Not captured,863949,020,00072,ARS-02-0046157,Beacon America,Not captured,Not captured,Not captured,Passport(11492961),,,SANCHEZ GONZALEZ,MARIA HORTENCIA,,11/10/1971,female,Not captured,Not captured,Not captured,Not captured,Not captured,Not captured,Not captured,Not captured,Not captured,Not captured,Not captured,Not captured,Not captured,SIMON DAVID BRICENO SANCHEZ,HIJO,Not captured,Not captured,Not captured,Not captured,14221 SW 120th ST STE 127,,Miami,Florida,33186,3053785210,,Not captured,Not captured,MARIHORTS@GMAIL.COM,Not captured,701825974,,Not captured,Not captured,Not captured,Not captured,Not captured,Not captured,
Not captured,Not captured,12/05/2018,Not captured,Not captured,863949,020,00072,ARS-01-0046153,Beacon International,Not captured,Not captured,Not captured,,,,Bennett,Crispin,,08/29/1964,male,Not captured,Not captured,Not captured,Not captured,Not captured,Not captured,Not captured,Not captured,Not captured,Not captured,Not captured,Not captured,Not captured,,,Not captured,Not captured,Not captured,Not captured,19386 Windward Cv,,Gulfport,Mississippi,39503,,,Not captured,Not captured,appraisal@mail.com,Not captured,701825970,,Not captured,Not captured,Not captured,Not captured,Not captured,Not captured,
Not captured,Not captured,12/05/2018,Not captured,Not captured,863949,020,00072,ARS-01-0046141,Beacon International,Not captured,Not captured,Not captured,,,,Pfister,Teresa,A,01/13/1993,female,Not captured,Not captured,Not captured,Not captured,Not captured,Not captured,Not captured,Not captured,Not captured,Not captured,Not captured,Not captured,Not captured,,,Not captured,Not captured,Not captured,Not captured,2274 JOHANNA COURT,,PINOLE,California,94564,,,Not captured,Not captured,pfistertess@gmail.com,Not captured,701825958,,Not captured,Not captured,Not captured,Not captured,Not captured,Not captured,
Not captured,Not captured,12/05/2018,Not captured,Not captured,863949,020,00072,ARS-01-0046140,Beacon International,Not captured,Not captured,Not captured,,,,Bevilacqua,Mary,M,01/12/1990,female,Not captured,Not captured,Not captured,Not captured,Not captured,Not captured,Not captured,Not captured,Not captured,Not captured,Not captured,Not captured,Not captured,,,Not captured,Not captured,Not captured,Not captured,5383 Westridge Dr,,Boulder,Colorado,80301-6502,,,Not captured,Not captured,mary.bevilacqua1@gmail.com,Not captured,701825957,,Not captured,Not captured,Not captured,Not captured,Not captured,Not captured,
Not captured,Not captured,12/04/2018,Not captured,Not captured,863949,020,00072,ARS-01-0046137,Beacon International,Not captured,Not captured,Not captured,,,,Woo,Vincent,,01/20/1984,male,Not captured,Not captured,Not captured,Not captured,Not captured,Not captured,Not captured,Not captured,Not captured,Not captured,Not captured,Not captured,Not captured,,,Not captured,Not captured,Not captured,Not captured,180 Wonderview Dr.,,Glendale,California,91202,,,Not captured,Not captured,vincewoo@gmail.com,Not captured,701825953,,Not captured,Not captured,Not captured,Not captured,Not captured,Not captured,
Not captured,Not captured,12/04/2018,Not captured,Not captured,863949,020,00072,OVI-28-0046125,OverseasCare Visitors Insurance Plan,Not captured,Not captured,Not captured,Passport(N6142765),,,Paluskar,Archana,V,02/11/1948,female,Not captured,Not captured,Not captured,Not captured,Not captured,Not captured,Not captured,Not captured,Not captured,Not captured,Not captured,Not captured,Not captured,,,Not captured,Not captured,Not captured,Not captured,5196 Salerno Drive,,Dublin,California,94568,4087386641,,Not captured,Not captured,aditivp@gmail.com,Not captured,701825930,,Not captured,Not captured,Not captured,Not captured,Not captured,Not captured,
Not captured,Not captured,12/04/2018,Not captured,Not captured,863949,020,00072,OVI-28-0046124,OverseasCare Visitors Insurance Plan,Not captured,Not captured,Not captured,Passport(N6142765),,,Paluskar,Vasant,D,01/16/1947,male,Not captured,Not captured,Not captured,Not captured,Not captured,Not captured,Not captured,Not captured,Not captured,Not captured,Not captured,Not captured,Not captured,,,Not captured,Not captured,Not captured,Not captured,5196 Salerno Drive,,Dublin,California,94568,4087386641,,Not captured,Not captured,aditivp@gmail.com,Not captured,701825929,,Not captured,Not captured,Not captured,Not captured,Not captured,Not captured,
Not captured,Not captured,12/05/2018,Not captured,Not captured,863949,020,00072,ARS-01-0046120,Beacon International,Not captured,Not captured,Not captured,,,,LABASTIDA,CRUZ,,03/21/1960,female,Not captured,Not captured,Not captured,Not captured,Not captured,Not captured,Not captured,Not captured,Not captured,Not captured,Not captured,Not captured,Not captured,Paula M.Labastida,Daughter,Not captured,Not captured,Not captured,Not captured,3821 Pratt Ave.,,Bronx,New York,10466,917-312 0126,,Not captured,Not captured,hlabastida@aol.com,Not captured,701825925,,Not captured,Not captured,Not captured,Not captured,Not captured,Not captured,
Not captured,Not captured,12/05/2018,Not captured,Not captured,863949,020,00072,ARS-01-0046119,Beacon International,Not captured,Not captured,Not captured,Passport(53238794),,,LABASTIDA,HAROLD,,05/17/1955,male,Not captured,Not captured,Not captured,Not captured,Not captured,Not captured,Not captured,Not captured,Not captured,Not captured,Not captured,Not captured,Not captured,Paula M.Labastida,Daughter,Not captured,Not captured,Not captured,Not captured,3821 Pratt Ave.,,Bronx,New York,10466,917-312 0126,,Not captured,Not captured,hlabastida@aol.com,Not captured,701825924,,Not captured,Not captured,Not captured,Not captured,Not captured,Not captured,
Not captured,Not captured,12/04/2018,Not captured,Not captured,863949,020,00072,ARS-01-0046117,Beacon International,Not captured,Not captured,Not captured,,,,Montenegro,Manuel,T,09/03/1955,male,Not captured,Not captured,Not captured,Not captured,Not captured,Not captured,Not captured,Not captured,Not captured,Not captured,Not captured,Not captured,Not captured,,,Not captured,Not captured,Not captured,Not captured,19305 40th ave W,,Lynnwood,Washington,98036,,,Not captured,Not captured,m_montenegro_s@hotmail.com,Not captured,701825922,,Not captured,Not captured,Not captured,Not captured,Not captured,Not captured,
Not captured,Not captured,12/04/2018,Not captured,Not captured,863949,020,00072,ARS-01-0046116,Beacon International,Not captured,Not captured,Not captured,Passport(C4JTCHCLL),,,Ruppin,Eytan,,07/18/1956,male,Not captured,Not captured,Not captured,Not captured,Not captured,Not captured,Not captured,Not captured,Not captured,Not captured,Not captured,Not captured,Not captured,Naomi Gal-Ruppin,Spouse,Not captured,Not captured,Not captured,Not captured,11022 Marcliff Rd,,Rockville,,20852,13019574052,,Not captured,Not captured,eyruppin@gmail.com,Not captured,701825921,,Not captured,Not captured,Not captured,Not captured,Not captured,Not captured,
Not captured,Not captured,12/04/2018,Not captured,Not captured,863949,020,00072,ARS-01-0046115,Beacon International,Not captured,Not captured,Not captured,,,,Service,John,T,09/16/1980,male,Not captured,Not captured,Not captured,Not captured,Not captured,Not captured,Not captured,Not captured,Not captured,Not captured,Not captured,Not captured,Not captured,,,Not captured,Not captured,Not captured,Not captured,2116 Skyline Blvd,,Daly City,California,94015,,,Not captured,Not captured,jrourkeb@hotmail.com,Not captured,701825916,,Not captured,Not captured,Not captured,Not captured,Not captured,Not captured,
Not captured,Not captured,12/04/2018,Not captured,Not captured,863949,020,00072,ARS-01-0046114,Beacon International,Not captured,Not captured,Not captured,,,,Benson,Joseph,R,09/01/1981,male,Not captured,Not captured,Not captured,Not captured,Not captured,Not captured,Not captured,Not captured,Not captured,Not captured,Not captured,Not captured,Not captured,,,Not captured,Not captured,Not captured,Not captured,2116 Skyline Blvd,,Daly City,California,94015,,,Not captured,Not captured,jrourkeb@hotmail.com,Not captured,701825915,,Not captured,Not captured,Not captured,Not captured,Not captured,Not captured,
Not captured,Not captured,12/03/2018,Not captured,Not captured,863949,020,00072,ARS-02-0046113,Beacon America,Not captured,Not captured,Not captured,,,,Diao,Nina,,04/27/1942,female,Not captured,Not captured,Not captured,Not captured,Not captured,Not captured,Not captured,Not captured,Not captured,Not captured,Not captured,Not captured,Not captured,Echo Yilmaz,Daughter,Not captured,Not captured,Not captured,Not captured,16093 tamarind terrace,,Chino hills,,91709,9093250873,,Not captured,Not captured,echojyilmaz@hotmail.com,Not captured,701825914,,Not captured,Not captured,Not captured,Not captured,Not captured,Not captured,
Not captured,Not captured,12/03/2018,Not captured,Not captured,863949,020,00072,ARS-01-0046106,Beacon International,Not captured,Not captured,Not captured,,,,Nguyen,Thuong,,08/20/1978,female,Not captured,Not captured,Not captured,Not captured,Not captured,Not captured,Not captured,Not captured,Not captured,Not captured,Not captured,Not captured,Not captured,,,Not captured,Not captured,Not captured,Not captured,113 East 93rd St.,,Cutoff,Louisiana,70345,,,Not captured,Not captured,ptbnguyen78@gmail.com,Not captured,701825894,,Not captured,Not captured,Not captured,Not captured,Not captured,Not captured,
Not captured,Not captured,12/03/2018,Not captured,Not captured,863949,020,00072,ARS-01-0046105,Beacon International,Not captured,Not captured,Not captured,,,,Vu,Hoat,,10/09/1960,male,Not captured,Not captured,Not captured,Not captured,Not captured,Not captured,Not captured,Not captured,Not captured,Not captured,Not captured,Not captured,Not captured,,,Not captured,Not captured,Not captured,Not captured,113 East 93rd St.,,Cutoff,Louisiana,70345,,,Not captured,Not captured,ptbnguyen78@gmail.com,Not captured,701825893,,Not captured,Not captured,Not captured,Not captured,Not captured,Not captured,
Not captured,Not captured,12/03/2018,Not captured,Not captured,863949,020,00072,ARS-01-0046104,Beacon International,Not captured,Not captured,Not captured,,,,Gerstel,Barbara,,03/17/1946,female,Not captured,Not captured,Not captured,Not captured,Not captured,Not captured,Not captured,Not captured,Not captured,Not captured,Not captured,Not captured,Not captured,,,Not captured,Not captured,Not captured,Not captured,PO BOX 2402,,Rancho Santa Fe,California,92067,,,Not captured,Not captured,dilbertdufus@aol.com,Not captured,701825892,,Not captured,Not captured,Not captured,Not captured,Not captured,Not captured,
Not captured,Not captured,12/03/2018,Not captured,Not captured,863949,020,00072,ARS-01-0046103,Beacon International,Not captured,Not captured,Not captured,,,,Gerstel,Bryan,,09/29/1944,male,Not captured,Not captured,Not captured,Not captured,Not captured,Not captured,Not captured,Not captured,Not captured,Not captured,Not captured,Not captured,Not captured,,,Not captured,Not captured,Not captured,Not captured,PO BOX 2402,,Rancho Santa Fe,California,92067,,,Not captured,Not captured,dilbertdufus@aol.com,Not captured,701825891,,Not captured,Not captured,Not captured,Not captured,Not captured,Not captured,
Not captured,Not captured,12/03/2018,Not captured,Not captured,863949,020,00072,ARS-01-0046102,Beacon International,Not captured,Not captured,Not captured,,,,Dorsey,Lyssa,A,09/25/1992,female,Not captured,Not captured,Not captured,Not captured,Not captured,Not captured,Not captured,Not captured,Not captured,Not captured,Not captured,Not captured,Not captured,,,Not captured,Not captured,Not captured,Not captured,6150 Alma Rd Apt 2217,,Mckinney,Texas,75070,,,Not captured,Not captured,lyssadorsey@gmail.com,Not captured,701825876,,Not captured,Not captured,Not captured,Not captured,Not captured,Not captured,
Not captured,Not captured,12/02/2018,Not captured,Not captured,863949,020,00072,ARS-04-0045685,Enhanced America,Not captured,Not captured,Not captured,Passport(491992596),,,SpandlerDavison,Brandy,Nelson,06/18/1983,female,Not captured,Not captured,Not captured,Not captured,Not captured,Not captured,Not captured,Not captured,Not captured,Not captured,Not captured,Not captured,Not captured,,,Not captured,Not captured,Not captured,Not captured,210 Templin Ave,,Bardstown,Kentucky,40004,5022751225,,Not captured,Not captured,spandlerdavison@gmail.com,Not captured,701825073,,Not captured,Not captured,Not captured,Not captured,Not captured,Not captured,
Not captured,Not captured,12/02/2018,Not captured,Not captured,863949,020,00072,ARS-04-0045685,Enhanced America,Not captured,Not captured,Not captured,,Passport(538845975),Spouse,SpandlerDavison,Daniel,Philip,11/12/1979,male,Not captured,Not captured,Not captured,Not captured,Not captured,Not captured,Not captured,Not captured,Not captured,Not captured,Not captured,Not captured,Not captured,,,Not captured,Not captured,Not captured,Not captured,210 Templin Ave,,Bardstown,Kentucky,40004,5022751225,,Not captured,Not captured,spandlerdavison@gmail.com,Not captured,,701825074,Not captured,Not captured,Not captured,Not captured,Not captured,Not captured,
Not captured,Not captured,12/02/2018,Not captured,Not captured,863949,020,00072,ARS-04-0045685,Enhanced America,Not captured,Not captured,Not captured,,Passport(488099267),Dependant,SpandlerDavison,Timothy ,Edward,10/06/2014,male,Not captured,Not captured,Not captured,Not captured,Not captured,Not captured,Not captured,Not captured,Not captured,Not captured,Not captured,Not captured,Not captured,,,Not captured,Not captured,Not captured,Not captured,210 Templin Ave,,Bardstown,Kentucky,40004,5022751225,,Not captured,Not captured,spandlerdavison@gmail.com,Not captured,,701825075,Not captured,Not captured,Not captured,Not captured,Not captured,Not captured,
Not captured,Not captured,12/02/2018,Not captured,Not captured,863949,020,00072,ARS-04-0045685,Enhanced America,Not captured,Not captured,Not captured,,Passport(546098637),Dependant,SpandlerDavison,Jonathan ,Daniel,07/25/2016,male,Not captured,Not captured,Not captured,Not captured,Not captured,Not captured,Not captured,Not captured,Not captured,Not captured,Not captured,Not captured,Not captured,,,Not captured,Not captured,Not captured,Not captured,210 Templin Ave,,Bardstown,Kentucky,40004,5022751225,,Not captured,Not captured,spandlerdavison@gmail.com,Not captured,,701825076,Not captured,Not captured,Not captured,Not captured,Not captured,Not captured,
Not captured,Not captured,12/02/2018,Not captured,Not captured,863949,020,00072,ARS-04-0045685,Enhanced America,Not captured,Not captured,Not captured,,Passport(642438001),Dependant,SpandlerDavison,Isaac,Bjorn,09/27/2018,male,Not captured,Not captured,Not captured,Not captured,Not captured,Not captured,Not captured,Not captured,Not captured,Not captured,Not captured,Not captured,Not captured,,,Not captured,Not captured,Not captured,Not captured,210 Templin Ave,,Bardstown,Kentucky,40004,5022751225,,Not captured,Not captured,spandlerdavison@gmail.com,Not captured,,701825077,Not captured,Not captured,Not captured,Not captured,Not captured,Not captured,
Not captured,Not captured,12/04/2018,Not captured,Not captured,863949,020,00072,ARS-01-0046101,Beacon International,Not captured,Not captured,Not captured,,,,MITERMAJER,DARKO,,12/03/1970,male,Not captured,Not captured,Not captured,Not captured,Not captured,Not captured,Not captured,Not captured,Not captured,Not captured,Not captured,Not captured,Not captured,,,Not captured,Not captured,Not captured,Not captured,MUFTIJE DZABICA 5,,Sarajevo,,71000,,,Not captured,Not captured,mittermayer1@yahoo.com,Not captured,701825875,,Not captured,Not captured,Not captured,Not captured,Not captured,Not captured,
Not captured,Not captured,12/03/2018,Not captured,Not captured,863949,020,00072,ARS-02-0046100,Beacon America,Not captured,Not captured,Not captured,,,,McKenzie,Ian,,03/20/1949,male,Not captured,Not captured,Not captured,Not captured,Not captured,Not captured,Not captured,Not captured,Not captured,Not captured,Not captured,Not captured,Not captured,,,Not captured,Not captured,Not captured,Not captured,22 Hanover Road Street 1807,,L6S5K7 - Brampton,Ontario,L6S5K7 ,3523553661,,Not captured,Not captured,ianmac4@hotmail.com,Not captured,701825874,,Not captured,Not captured,Not captured,Not captured,Not captured,Not captured,
Not captured,Not captured,12/03/2018,Not captured,Not captured,863949,020,00072,ARS-02-0046099,Beacon America,Not captured,Not captured,Not captured,,,,FRISCIONI,OLGA,,05/05/1963,female,Not captured,Not captured,Not captured,Not captured,Not captured,Not captured,Not captured,Not captured,Not captured,Not captured,Not captured,Not captured,Not captured,Olga Friscioni,ESPOSA,Not captured,Not captured,Not captured,Not captured,URB. PALMA REAL AV. LOS JABILLOS CONJ. RESD. LOMAS DEL SOL TH # 2,,MATURIN,Monagas,6201,+584148132145,,Not captured,Not captured,drozluis@gmail.com,Not captured,701825873,,Not captured,Not captured,Not captured,Not captured,Not captured,Not captured,
Not captured,Not captured,12/03/2018,Not captured,Not captured,863949,020,00072,ARS-02-0046098,Beacon America,Not captured,Not captured,Not captured,Passport(144464825),,,DROZ,LUIS,,08/03/1960,male,Not captured,Not captured,Not captured,Not captured,Not captured,Not captured,Not captured,Not captured,Not captured,Not captured,Not captured,Not captured,Not captured,Olga Friscioni,ESPOSA,Not captured,Not captured,Not captured,Not captured,URB. PALMA REAL AV. LOS JABILLOS CONJ. RESD. LOMAS DEL SOL TH # 2,,MATURIN,Monagas,6201,+584148132145,,Not captured,Not captured,drozluis@gmail.com,Not captured,701825872,,Not captured,Not captured,Not captured,Not captured,Not captured,Not captured,
Not captured,Not captured,12/03/2018,Not captured,Not captured,863949,020,00072,ARS-01-0046097,Beacon International,Not captured,Not captured,Not captured,,,,Graham,Jennifer,E,06/02/1973,female,Not captured,Not captured,Not captured,Not captured,Not captured,Not captured,Not captured,Not captured,Not captured,Not captured,Not captured,Not captured,Not captured,,,Not captured,Not captured,Not captured,Not captured,5436 West Lake Rd,,Conesus,New York,14435,,,Not captured,Not captured,jen6graham6@gmail.com,Not captured,701825871,,Not captured,Not captured,Not captured,Not captured,Not captured,Not captured,
Not captured,Not captured,12/03/2018,Not captured,Not captured,863949,020,00072,ARS-01-0046096,Beacon International,Not captured,Not captured,Not captured,,,,Baker,David,J,03/09/1970,male,Not captured,Not captured,Not captured,Not captured,Not captured,Not captured,Not captured,Not captured,Not captured,Not captured,Not captured,Not captured,Not captured,,,Not captured,Not captured,Not captured,Not captured,5436 West Lake Rd,,Conesus,New York,14435,,,Not captured,Not captured,jen6graham6@gmail.com,Not captured,701825870,,Not captured,Not captured,Not captured,Not captured,Not captured,Not captured,
Not captured,Not captured,12/03/2018,Not captured,Not captured,863949,020,00072,ARS-01-0046095,Beacon International,Not captured,Not captured,Not captured,,,,H&oslash;gvik,Martin,,06/21/1991,male,Not captured,Not captured,Not captured,Not captured,Not captured,Not captured,Not captured,Not captured,Not captured,Not captured,Not captured,Not captured,Not captured,,,Not captured,Not captured,Not captured,Not captured,R&oslash;sslyngveien 1,,Vear,,3173,,,Not captured,Not captured,martin.hogvik@gmail.com,Not captured,701825869,,Not captured,Not captured,Not captured,Not captured,Not captured,Not captured,
Not captured,Not captured,12/02/2018,Not captured,Not captured,863949,020,00072,ARS-01-0046093,Beacon International,Not captured,Not captured,Not captured,,,,Dang,Thanh,H,10/04/1952,male,Not captured,Not captured,Not captured,Not captured,Not captured,Not captured,Not captured,Not captured,Not captured,Not captured,Not captured,Not captured,Not captured,,,Not captured,Not captured,Not captured,Not captured,14534 Old Creek Road,,San Diego,California,92131,,,Not captured,Not captured,tddang14534@gmail.com,Not captured,701825867,,Not captured,Not captured,Not captured,Not captured,Not captured,Not captured,
Not captured,Not captured,12/02/2018,Not captured,Not captured,863949,020,00072,OVI-28-0046090,OverseasCare Visitors Insurance Plan,Not captured,Not captured,Not captured,,,,Chattopadhyay,Madhumita,,06/24/1956,male,Not captured,Not captured,Not captured,Not captured,Not captured,Not captured,Not captured,Not captured,Not captured,Not captured,Not captured,Not captured,Not captured,,,Not captured,Not captured,Not captured,Not captured,34 Maple Street,,Chatham,New Jersey,07928,2018397152,,Not captured,Not captured,madhumita.sukanya@gmail.com,Not captured,701825864,,Not captured,Not captured,Not captured,Not captured,Not captured,Not captured,
Not captured,Not captured,12/02/2018,Not captured,Not captured,863949,020,00072,OVI-28-0046089,OverseasCare Visitors Insurance Plan,Not captured,Not captured,Not captured,,,,Chattopadhyay,Prabir Kumar ,,05/08/1951,male,Not captured,Not captured,Not captured,Not captured,Not captured,Not captured,Not captured,Not captured,Not captured,Not captured,Not captured,Not captured,Not captured,,,Not captured,Not captured,Not captured,Not captured,34 Maple Street,,Chatham,New Jersey,07928,2018397152,,Not captured,Not captured,madhumita.sukanya@gmail.com,Not captured,701825863,,Not captured,Not captured,Not captured,Not captured,Not captured,Not captured,