EE Transaction Type,Dependent Transaction Type,Effective Date,EE Signature,EE Signature Date,Control,Suffix,Account,Plan Number,Plan Name,Claim Office,Network ID Number,Customer Code,EE SSN,Dependent SSN,Dependent Relationship,Last Name,First Name,Middle Initial,DOB,Gender,Ethnicity,PCP/PCD,PCP/PCD Current Patient,Provider Cap Office Number,COB,Dep Student Indicator,Dep OOA Indicator,EE Prior Coverage Indicator,EE Late Entrant,EE Language Indicator,Hire Date,Earnings,Earnings Frequency,Beneficiary (Last Name First Name MI),Beneficiary Relationship,Continuation of Coverage Expiration Date,Continuation of Coverage Event Date,Continuation of Coverage Length of Coverage,Work Location Zip Code,Street Address Line 1,Street Address Line 2,City,State,Zip Code,Home Phone Number,Work Phone Number,Accept Code,Evidence Code,EE Email Address,Communication Disability Code,EE Alternate ID,Dep Alternate ID,Old Control,Old Suffix,Old Account,New Control,New Suffix,New Account,
Not captured,Not captured,11/07/2018,Not captured,Not captured,863949,020,00072,ARS-03-0045501,Essential America,Not captured,Not captured,Not captured,Passport(000000000),,,Courtwright,Benjamin,,10/08/2018,male,Not captured,Not captured,Not captured,Not captured,Not captured,Not captured,Not captured,Not captured,Not captured,Not captured,Not captured,Not captured,Not captured,,,Not captured,Not captured,Not captured,Not captured,45 NE HWY E,,Warrensburg,Montana,64093,3344445566,,Not captured,Not captured,service@azimuthrisk.com,Not captured,701824782,,Not captured,Not captured,Not captured,Not captured,Not captured,Not captured,
Not captured,Not captured,11/10/2018,Not captured,Not captured,863949,020,00072,ARS-01-0045638,Beacon International,Not captured,Not captured,Not captured,,,,Mason,Taylor,,03/08/1992,male,Not captured,Not captured,Not captured,Not captured,Not captured,Not captured,Not captured,Not captured,Not captured,Not captured,Not captured,Not captured,Not captured,,,Not captured,Not captured,Not captured,Not captured,1567 Humbdolt Ave,,West St Paul,Minnesota,55118,,,Not captured,Not captured,Taylormmason@gmail.com,Not captured,701824994,,Not captured,Not captured,Not captured,Not captured,Not captured,Not captured,
Not captured,Not captured,11/10/2018,Not captured,Not captured,863949,020,00072,ARS-01-0045637,Beacon International,Not captured,Not captured,Not captured,,,,Mak,Hiu Fai,,01/11/1992,male,Not captured,Not captured,Not captured,Not captured,Not captured,Not captured,Not captured,Not captured,Not captured,Not captured,Not captured,Not captured,Not captured,,,Not captured,Not captured,Not captured,Not captured,5454 S Shore Dr APT 1308,,Chicago,Illinois,60615,,,Not captured,Not captured,makhfjohn@hotmail.com,Not captured,701824993,,Not captured,Not captured,Not captured,Not captured,Not captured,Not captured,
Not captured,Not captured,11/10/2018,Not captured,Not captured,863949,020,00072,ARS-01-0045633,Beacon International,Not captured,Not captured,Not captured,,,,Twombly,Emma,J,03/19/2013,female,Not captured,Not captured,Not captured,Not captured,Not captured,Not captured,Not captured,Not captured,Not captured,Not captured,Not captured,Not captured,Not captured,,,Not captured,Not captured,Not captured,Not captured,600 Edelen Station Pl Apt 401,,La Plata,Maryland,20646,,,Not captured,Not captured,drtwombly@gmail.com,Not captured,701824989,,Not captured,Not captured,Not captured,Not captured,Not captured,Not captured,
Not captured,Not captured,11/10/2018,Not captured,Not captured,863949,020,00072,ARS-01-0045632,Beacon International,Not captured,Not captured,Not captured,,,,Twombly,Jennifer,H,04/17/1979,female,Not captured,Not captured,Not captured,Not captured,Not captured,Not captured,Not captured,Not captured,Not captured,Not captured,Not captured,Not captured,Not captured,,,Not captured,Not captured,Not captured,Not captured,600 Edelen Station Pl Apt 401,,La Plata,Maryland,20646,,,Not captured,Not captured,drtwombly@gmail.com,Not captured,701824988,,Not captured,Not captured,Not captured,Not captured,Not captured,Not captured,
Not captured,Not captured,11/10/2018,Not captured,Not captured,863949,020,00072,ARS-01-0045631,Beacon International,Not captured,Not captured,Not captured,,,,Twombly,Daniel,R,05/29/1980,male,Not captured,Not captured,Not captured,Not captured,Not captured,Not captured,Not captured,Not captured,Not captured,Not captured,Not captured,Not captured,Not captured,,,Not captured,Not captured,Not captured,Not captured,600 Edelen Station Pl Apt 401,,La Plata,Maryland,20646,,,Not captured,Not captured,drtwombly@gmail.com,Not captured,701824987,,Not captured,Not captured,Not captured,Not captured,Not captured,Not captured,
Not captured,Not captured,11/10/2018,Not captured,Not captured,863949,020,00072,ARS-02-0045630,Beacon America,Not captured,Not captured,Not captured,Passport(RL3214842),,,AFIOUNI,OMAYMA,,08/28/1963,female,Not captured,Not captured,Not captured,Not captured,Not captured,Not captured,Not captured,Not captured,Not captured,Not captured,Not captured,Not captured,Not captured,IRA TAJGARDOON,SON-IN-LAW,Not captured,Not captured,Not captured,Not captured,18007 HARBOUR BRIDGE POINT DR,,CYPRESS,TX,77429,2817985140,,Not captured,Not captured,IRA1031@AOL.COM,Not captured,701824986,,Not captured,Not captured,Not captured,Not captured,Not captured,Not captured,
Not captured,Not captured,11/10/2018,Not captured,Not captured,863949,020,00072,ARS-01-0045629,Beacon International,Not captured,Not captured,Not captured,,,,Sharvit,Almog,,09/17/1992,male,Not captured,Not captured,Not captured,Not captured,Not captured,Not captured,Not captured,Not captured,Not captured,Not captured,Not captured,Not captured,Not captured,,,Not captured,Not captured,Not captured,Not captured,132 17th St,,Brooklyn,New York,11215,,,Not captured,Not captured,almog49@gmail.com,Not captured,701824985,,Not captured,Not captured,Not captured,Not captured,Not captured,Not captured,
Not captured,Not captured,11/10/2018,Not captured,Not captured,863949,020,00072,ARS-01-0045626,Beacon International,Not captured,Not captured,Not captured,,,,Mihaly,Samuel,A,09/28/2017,male,Not captured,Not captured,Not captured,Not captured,Not captured,Not captured,Not captured,Not captured,Not captured,Not captured,Not captured,Not captured,Not captured,,,Not captured,Not captured,Not captured,Not captured,20 Newport parkway,,Jersey City,New Jersey,07310,,,Not captured,Not captured,globalveggie@gmail.com,Not captured,701824982,,Not captured,Not captured,Not captured,Not captured,Not captured,Not captured,
Not captured,Not captured,11/10/2018,Not captured,Not captured,863949,020,00072,ARS-01-0045625,Beacon International,Not captured,Not captured,Not captured,,,,Kis,Viktoria,,11/29/1984,female,Not captured,Not captured,Not captured,Not captured,Not captured,Not captured,Not captured,Not captured,Not captured,Not captured,Not captured,Not captured,Not captured,,,Not captured,Not captured,Not captured,Not captured,20 Newport parkway,,Jersey City,New Jersey,07310,,,Not captured,Not captured,globalveggie@gmail.com,Not captured,701824981,,Not captured,Not captured,Not captured,Not captured,Not captured,Not captured,
Not captured,Not captured,11/10/2018,Not captured,Not captured,863949,020,00072,ARS-01-0045624,Beacon International,Not captured,Not captured,Not captured,,,,Mihaly,Attila,,04/28/1980,male,Not captured,Not captured,Not captured,Not captured,Not captured,Not captured,Not captured,Not captured,Not captured,Not captured,Not captured,Not captured,Not captured,,,Not captured,Not captured,Not captured,Not captured,20 Newport parkway,,Jersey City,New Jersey,07310,,,Not captured,Not captured,globalveggie@gmail.com,Not captured,701824980,,Not captured,Not captured,Not captured,Not captured,Not captured,Not captured,
Not captured,Not captured,11/10/2018,Not captured,Not captured,863949,020,00072,ARS-01-0045622,Beacon International,Not captured,Not captured,Not captured,,,,Taddiken,Juliet,,05/26/2000,female,Not captured,Not captured,Not captured,Not captured,Not captured,Not captured,Not captured,Not captured,Not captured,Not captured,Not captured,Not captured,Not captured,,,Not captured,Not captured,Not captured,Not captured,1670 S Cherryvale Rd,,Boulder,Colorado,80303,,,Not captured,Not captured,juliettaddiken@gmail.com,Not captured,701824978,,Not captured,Not captured,Not captured,Not captured,Not captured,Not captured,
Not captured,Not captured,11/10/2018,Not captured,Not captured,863949,020,00072,ARS-01-0045621,Beacon International,Not captured,Not captured,Not captured,Passport(AE903731),,,Mcintosh,Hermie,,05/07/1954,female,Not captured,Not captured,Not captured,Not captured,Not captured,Not captured,Not captured,Not captured,Not captured,Not captured,Not captured,Not captured,Not captured,Christina Gayle,Daughter,Not captured,Not captured,Not captured,Not captured,225 Lancaster St. E,,Kitchener,Ontario,N2H1N5,(+1)5198805799,,Not captured,Not captured,spinoro@gmail.com,Not captured,701824977,,Not captured,Not captured,Not captured,Not captured,Not captured,Not captured,
Not captured,Not captured,11/10/2018,Not captured,Not captured,863949,020,00072,ARS-02-0045619,Beacon America,Not captured,Not captured,Not captured,,,,macintyre,terry,,02/24/1972,male,Not captured,Not captured,Not captured,Not captured,Not captured,Not captured,Not captured,Not captured,Not captured,Not captured,Not captured,Not captured,Not captured,,,Not captured,Not captured,Not captured,Not captured,6800 Vista Del Norte,,Albuquerque,New Mexico,87113,,,Not captured,Not captured,terry.macintyre@gmail.com,Not captured,701824974,,Not captured,Not captured,Not captured,Not captured,Not captured,Not captured,
Not captured,Not captured,11/09/2018,Not captured,Not captured,863949,020,00072,ARS-01-0045618,Beacon International,Not captured,Not captured,Not captured,,,,Escobar,Juan,G,03/12/1983,male,Not captured,Not captured,Not captured,Not captured,Not captured,Not captured,Not captured,Not captured,Not captured,Not captured,Not captured,Not captured,Not captured,,,Not captured,Not captured,Not captured,Not captured,6606 Green River Drive,,Highlands Ranch,Colorado,80130,,,Not captured,Not captured,juanescobar312@gmail.com,Not captured,701824973,,Not captured,Not captured,Not captured,Not captured,Not captured,Not captured,
Not captured,Not captured,11/09/2018,Not captured,Not captured,863949,020,00072,ARS-02-0045617,Beacon America,Not captured,Not captured,Not captured,,,,Dimaio,Anita,,04/30/1968,female,Not captured,Not captured,Not captured,Not captured,Not captured,Not captured,Not captured,Not captured,Not captured,Not captured,Not captured,Not captured,Not captured,,,Not captured,Not captured,Not captured,Not captured,#4 245 Ontario street,,Victoria,British Columbia,V8v 1n1,,,Not captured,Not captured,anita_dimaio@yahoo.com,Not captured,701824972,,Not captured,Not captured,Not captured,Not captured,Not captured,Not captured,
Not captured,Not captured,11/09/2018,Not captured,Not captured,863949,020,00072,ARS-01-0045616,Beacon International,Not captured,Not captured,Not captured,,,,Duren,Gonul,,07/27/1993,female,Not captured,Not captured,Not captured,Not captured,Not captured,Not captured,Not captured,Not captured,Not captured,Not captured,Not captured,Not captured,Not captured,,,Not captured,Not captured,Not captured,Not captured,201 S Olive Ave Apt F,,Alhambra,California,91801,,,Not captured,Not captured,gonulduren@gmail.com,Not captured,701824971,,Not captured,Not captured,Not captured,Not captured,Not captured,Not captured,
Not captured,Not captured,11/09/2018,Not captured,Not captured,863949,020,00072,ARS-01-0045615,Beacon International,Not captured,Not captured,Not captured,,,,Freeman,Jason,D,11/06/1989,male,Not captured,Not captured,Not captured,Not captured,Not captured,Not captured,Not captured,Not captured,Not captured,Not captured,Not captured,Not captured,Not captured,,,Not captured,Not captured,Not captured,Not captured,709 Barton Run Blvd,,Marlton,New Jersey,08053,,,Not captured,Not captured,frejas@sas.upenn.edu,Not captured,701824970,,Not captured,Not captured,Not captured,Not captured,Not captured,Not captured,
Not captured,Not captured,11/09/2018,Not captured,Not captured,863949,020,00072,ARS-01-0045614,Beacon International,Not captured,Not captured,Not captured,,,,Rosten,David,,07/28/1953,male,Not captured,Not captured,Not captured,Not captured,Not captured,Not captured,Not captured,Not captured,Not captured,Not captured,Not captured,Not captured,Not captured,,,Not captured,Not captured,Not captured,Not captured,David Rosten,,Newport Beach,California,92660,,,Not captured,Not captured,db.rosten@gmail.com,Not captured,701824969,,Not captured,Not captured,Not captured,Not captured,Not captured,Not captured,
Not captured,Not captured,11/09/2018,Not captured,Not captured,863949,020,00072,ARS-03-0045497,Essential America,Not captured,Not captured,Not captured,Passport(642431798),,,Perryman,Adam,Todd,11/11/1977,male,Not captured,Not captured,Not captured,Not captured,Not captured,Not captured,Not captured,Not captured,Not captured,Not captured,Not captured,Not captured,Not captured,,,Not captured,Not captured,Not captured,Not captured,12424 E 90th St N,,Owasso,Oklahoma,74055,9182726551,,Not captured,Not captured,Adam@luketministries.com,Not captured,701824775,,Not captured,Not captured,Not captured,Not captured,Not captured,Not captured,
Not captured,Not captured,11/09/2018,Not captured,Not captured,863949,020,00072,ARS-03-0045497,Essential America,Not captured,Not captured,Not captured,,Passport(642431797),Spouse,Perryman,Natasha,Hope,10/27/1978,female,Not captured,Not captured,Not captured,Not captured,Not captured,Not captured,Not captured,Not captured,Not captured,Not captured,Not captured,Not captured,Not captured,,,Not captured,Not captured,Not captured,Not captured,12424 E 90th St N,,Owasso,Oklahoma,74055,9182726551,,Not captured,Not captured,Adam@luketministries.com,Not captured,,701824776,Not captured,Not captured,Not captured,Not captured,Not captured,Not captured,
Not captured,Not captured,11/09/2018,Not captured,Not captured,863949,020,00072,ARS-03-0045497,Essential America,Not captured,Not captured,Not captured,,Passport(642431741),Dependant,Perryman,Avi Joy,Thi,04/23/2006,female,Not captured,Not captured,Not captured,Not captured,Not captured,Not captured,Not captured,Not captured,Not captured,Not captured,Not captured,Not captured,Not captured,,,Not captured,Not captured,Not captured,Not captured,12424 E 90th St N,,Owasso,Oklahoma,74055,9182726551,,Not captured,Not captured,Adam@luketministries.com,Not captured,,701824777,Not captured,Not captured,Not captured,Not captured,Not captured,Not captured,
Not captured,Not captured,11/09/2018,Not captured,Not captured,863949,020,00072,ARS-03-0045497,Essential America,Not captured,Not captured,Not captured,,Passport(642431742),Dependant,Perryman,Nehemiah,Sang,05/18/2008,male,Not captured,Not captured,Not captured,Not captured,Not captured,Not captured,Not captured,Not captured,Not captured,Not captured,Not captured,Not captured,Not captured,,,Not captured,Not captured,Not captured,Not captured,12424 E 90th St N,,Owasso,Oklahoma,74055,9182726551,,Not captured,Not captured,Adam@luketministries.com,Not captured,,701824778,Not captured,Not captured,Not captured,Not captured,Not captured,Not captured,
Not captured,Not captured,11/09/2018,Not captured,Not captured,863949,020,00072,ARS-02-0045611,Beacon America,Not captured,Not captured,Not captured,Passport(AO075108),,,Medina,Hector,M,11/22/1986,male,Not captured,Not captured,Not captured,Not captured,Not captured,Not captured,Not captured,Not captured,Not captured,Not captured,Not captured,Not captured,Not captured,Margarita Rendon,Mother,Not captured,Not captured,Not captured,Not captured,Calle 131 No. 19 - 31,,Bogota,Distrito Capltal de Santa Fe de Bogot&atilde;,110121,7522629,,Not captured,Not captured,manuelm6@gmail.com,Not captured,701824961,,Not captured,Not captured,Not captured,Not captured,Not captured,Not captured,
Not captured,Not captured,11/09/2018,Not captured,Not captured,863949,020,00072,ARS-01-0045610,Beacon International,Not captured,Not captured,Not captured,,,,Mancil,Michael,,08/23/1999,male,Not captured,Not captured,Not captured,Not captured,Not captured,Not captured,Not captured,Not captured,Not captured,Not captured,Not captured,Not captured,Not captured,,,Not captured,Not captured,Not captured,Not captured,571 Gulfstream Trail West,,Orange Park,Florida,32073,,,Not captured,Not captured,mgcd187587@gmail.com,Not captured,701824960,,Not captured,Not captured,Not captured,Not captured,Not captured,Not captured,
Not captured,Not captured,11/09/2018,Not captured,Not captured,863949,020,00072,ARS-01-0045609,Beacon International,Not captured,Not captured,Not captured,,,,Jackson,Michelle,,10/18/1975,female,Not captured,Not captured,Not captured,Not captured,Not captured,Not captured,Not captured,Not captured,Not captured,Not captured,Not captured,Not captured,Not captured,,,Not captured,Not captured,Not captured,Not captured,2611 Ross Ave,,Dallas,Texas,75201,,,Not captured,Not captured,michellej_77026@yahoo.com,Not captured,701824959,,Not captured,Not captured,Not captured,Not captured,Not captured,Not captured,
Not captured,Not captured,11/09/2018,Not captured,Not captured,863949,020,00072,ARS-02-0045608,Beacon America,Not captured,Not captured,Not captured,,,,Junqueira,Victor,,01/19/1995,male,Not captured,Not captured,Not captured,Not captured,Not captured,Not captured,Not captured,Not captured,Not captured,Not captured,Not captured,Not captured,Not captured,,,Not captured,Not captured,Not captured,Not captured,VISCONDE DE PIRAJA IPANEMA 273 ap 304,,RIO DE JANEIRO,,22410001,,,Not captured,Not captured,victor.fonsecamj@gmail.com,Not captured,701824958,,Not captured,Not captured,Not captured,Not captured,Not captured,Not captured,
Not captured,Not captured,11/09/2018,Not captured,Not captured,863949,020,00072,ARS-01-0045607,Beacon International,Not captured,Not captured,Not captured,,,,Davids,Davids,,10/19/1980,male,Not captured,Not captured,Not captured,Not captured,Not captured,Not captured,Not captured,Not captured,Not captured,Not captured,Not captured,Not captured,Not captured,,,Not captured,Not captured,Not captured,Not captured,1448 Randall Court,,Los Angeles,California,90065,,,Not captured,Not captured,Dondigital@gmail.com,Not captured,701824957,,Not captured,Not captured,Not captured,Not captured,Not captured,Not captured,
Not captured,Not captured,11/09/2018,Not captured,Not captured,863949,020,00072,ARS-01-0045606,Beacon International,Not captured,Not captured,Not captured,,,,Glen,Jonathan,,08/16/1982,male,Not captured,Not captured,Not captured,Not captured,Not captured,Not captured,Not captured,Not captured,Not captured,Not captured,Not captured,Not captured,Not captured,,,Not captured,Not captured,Not captured,Not captured,375 Jayne Avenue,,Oakland,California,94610,,,Not captured,Not captured,jonnyblaze228@hotmail.com,Not captured,701824956,,Not captured,Not captured,Not captured,Not captured,Not captured,Not captured,
Not captured,Not captured,11/08/2018,Not captured,Not captured,863949,020,00072,ARS-01-0045605,Beacon International,Not captured,Not captured,Not captured,,,,Lewis,Zachary,R,03/12/1989,male,Not captured,Not captured,Not captured,Not captured,Not captured,Not captured,Not captured,Not captured,Not captured,Not captured,Not captured,Not captured,Not captured,,,Not captured,Not captured,Not captured,Not captured,751 Park Ct.,,Craig,Colorado,81625,,,Not captured,Not captured,zach.lewis89@yahoo.com,Not captured,701824955,,Not captured,Not captured,Not captured,Not captured,Not captured,Not captured,
Not captured,Not captured,11/08/2018,Not captured,Not captured,863949,020,00072,ARS-01-0045603,Beacon International,Not captured,Not captured,Not captured,,,,Faller,Josef,,01/12/1985,male,Not captured,Not captured,Not captured,Not captured,Not captured,Not captured,Not captured,Not captured,Not captured,Not captured,Not captured,Not captured,Not captured,,,Not captured,Not captured,Not captured,Not captured,155 Claremont Avenue,,New York City,New York,10027,,,Not captured,Not captured,josef.faller@gmail.com,Not captured,701824952,,Not captured,Not captured,Not captured,Not captured,Not captured,Not captured,
Not captured,Not captured,11/09/2018,Not captured,Not captured,863949,020,00072,ARS-01-0045600,Beacon International,Not captured,Not captured,Not captured,,,,Andia,Erwin,,07/12/1975,male,Not captured,Not captured,Not captured,Not captured,Not captured,Not captured,Not captured,Not captured,Not captured,Not captured,Not captured,Not captured,Not captured,,,Not captured,Not captured,Not captured,Not captured,9903 COSTA DEL SOL BLVD,,DORAL,Florida,33178,,,Not captured,Not captured,eandia@forexchile.cl,Not captured,701824949,,Not captured,Not captured,Not captured,Not captured,Not captured,Not captured,
Not captured,Not captured,11/08/2018,Not captured,Not captured,863949,020,00072,ARS-01-0045597,Beacon International,Not captured,Not captured,Not captured,,,,Tipping,Rachael,,07/31/1986,female,Not captured,Not captured,Not captured,Not captured,Not captured,Not captured,Not captured,Not captured,Not captured,Not captured,Not captured,Not captured,Not captured,,,Not captured,Not captured,Not captured,Not captured,92 Ragin rd,,Roscoe,New York,12776,,,Not captured,Not captured,rachael.tipping@gmail.com,Not captured,701824945,,Not captured,Not captured,Not captured,Not captured,Not captured,Not captured,
Not captured,Not captured,11/08/2018,Not captured,Not captured,863949,020,00072,ARS-02-0045595,Beacon America,Not captured,Not captured,Not captured,,,,Verrall,Jane,A,11/30/1964,female,Not captured,Not captured,Not captured,Not captured,Not captured,Not captured,Not captured,Not captured,Not captured,Not captured,Not captured,Not captured,Not captured,,,Not captured,Not captured,Not captured,Not captured,#8 Meghna Paradise Apts,,Hyderabad,,500 015,,,Not captured,Not captured,Dragonia4b@yahoo.com,Not captured,701824943,,Not captured,Not captured,Not captured,Not captured,Not captured,Not captured,
Not captured,Not captured,11/07/2018,Not captured,Not captured,863949,020,00072,ARS-01-0045594,Beacon International,Not captured,Not captured,Not captured,,,,Aubin,Ashley,A,03/27/1989,female,Not captured,Not captured,Not captured,Not captured,Not captured,Not captured,Not captured,Not captured,Not captured,Not captured,Not captured,Not captured,Not captured,,,Not captured,Not captured,Not captured,Not captured,1070 Kingswood Way,,Port Orange,Florida,32129,,,Not captured,Not captured,askovira@me.com,Not captured,701824942,,Not captured,Not captured,Not captured,Not captured,Not captured,Not captured,
Not captured,Not captured,11/08/2018,Not captured,Not captured,863949,020,00072,ARS-01-0045593,Beacon International,Not captured,Not captured,Not captured,,,,Bedick,Matthew,,10/18/1991,male,Not captured,Not captured,Not captured,Not captured,Not captured,Not captured,Not captured,Not captured,Not captured,Not captured,Not captured,Not captured,Not captured,,,Not captured,Not captured,Not captured,Not captured,425 East 13th Street 1E,,New York,New York,10009,9548171149,,Not captured,Not captured,Matthew.Bedick@gmail.com,Not captured,701824941,,Not captured,Not captured,Not captured,Not captured,Not captured,Not captured,