EE Transaction Type,Dependent Transaction Type,Effective Date,EE Signature,EE Signature Date,Control,Suffix,Account,Plan Number,Plan Name,Claim Office,Network ID Number,Customer Code,EE SSN,Dependent SSN,Dependent Relationship,Last Name,First Name,Middle Initial,DOB,Gender,Ethnicity,PCP/PCD,PCP/PCD Current Patient,Provider Cap Office Number,COB,Dep Student Indicator,Dep OOA Indicator,EE Prior Coverage Indicator,EE Late Entrant,EE Language Indicator,Hire Date,Earnings,Earnings Frequency,Beneficiary (Last Name First Name MI),Beneficiary Relationship,Continuation of Coverage Expiration Date,Continuation of Coverage Event Date,Continuation of Coverage Length of Coverage,Work Location Zip Code,Street Address Line 1,Street Address Line 2,City,State,Zip Code,Home Phone Number,Work Phone Number,Accept Code,Evidence Code,EE Email Address,Communication Disability Code,EE Alternate ID,Dep Alternate ID,Old Control,Old Suffix,Old Account,New Control,New Suffix,New Account,
Not captured,Not captured,11/20/2018,Not captured,Not captured,863949,020,00072,ARS-01-0045868,Beacon International,Not captured,Not captured,Not captured,,,,Marin,Andrei,,07/21/1987,male,Not captured,Not captured,Not captured,Not captured,Not captured,Not captured,Not captured,Not captured,Not captured,Not captured,Not captured,Not captured,Not captured,,,Not captured,Not captured,Not captured,Not captured,174 Thompson St,,New York,New York,10012,,,Not captured,Not captured,andrei.i.marin@gmail.com,Not captured,701825434,,Not captured,Not captured,Not captured,Not captured,Not captured,Not captured,
Not captured,Not captured,11/20/2018,Not captured,Not captured,863949,020,00072,ARS-01-0045866,Beacon International,Not captured,Not captured,Not captured,,,,mckenzie,maurice,a,05/03/1965,male,Not captured,Not captured,Not captured,Not captured,Not captured,Not captured,Not captured,Not captured,Not captured,Not captured,Not captured,Not captured,Not captured,,,Not captured,Not captured,Not captured,Not captured,26 cliff street,,west orange,New Jersey,07052,,,Not captured,Not captured,macarl@aol.com,Not captured,701825430,,Not captured,Not captured,Not captured,Not captured,Not captured,Not captured,
Not captured,Not captured,11/20/2018,Not captured,Not captured,863949,020,00072,ARS-03-0045188,Essential America,Not captured,Not captured,Not captured,SSN(356-92-3031),,,Blunier,Jacob,Benjamin,12/12/1996,male,Not captured,Not captured,Not captured,Not captured,Not captured,Not captured,Not captured,Not captured,Not captured,Not captured,Not captured,Not captured,Not captured,,,Not captured,Not captured,Not captured,Not captured,503 W Walnut Street,,Robinson,Illinois,62454,(618)5541066,,Not captured,Not captured,jake.blunier@yahoo.com ,Not captured,701824149,,Not captured,Not captured,Not captured,Not captured,Not captured,Not captured,
Not captured,Not captured,11/20/2018,Not captured,Not captured,863949,020,00072,ARS-01-0045849,Beacon International,Not captured,Not captured,Not captured,,,,Davis,Rhett,D,11/13/1991,male,Not captured,Not captured,Not captured,Not captured,Not captured,Not captured,Not captured,Not captured,Not captured,Not captured,Not captured,Not captured,Not captured,,,Not captured,Not captured,Not captured,Not captured,300 E. Riverside Drive #330,,Austin,Texas,78704,,,Not captured,Not captured,michelleischenck@gmail.com,Not captured,701825401,,Not captured,Not captured,Not captured,Not captured,Not captured,Not captured,
Not captured,Not captured,11/20/2018,Not captured,Not captured,863949,020,00072,ARS-01-0045848,Beacon International,Not captured,Not captured,Not captured,,,,Schenck,Michelle,I,10/02/1992,female,Not captured,Not captured,Not captured,Not captured,Not captured,Not captured,Not captured,Not captured,Not captured,Not captured,Not captured,Not captured,Not captured,,,Not captured,Not captured,Not captured,Not captured,300 E. Riverside Drive #330,,Austin,Texas,78704,,,Not captured,Not captured,michelleischenck@gmail.com,Not captured,701825400,,Not captured,Not captured,Not captured,Not captured,Not captured,Not captured,
Not captured,Not captured,11/20/2018,Not captured,Not captured,863949,020,00072,ARS-02-0045845,Beacon America,Not captured,Not captured,Not captured,,,,Child,Christine ,,01/30/1953,female,Not captured,Not captured,Not captured,Not captured,Not captured,Not captured,Not captured,Not captured,Not captured,Not captured,Not captured,Not captured,Not captured,,,Not captured,Not captured,Not captured,Not captured,226 Shoeburg Road,,Thorpe Bay,England,SS13RG,305-785-2021,,Not captured,Not captured,barry.child9@sky.com,Not captured,701825397,,Not captured,Not captured,Not captured,Not captured,Not captured,Not captured,
Not captured,Not captured,11/20/2018,Not captured,Not captured,863949,020,00072,ARS-02-0045844,Beacon America,Not captured,Not captured,Not captured,Passport(509761370),,,Child,Barry ,,01/09/1950,male,Not captured,Not captured,Not captured,Not captured,Not captured,Not captured,Not captured,Not captured,Not captured,Not captured,Not captured,Not captured,Not captured,,,Not captured,Not captured,Not captured,Not captured,226 Shoeburg Road,,Thorpe Bay,England,SS13RG,305-785-2021,,Not captured,Not captured,barry.child9@sky.com,Not captured,701825396,,Not captured,Not captured,Not captured,Not captured,Not captured,Not captured,
Not captured,Not captured,11/20/2018,Not captured,Not captured,863949,020,00072,ARS-01-0045843,Beacon International,Not captured,Not captured,Not captured,,,,Ghaffaripour,Ehsan,,08/11/1982,male,Not captured,Not captured,Not captured,Not captured,Not captured,Not captured,Not captured,Not captured,Not captured,Not captured,Not captured,Not captured,Not captured,,,Not captured,Not captured,Not captured,Not captured,5797 Canoga ave apt202,,Woodland hills,California,91367,,,Not captured,Not captured,ehsan.ghaffari@gmail.com,Not captured,701825395,,Not captured,Not captured,Not captured,Not captured,Not captured,Not captured,
Not captured,Not captured,11/20/2018,Not captured,Not captured,863949,020,00072,ARS-01-0045838,Beacon International,Not captured,Not captured,Not captured,,,,Khansari,Amir,,08/14/1983,male,Not captured,Not captured,Not captured,Not captured,Not captured,Not captured,Not captured,Not captured,Not captured,Not captured,Not captured,Not captured,Not captured,,,Not captured,Not captured,Not captured,Not captured,1239 Evergreen Ave Apt A1,,Fullerton,California,92835,,,Not captured,Not captured,amirsdi66@gmail.com,Not captured,701825390,,Not captured,Not captured,Not captured,Not captured,Not captured,Not captured,
Not captured,Not captured,11/20/2018,Not captured,Not captured,863949,020,00072,ARS-02-0045836,Beacon America,Not captured,Not captured,Not captured,Passport(BH3573874),,,KOCSIS,GABOR ,,08/06/1969,male,Not captured,Not captured,Not captured,Not captured,Not captured,Not captured,Not captured,Not captured,Not captured,Not captured,Not captured,Not captured,Not captured,ESTATE,ESTATE,Not captured,Not captured,Not captured,Not captured,2 SOUTH END AVE,,NEW YORK,NEW YORK,10280,917-359-8568,6464299880,Not captured,Not captured,GABORSPAINTING@YAHOO.COM,Not captured,701825387,,Not captured,Not captured,Not captured,Not captured,Not captured,Not captured,
Not captured,Not captured,11/19/2018,Not captured,Not captured,863949,020,00072,ARS-01-0045835,Beacon International,Not captured,Not captured,Not captured,,,,Santoro Murphy,Gina,,11/05/1967,female,Not captured,Not captured,Not captured,Not captured,Not captured,Not captured,Not captured,Not captured,Not captured,Not captured,Not captured,Not captured,Not captured,,,Not captured,Not captured,Not captured,Not captured,8 Stone Drive,,West Orange,New Jersey,07052,,,Not captured,Not captured,mikechilds@ledgeentertainment.com,Not captured,701825372,,Not captured,Not captured,Not captured,Not captured,Not captured,Not captured,
Not captured,Not captured,11/19/2018,Not captured,Not captured,863949,020,00072,ARS-01-0045834,Beacon International,Not captured,Not captured,Not captured,,,,Childs,MIchael,,08/14/1964,male,Not captured,Not captured,Not captured,Not captured,Not captured,Not captured,Not captured,Not captured,Not captured,Not captured,Not captured,Not captured,Not captured,,,Not captured,Not captured,Not captured,Not captured,8 Stone Drive,,West Orange,New Jersey,07052,,,Not captured,Not captured,mikechilds@ledgeentertainment.com,Not captured,701825371,,Not captured,Not captured,Not captured,Not captured,Not captured,Not captured,
Not captured,Not captured,11/19/2018,Not captured,Not captured,863949,020,00072,ARS-01-0045832,Beacon International,Not captured,Not captured,Not captured,,,,Wong,Brittney,S,11/30/1993,female,Not captured,Not captured,Not captured,Not captured,Not captured,Not captured,Not captured,Not captured,Not captured,Not captured,Not captured,Not captured,Not captured,,,Not captured,Not captured,Not captured,Not captured,30 Colorados Drive,,Millbrae,California,94030,,,Not captured,Not captured,cavenaw@gmail.com,Not captured,701825361,,Not captured,Not captured,Not captured,Not captured,Not captured,Not captured,
Not captured,Not captured,11/19/2018,Not captured,Not captured,863949,020,00072,ARS-01-0045831,Beacon International,Not captured,Not captured,Not captured,,,,Wong,Clarice,B,11/19/1996,female,Not captured,Not captured,Not captured,Not captured,Not captured,Not captured,Not captured,Not captured,Not captured,Not captured,Not captured,Not captured,Not captured,,,Not captured,Not captured,Not captured,Not captured,30 Colorados Drive,,Millbrae,California,94030,,,Not captured,Not captured,cavenaw@gmail.com,Not captured,701825360,,Not captured,Not captured,Not captured,Not captured,Not captured,Not captured,
Not captured,Not captured,11/19/2018,Not captured,Not captured,863949,020,00072,ARS-01-0045830,Beacon International,Not captured,Not captured,Not captured,,,,Wong,Cavena,,05/07/1966,female,Not captured,Not captured,Not captured,Not captured,Not captured,Not captured,Not captured,Not captured,Not captured,Not captured,Not captured,Not captured,Not captured,,,Not captured,Not captured,Not captured,Not captured,30 Colorados Drive,,Millbrae,California,94030,,,Not captured,Not captured,cavenaw@gmail.com,Not captured,701825359,,Not captured,Not captured,Not captured,Not captured,Not captured,Not captured,
Not captured,Not captured,11/19/2018,Not captured,Not captured,863949,020,00072,ARS-01-0045829,Beacon International,Not captured,Not captured,Not captured,,,,Wong,Barry,,07/20/1960,male,Not captured,Not captured,Not captured,Not captured,Not captured,Not captured,Not captured,Not captured,Not captured,Not captured,Not captured,Not captured,Not captured,,,Not captured,Not captured,Not captured,Not captured,30 Colorados Drive,,Millbrae,California,94030,,,Not captured,Not captured,cavenaw@gmail.com,Not captured,701825358,,Not captured,Not captured,Not captured,Not captured,Not captured,Not captured,
Not captured,Not captured,11/19/2018,Not captured,Not captured,863949,020,00072,ARS-01-0045828,Beacon International,Not captured,Not captured,Not captured,,,,VOSLER,Jaclyn,A,10/17/1983,female,Not captured,Not captured,Not captured,Not captured,Not captured,Not captured,Not captured,Not captured,Not captured,Not captured,Not captured,Not captured,Not captured,,,Not captured,Not captured,Not captured,Not captured,PO box 1008,,Carbondale,Colorado,81623,,,Not captured,Not captured,jackievosler@yahoo.com,Not captured,701825357,,Not captured,Not captured,Not captured,Not captured,Not captured,Not captured,
Not captured,Not captured,11/19/2018,Not captured,Not captured,863949,020,00072,ARS-01-0045827,Beacon International,Not captured,Not captured,Not captured,,,,Thompson,Spencer,C,04/07/1989,male,Not captured,Not captured,Not captured,Not captured,Not captured,Not captured,Not captured,Not captured,Not captured,Not captured,Not captured,Not captured,Not captured,,,Not captured,Not captured,Not captured,Not captured,222 The Esplanade,,TORONTO,Ontario,M5A4M8,,,Not captured,Not captured,spencer.thompson@mail.mcgill.ca,Not captured,701825356,,Not captured,Not captured,Not captured,Not captured,Not captured,Not captured,
Not captured,Not captured,11/19/2018,Not captured,Not captured,863949,020,00072,ARS-02-0045821,Beacon America,Not captured,Not captured,Not captured,,,,Plumb,Chloe,F,05/02/1983,female,Not captured,Not captured,Not captured,Not captured,Not captured,Not captured,Not captured,Not captured,Not captured,Not captured,Not captured,Not captured,Not captured,,,Not captured,Not captured,Not captured,Not captured,668 seneca ave,,Ridgewood,New York,11385,,,Not captured,Not captured,contactchloe@gmail.com,Not captured,701825350,,Not captured,Not captured,Not captured,Not captured,Not captured,Not captured,
Not captured,Not captured,11/19/2018,Not captured,Not captured,863949,020,00072,ARS-01-0045806,Beacon International,Not captured,Not captured,Not captured,,,,Comas,Ethan,,12/11/2006,male,Not captured,Not captured,Not captured,Not captured,Not captured,Not captured,Not captured,Not captured,Not captured,Not captured,Not captured,Not captured,Not captured,,,Not captured,Not captured,Not captured,Not captured,1424 ne miami pl apt 1804,,Miami,Florida,33132,,,Not captured,Not captured,n.mistrikova@gmail.com,Not captured,701825325,,Not captured,Not captured,Not captured,Not captured,Not captured,Not captured,
Not captured,Not captured,11/19/2018,Not captured,Not captured,863949,020,00072,ARS-01-0045805,Beacon International,Not captured,Not captured,Not captured,,,,Comas,Ivan,,03/02/1971,male,Not captured,Not captured,Not captured,Not captured,Not captured,Not captured,Not captured,Not captured,Not captured,Not captured,Not captured,Not captured,Not captured,,,Not captured,Not captured,Not captured,Not captured,1424 ne miami pl apt 1804,,Miami,Florida,33132,,,Not captured,Not captured,n.mistrikova@gmail.com,Not captured,701825324,,Not captured,Not captured,Not captured,Not captured,Not captured,Not captured,
Not captured,Not captured,11/19/2018,Not captured,Not captured,863949,020,00072,ARS-01-0045803,Beacon International,Not captured,Not captured,Not captured,,,,Silberstein,Lipa,,07/08/1999,male,Not captured,Not captured,Not captured,Not captured,Not captured,Not captured,Not captured,Not captured,Not captured,Not captured,Not captured,Not captured,Not captured,,,Not captured,Not captured,Not captured,Not captured,41 throop av,,Brooklyn,New York,11206,,,Not captured,Not captured,yls123@gmail.com,Not captured,701825317,,Not captured,Not captured,Not captured,Not captured,Not captured,Not captured,
Not captured,Not captured,11/18/2018,Not captured,Not captured,863949,020,00072,ARS-02-0045802,Beacon America,Not captured,Not captured,Not captured,,,,Suubi,Dianah,S,02/08/2005,female,Not captured,Not captured,Not captured,Not captured,Not captured,Not captured,Not captured,Not captured,Not captured,Not captured,Not captured,Not captured,Not captured,,,Not captured,Not captured,Not captured,Not captured,Plot-5583 block number 265,,Bunawaya,,N/a,,,Not captured,Not captured,btucker13@yahoo.com,Not captured,701825316,,Not captured,Not captured,Not captured,Not captured,Not captured,Not captured,
Not captured,Not captured,11/18/2018,Not captured,Not captured,863949,020,00072,ARS-01-0045801,Beacon International,Not captured,Not captured,Not captured,,,,SPADORA,DAVID,A,03/01/1990,male,Not captured,Not captured,Not captured,Not captured,Not captured,Not captured,Not captured,Not captured,Not captured,Not captured,Not captured,Not captured,Not captured,,,Not captured,Not captured,Not captured,Not captured,471 Lenox Ave,,New York,New York,10037,,,Not captured,Not captured,david.spadora@gmail.com,Not captured,701825315,,Not captured,Not captured,Not captured,Not captured,Not captured,Not captured,
Not captured,Not captured,11/18/2018,Not captured,Not captured,863949,020,00072,ARS-01-0045800,Beacon International,Not captured,Not captured,Not captured,,,,Khalfan,Ali,,12/14/1949,male,Not captured,Not captured,Not captured,Not captured,Not captured,Not captured,Not captured,Not captured,Not captured,Not captured,Not captured,Not captured,Not captured,,,Not captured,Not captured,Not captured,Not captured,37-13 30th ave,,Astoria,Ontario,11103,,,Not captured,Not captured,m.a.khalfan@gmail.com,Not captured,701825314,,Not captured,Not captured,Not captured,Not captured,Not captured,Not captured,
Not captured,Not captured,11/18/2018,Not captured,Not captured,863949,020,00072,OVI-28-0045799,OverseasCare Visitors Insurance Plan,Not captured,Not captured,Not captured,Passport(J0389534),,,Sankara Narayanan,Radhamani,,05/20/1959,female,Not captured,Not captured,Not captured,Not captured,Not captured,Not captured,Not captured,Not captured,Not captured,Not captured,Not captured,Not captured,Not captured,Anjana Sankara Narayanan,Daughter ,Not captured,Not captured,Not captured,Not captured,5300 Iron Horse Pkwy Apt.535,,Dublin,California,94568,2813869586,2813869586,Not captured,Not captured,anjananarayanan@gmail.com,Not captured,701825313,,Not captured,Not captured,Not captured,Not captured,Not captured,Not captured,
Not captured,Not captured,11/18/2018,Not captured,Not captured,863949,020,00072,OVI-28-0045798,OverseasCare Visitors Insurance Plan,Not captured,Not captured,Not captured,Passport(J0389534),,,Sundaram ,Sankara Narayanan,,05/05/1952,male,Not captured,Not captured,Not captured,Not captured,Not captured,Not captured,Not captured,Not captured,Not captured,Not captured,Not captured,Not captured,Not captured,Anjana Sankara Narayanan,Daughter ,Not captured,Not captured,Not captured,Not captured,5300 Iron Horse Pkwy Apt.535,,Dublin,California,94568,2813869586,2813869586,Not captured,Not captured,anjananarayanan@gmail.com,Not captured,701825312,,Not captured,Not captured,Not captured,Not captured,Not captured,Not captured,
Not captured,Not captured,11/17/2018,Not captured,Not captured,863949,020,00072,ARS-01-0045797,Beacon International,Not captured,Not captured,Not captured,,,,Blum,Crecia,D,12/21/1987,female,Not captured,Not captured,Not captured,Not captured,Not captured,Not captured,Not captured,Not captured,Not captured,Not captured,Not captured,Not captured,Not captured,,,Not captured,Not captured,Not captured,Not captured,1015 NE 97th Place,,Kansas City,Missouri,64155,,,Not captured,Not captured,takeheart@gmail.com,Not captured,701825311,,Not captured,Not captured,Not captured,Not captured,Not captured,Not captured,
Not captured,Not captured,11/17/2018,Not captured,Not captured,863949,020,00072,ARS-01-0045796,Beacon International,Not captured,Not captured,Not captured,,,,Raskin,Artem,,09/23/1991,male,Not captured,Not captured,Not captured,Not captured,Not captured,Not captured,Not captured,Not captured,Not captured,Not captured,Not captured,Not captured,Not captured,,,Not captured,Not captured,Not captured,Not captured,1522 Parkmont dr,,San Jose,California,95131,,,Not captured,Not captured,artem.raskin@gmail.com,Not captured,701825310,,Not captured,Not captured,Not captured,Not captured,Not captured,Not captured,
Not captured,Not captured,11/17/2018,Not captured,Not captured,863949,020,00072,ARS-01-0045795,Beacon International,Not captured,Not captured,Not captured,,,,Swerdlow,Samantha,P,07/27/1998,female,Not captured,Not captured,Not captured,Not captured,Not captured,Not captured,Not captured,Not captured,Not captured,Not captured,Not captured,Not captured,Not captured,,,Not captured,Not captured,Not captured,Not captured,8343 S Benjamin Dr,,Oak Creek,Wisconsin,53154,,,Not captured,Not captured,sherriburbach@yahoo.com,Not captured,701825309,,Not captured,Not captured,Not captured,Not captured,Not captured,Not captured,
Not captured,Not captured,11/17/2018,Not captured,Not captured,863949,020,00072,ARS-01-0045794,Beacon International,Not captured,Not captured,Not captured,,,,Burbach,Sherri,L,11/09/1961,female,Not captured,Not captured,Not captured,Not captured,Not captured,Not captured,Not captured,Not captured,Not captured,Not captured,Not captured,Not captured,Not captured,,,Not captured,Not captured,Not captured,Not captured,8343 S Benjamin Dr,,Oak Creek,Wisconsin,53154,,,Not captured,Not captured,sherriburbach@yahoo.com,Not captured,701825308,,Not captured,Not captured,Not captured,Not captured,Not captured,Not captured,
Not captured,Not captured,11/17/2018,Not captured,Not captured,863949,020,00072,ARS-01-0045793,Beacon International,Not captured,Not captured,Not captured,,,,miller,bryan,,06/27/1986,male,Not captured,Not captured,Not captured,Not captured,Not captured,Not captured,Not captured,Not captured,Not captured,Not captured,Not captured,Not captured,Not captured,,,Not captured,Not captured,Not captured,Not captured,5200 S. LOS ALTOS PKWY,,SPARKS,Nevada,89436,,,Not captured,Not captured,Bryan.miller67@gmail.com,Not captured,701825307,,Not captured,Not captured,Not captured,Not captured,Not captured,Not captured,
Not captured,Not captured,11/18/2018,Not captured,Not captured,863949,020,00072,ARS-02-0045792,Beacon America,Not captured,Not captured,Not captured,,,,Boutsinis,Nikolaos,,08/24/1977,male,Not captured,Not captured,Not captured,Not captured,Not captured,Not captured,Not captured,Not captured,Not captured,Not captured,Not captured,Not captured,Not captured,,,Not captured,Not captured,Not captured,Not captured,pobox 839,,Santorini,,84700,,,Not captured,Not captured,nikos.boutsinis@gmail.com,Not captured,701825306,,Not captured,Not captured,Not captured,Not captured,Not captured,Not captured,
Not captured,Not captured,11/17/2018,Not captured,Not captured,863949,020,00072,ARS-01-0045791,Beacon International,Not captured,Not captured,Not captured,,,,KIM,JIEUN,,01/09/1987,female,Not captured,Not captured,Not captured,Not captured,Not captured,Not captured,Not captured,Not captured,Not captured,Not captured,Not captured,Not captured,Not captured,,,Not captured,Not captured,Not captured,Not captured,345 Devonshire Drive. Apt.99,,Rochester Hills,Michigan,48307,,,Not captured,Not captured,jieunabc@hanmail.net,Not captured,701825305,,Not captured,Not captured,Not captured,Not captured,Not captured,Not captured,
Not captured,Not captured,11/17/2018,Not captured,Not captured,863949,020,00072,ARS-01-0045790,Beacon International,Not captured,Not captured,Not captured,,,,Lee,Jessica,,05/22/1990,female,Not captured,Not captured,Not captured,Not captured,Not captured,Not captured,Not captured,Not captured,Not captured,Not captured,Not captured,Not captured,Not captured,,,Not captured,Not captured,Not captured,Not captured,150 w 51 street,,new york,New York,10019,,,Not captured,Not captured,ralph.nanad@gmail.com,Not captured,701825304,,Not captured,Not captured,Not captured,Not captured,Not captured,Not captured,
Not captured,Not captured,11/17/2018,Not captured,Not captured,863949,020,00072,ARS-01-0045789,Beacon International,Not captured,Not captured,Not captured,,,,nanad,Ralph,,10/15/1990,male,Not captured,Not captured,Not captured,Not captured,Not captured,Not captured,Not captured,Not captured,Not captured,Not captured,Not captured,Not captured,Not captured,,,Not captured,Not captured,Not captured,Not captured,150 w 51 street,,new york,New York,10019,,,Not captured,Not captured,ralph.nanad@gmail.com,Not captured,701825303,,Not captured,Not captured,Not captured,Not captured,Not captured,Not captured,
Not captured,Not captured,11/17/2018,Not captured,Not captured,863949,020,00072,ARS-01-0045788,Beacon International,Not captured,Not captured,Not captured,,,,Alger-Meyer,Blythe,A,02/12/2002,female,Not captured,Not captured,Not captured,Not captured,Not captured,Not captured,Not captured,Not captured,Not captured,Not captured,Not captured,Not captured,Not captured,,,Not captured,Not captured,Not captured,Not captured,10819 Alcott Circle,,Denver,Colorado,80234,,,Not captured,Not captured,coloradokathan@gmail.com,Not captured,701825302,,Not captured,Not captured,Not captured,Not captured,Not captured,Not captured,