EE Transaction Type,Dependent Transaction Type,Effective Date,EE Signature,EE Signature Date,Control,Suffix,Account,Plan Number,Plan Name,Claim Office,Network ID Number,Customer Code,EE SSN,Dependent SSN,Dependent Relationship,Last Name,First Name,Middle Initial,DOB,Gender,Ethnicity,PCP/PCD,PCP/PCD Current Patient,Provider Cap Office Number,COB,Dep Student Indicator,Dep OOA Indicator,EE Prior Coverage Indicator,EE Late Entrant,EE Language Indicator,Hire Date,Earnings,Earnings Frequency,Beneficiary (Last Name First Name MI),Beneficiary Relationship,Continuation of Coverage Expiration Date,Continuation of Coverage Event Date,Continuation of Coverage Length of Coverage,Work Location Zip Code,Street Address Line 1,Street Address Line 2,City,State,Zip Code,Home Phone Number,Work Phone Number,Accept Code,Evidence Code,EE Email Address,Communication Disability Code,EE Alternate ID,Dep Alternate ID,Old Control,Old Suffix,Old Account,New Control,New Suffix,New Account,
Not captured,Not captured,10/31/2018,Not captured,Not captured,863949,020,00072,ARS-04-0045445,Enhanced America,Not captured,Not captured,Not captured,Passport(087303597),,,Gutierrez Smith,Anays,,02/04/1971,female,Not captured,Not captured,Not captured,Not captured,Not captured,Not captured,Not captured,Not captured,Not captured,Not captured,Not captured,Not captured,Not captured,,,Not captured,Not captured,Not captured,Not captured,16611 Mystic Timber,,Cypress,Texas,77433,346-255-8051,,Not captured,Not captured,Glen@destinconstruction.com,Not captured,701824560,,Not captured,Not captured,Not captured,Not captured,Not captured,Not captured,
Not captured,Not captured,10/31/2018,Not captured,Not captured,863949,020,00072,ARS-02-0045462,Beacon America,Not captured,Not captured,Not captured,Passport(111421459),,,VARGAAS,VALERIA,,11/01/2003,female,Not captured,Not captured,Not captured,Not captured,Not captured,Not captured,Not captured,Not captured,Not captured,Not captured,Not captured,Not captured,Not captured,DANIEL VARGAS,PADRE,Not captured,Not captured,Not captured,Not captured,URB. Altos de Guataparo Av. Montalb&aacute;n casa 139-101 ,,VALENCIA,Carabobo,0000,58414433294,,Not captured,Not captured,theanchorage1@gmail.com,Not captured,701824585,,Not captured,Not captured,Not captured,Not captured,Not captured,Not captured,
Not captured,Not captured,10/31/2018,Not captured,Not captured,863949,020,00072,ARS-03-0045366,Essential America,Not captured,Not captured,Not captured,SSN(097475106),,,Staley,Nathan,James,05/03/2017,male,Not captured,Not captured,Not captured,Not captured,Not captured,Not captured,Not captured,Not captured,Not captured,Not captured,Not captured,Not captured,Not captured,,,Not captured,Not captured,Not captured,Not captured,Ballyviniter Middle,,Mallow,Cork,P51 E5WC,0858895767,,Not captured,Not captured,head4ireland@gmail.com,Not captured,701824425,,Not captured,Not captured,Not captured,Not captured,Not captured,Not captured,
Not captured,Not captured,10/31/2018,Not captured,Not captured,863949,020,00072,ARS-03-0045370,Essential International,Not captured,Not captured,Not captured,Passport(NA),,,GROVE,STEVEN,,10/10/1968,male,Not captured,Not captured,Not captured,Not captured,Not captured,Not captured,Not captured,Not captured,Not captured,Not captured,Not captured,Not captured,Not captured,,,Not captured,Not captured,Not captured,Not captured,941 MINERS RIDGE CT,,INCLINE VILLAGE,Nevada,89451,8584274199,,Not captured,Not captured,casadegrove2@gmail.com,Not captured,701824430,,Not captured,Not captured,Not captured,Not captured,Not captured,Not captured,
Not captured,Not captured,10/31/2018,Not captured,Not captured,863949,020,00072,ARS-03-0045370,Essential International,Not captured,Not captured,Not captured,,Passport(NA),Spouse,GROVE,EVE,,02/23/1970,female,Not captured,Not captured,Not captured,Not captured,Not captured,Not captured,Not captured,Not captured,Not captured,Not captured,Not captured,Not captured,Not captured,,,Not captured,Not captured,Not captured,Not captured,941 MINERS RIDGE CT,,INCLINE VILLAGE,Nevada,89451,8584274199,,Not captured,Not captured,casadegrove2@gmail.com,Not captured,,701824431,Not captured,Not captured,Not captured,Not captured,Not captured,Not captured,
Not captured,Not captured,10/31/2018,Not captured,Not captured,863949,020,00072,ARS-03-0045370,Essential International,Not captured,Not captured,Not captured,,Passport(NA),Dependant,GROVE,EMMA,,06/19/2002,female,Not captured,Not captured,Not captured,Not captured,Not captured,Not captured,Not captured,Not captured,Not captured,Not captured,Not captured,Not captured,Not captured,,,Not captured,Not captured,Not captured,Not captured,941 MINERS RIDGE CT,,INCLINE VILLAGE,Nevada,89451,8584274199,,Not captured,Not captured,casadegrove2@gmail.com,Not captured,,701824432,Not captured,Not captured,Not captured,Not captured,Not captured,Not captured,
Not captured,Not captured,10/31/2018,Not captured,Not captured,863949,020,00072,ARS-03-0045370,Essential International,Not captured,Not captured,Not captured,,Passport(NA),Dependant,GROVE,MADELINE,,06/19/2002,female,Not captured,Not captured,Not captured,Not captured,Not captured,Not captured,Not captured,Not captured,Not captured,Not captured,Not captured,Not captured,Not captured,,,Not captured,Not captured,Not captured,Not captured,941 MINERS RIDGE CT,,INCLINE VILLAGE,Nevada,89451,8584274199,,Not captured,Not captured,casadegrove2@gmail.com,Not captured,,701824433,Not captured,Not captured,Not captured,Not captured,Not captured,Not captured,
Not captured,Not captured,10/31/2018,Not captured,Not captured,863949,020,00072,ARS-01-0045458,Beacon International,Not captured,Not captured,Not captured,,,,Rogers,Suzanne,E,12/30/1967,female,Not captured,Not captured,Not captured,Not captured,Not captured,Not captured,Not captured,Not captured,Not captured,Not captured,Not captured,Not captured,Not captured,,,Not captured,Not captured,Not captured,Not captured,60 Buttonwoods Ave.,,Haverhill,Massachusetts,01830,,,Not captured,Not captured,suzanne@suzannerogers.consulting,Not captured,701824577,,Not captured,Not captured,Not captured,Not captured,Not captured,Not captured,
Not captured,Not captured,10/31/2018,Not captured,Not captured,863949,020,00072,ARS-01-0045457,Beacon International,Not captured,Not captured,Not captured,,,,Holman,Logan,S,04/16/1963,male,Not captured,Not captured,Not captured,Not captured,Not captured,Not captured,Not captured,Not captured,Not captured,Not captured,Not captured,Not captured,Not captured,,,Not captured,Not captured,Not captured,Not captured,187 East 500 North,,Orem,Utah,84057,,,Not captured,Not captured,logansh@yahoo.com,Not captured,701824576,,Not captured,Not captured,Not captured,Not captured,Not captured,Not captured,
Not captured,Not captured,10/31/2018,Not captured,Not captured,863949,020,00072,ARS-01-0045456,Beacon International,Not captured,Not captured,Not captured,,,,Pomohaibo,Sofiia,,09/27/1994,female,Not captured,Not captured,Not captured,Not captured,Not captured,Not captured,Not captured,Not captured,Not captured,Not captured,Not captured,Not captured,Not captured,,,Not captured,Not captured,Not captured,Not captured,pr. Nikolaya Bazhana 10-420,,Kiev,,02140,,,Not captured,Not captured,sfirsov1972@gmail.com,Not captured,701824575,,Not captured,Not captured,Not captured,Not captured,Not captured,Not captured,
Not captured,Not captured,10/31/2018,Not captured,Not captured,863949,020,00072,ARS-02-0045455,Beacon America,Not captured,Not captured,Not captured,Passport(B4628030),,,Duong,Luu,N,08/19/1949,female,Not captured,Not captured,Not captured,Not captured,Not captured,Not captured,Not captured,Not captured,Not captured,Not captured,Not captured,Not captured,Not captured,,,Not captured,Not captured,Not captured,Not captured,692 Joplin street,,Aurora,Colorado,80011,720-635-0658,,Not captured,Not captured,l.duong21@yahoo.com,Not captured,701824574,,Not captured,Not captured,Not captured,Not captured,Not captured,Not captured,
Not captured,Not captured,10/31/2018,Not captured,Not captured,863949,020,00072,ARS-01-0045454,Beacon International,Not captured,Not captured,Not captured,,,,James,Stacy,,01/13/1968,female,Not captured,Not captured,Not captured,Not captured,Not captured,Not captured,Not captured,Not captured,Not captured,Not captured,Not captured,Not captured,Not captured,,,Not captured,Not captured,Not captured,Not captured,4915 North Juliano rd,,Las vegas,Nevada,89149,,,Not captured,Not captured,stacyeleven@gmail.com,Not captured,701824573,,Not captured,Not captured,Not captured,Not captured,Not captured,Not captured,
Not captured,Not captured,10/31/2018,Not captured,Not captured,863949,020,00072,ARS-01-0045453,Beacon International,Not captured,Not captured,Not captured,,,,Haahs,Julianna,E,10/04/1990,female,Not captured,Not captured,Not captured,Not captured,Not captured,Not captured,Not captured,Not captured,Not captured,Not captured,Not captured,Not captured,Not captured,,,Not captured,Not captured,Not captured,Not captured,1210 Kingsley Court,,Lower Gwynedd,Pennsylvania,19002,,,Not captured,Not captured,jehaahs@gmail.com,Not captured,701824572,,Not captured,Not captured,Not captured,Not captured,Not captured,Not captured,
Not captured,Not captured,10/30/2018,Not captured,Not captured,863949,020,00072,ARS-01-0045451,Beacon International,Not captured,Not captured,Not captured,,,,Nuttle,Rodney,M,05/03/1949,male,Not captured,Not captured,Not captured,Not captured,Not captured,Not captured,Not captured,Not captured,Not captured,Not captured,Not captured,Not captured,Not captured,,,Not captured,Not captured,Not captured,Not captured,4413 Winding Ridge Circle,,Norman,Oklahoma,73072,,,Not captured,Not captured,RMNUTTLE@NUTTLE.COM,Not captured,701824570,,Not captured,Not captured,Not captured,Not captured,Not captured,Not captured,
Not captured,Not captured,10/30/2018,Not captured,Not captured,863949,020,00072,ARS-04-0045419,Enhanced America,Not captured,Not captured,Not captured,Passport(557318010),,,Shipley,Karen,H,07/07/1966,female,Not captured,Not captured,Not captured,Not captured,Not captured,Not captured,Not captured,Not captured,Not captured,Not captured,Not captured,Not captured,Not captured,,,Not captured,Not captured,Not captured,Not captured,4202 Cedar Ridge Trail,,Houston,Texas,77059,4147218222,,Not captured,Not captured,sailsis77@gmail.com,Not captured,701824516,,Not captured,Not captured,Not captured,Not captured,Not captured,Not captured,
Not captured,Not captured,10/30/2018,Not captured,Not captured,863949,020,00072,ARS-01-0045449,Beacon International,Not captured,Not captured,Not captured,,,,Harper,Cate,F,03/16/1985,female,Not captured,Not captured,Not captured,Not captured,Not captured,Not captured,Not captured,Not captured,Not captured,Not captured,Not captured,Not captured,Not captured,,,Not captured,Not captured,Not captured,Not captured,2507 N. Arthur St.,,Boise,Idaho,83703,,,Not captured,Not captured,catefharper12@aol.com,Not captured,701824568,,Not captured,Not captured,Not captured,Not captured,Not captured,Not captured,
Not captured,Not captured,10/30/2018,Not captured,Not captured,863949,020,00072,ARS-01-0045448,Beacon International,Not captured,Not captured,Not captured,,,,Shaklawun,Amenah,S,09/07/1992,female,Not captured,Not captured,Not captured,Not captured,Not captured,Not captured,Not captured,Not captured,Not captured,Not captured,Not captured,Not captured,Not captured,,,Not captured,Not captured,Not captured,Not captured,2257 West Del Oro Circle,,Mesa,Arizona,85202,,,Not captured,Not captured,misrata01@yahoo.com,Not captured,701824563,,Not captured,Not captured,Not captured,Not captured,Not captured,Not captured,
Not captured,Not captured,10/30/2018,Not captured,Not captured,863949,020,00072,ARS-01-0045447,Beacon International,Not captured,Not captured,Not captured,,,,Shaklawun,Salem,S,10/11/1958,male,Not captured,Not captured,Not captured,Not captured,Not captured,Not captured,Not captured,Not captured,Not captured,Not captured,Not captured,Not captured,Not captured,,,Not captured,Not captured,Not captured,Not captured,2257 West Del Oro Circle,,Mesa,Arizona,85202,,,Not captured,Not captured,misrata01@yahoo.com,Not captured,701824562,,Not captured,Not captured,Not captured,Not captured,Not captured,Not captured,
Not captured,Not captured,10/30/2018,Not captured,Not captured,863949,020,00072,ARS-01-0045427,Beacon International,Not captured,Not captured,Not captured,,,,Castillo,Stephen,,01/23/1985,male,Not captured,Not captured,Not captured,Not captured,Not captured,Not captured,Not captured,Not captured,Not captured,Not captured,Not captured,Not captured,Not captured,,,Not captured,Not captured,Not captured,Not captured,2626 PEACHTREE RD NW,,ATLANTA,Georgia,30305,,,Not captured,Not captured,caponec55@gmail.com,Not captured,701824525,,Not captured,Not captured,Not captured,Not captured,Not captured,Not captured,
Not captured,Not captured,10/30/2018,Not captured,Not captured,863949,020,00072,ARS-01-0045425,Beacon International,Not captured,Not captured,Not captured,Passport(128421404),,,Febres Cordero Briceno,Francisco,P,12/27/1942,male,Not captured,Not captured,Not captured,Not captured,Not captured,Not captured,Not captured,Not captured,Not captured,Not captured,Not captured,Not captured,Not captured,Fernando M Febres Cordero,Son,Not captured,Not captured,Not captured,Not captured,Bugginger str. 2,,Freiburg,Baden-Wurttemberg,79114,+49 761 38422762,,Not captured,Not captured,ferfcc@gmail.com,Not captured,701824522,,Not captured,Not captured,Not captured,Not captured,Not captured,Not captured,
Not captured,Not captured,10/29/2018,Not captured,Not captured,863949,020,00072,ARS-01-0045424,Beacon International,Not captured,Not captured,Not captured,,,,OLEA,MICHAEL,C,03/23/1974,male,Not captured,Not captured,Not captured,Not captured,Not captured,Not captured,Not captured,Not captured,Not captured,Not captured,Not captured,Not captured,Not captured,,,Not captured,Not captured,Not captured,Not captured,3910 W 238th St unit 26,,Torrance,California,90505,,,Not captured,Not captured,nataliyaolea@gmail.com,Not captured,701824521,,Not captured,Not captured,Not captured,Not captured,Not captured,Not captured,
Not captured,Not captured,10/29/2018,Not captured,Not captured,863949,020,00072,ARS-01-0045421,Beacon International,Not captured,Not captured,Not captured,,,,Newman ,Joel ,,05/14/1982,male,Not captured,Not captured,Not captured,Not captured,Not captured,Not captured,Not captured,Not captured,Not captured,Not captured,Not captured,Not captured,Not captured,,,Not captured,Not captured,Not captured,Not captured,120 Bates Dr,,monsey,New York,10952,1347-743-6510,,Not captured,Not captured,jn527b@yahoo.com,Not captured,701824518,,Not captured,Not captured,Not captured,Not captured,Not captured,Not captured,
Not captured,Not captured,10/30/2018,Not captured,Not captured,863949,020,00072,ARS-02-0045418,Beacon America,Not captured,Not captured,Not captured,Passport(A3620062),,,Smart,Ronald Ricardo,,11/24/1993,male,Not captured,Not captured,Not captured,Not captured,Not captured,Not captured,Not captured,Not captured,Not captured,Not captured,Not captured,Not captured,Not captured,Darlene Pittman,other,Not captured,Not captured,Not captured,Not captured,104 Aldridge Lane,,Archdale,North Carolina,27263,3368480982,,Not captured,Not captured,ronsmart93@yahoo.com,Not captured,701824494,,Not captured,Not captured,Not captured,Not captured,Not captured,Not captured,
Not captured,Not captured,10/30/2018,Not captured,Not captured,863949,020,00072,ARS-01-0045416,Beacon International,Not captured,Not captured,Not captured,,,,Fischer,Israel,,12/30/1990,male,Not captured,Not captured,Not captured,Not captured,Not captured,Not captured,Not captured,Not captured,Not captured,Not captured,Not captured,Not captured,Not captured,,,Not captured,Not captured,Not captured,Not captured,1141 54th street,,Brooklyn,New York,11219,718-891-9266,,Not captured,Not captured,ralphandco@gmail.com,Not captured,701824490,,Not captured,Not captured,Not captured,Not captured,Not captured,Not captured,
Not captured,Not captured,10/30/2018,Not captured,Not captured,863949,020,00072,ARS-01-0045415,Beacon International,Not captured,Not captured,Not captured,,,,Fischer,Rafael,,06/12/1981,male,Not captured,Not captured,Not captured,Not captured,Not captured,Not captured,Not captured,Not captured,Not captured,Not captured,Not captured,Not captured,Not captured,,,Not captured,Not captured,Not captured,Not captured,1141 54th street,,Brooklyn,New York,11219,718-891-9266,,Not captured,Not captured,ralphandco@gmail.com,Not captured,701824489,,Not captured,Not captured,Not captured,Not captured,Not captured,Not captured,
Not captured,Not captured,10/30/2018,Not captured,Not captured,863949,020,00072,ARS-01-0045414,Beacon International,Not captured,Not captured,Not captured,,,,Fischer,Hershel,,11/07/1949,male,Not captured,Not captured,Not captured,Not captured,Not captured,Not captured,Not captured,Not captured,Not captured,Not captured,Not captured,Not captured,Not captured,,,Not captured,Not captured,Not captured,Not captured,1141 54th street,,Brooklyn,New York,11219,718-891-9266,,Not captured,Not captured,ralphandco@gmail.com,Not captured,701824488,,Not captured,Not captured,Not captured,Not captured,Not captured,Not captured,
Not captured,Not captured,10/29/2018,Not captured,Not captured,863949,020,00072,ARS-02-0045413,Beacon America,Not captured,Not captured,Not captured,,,,Duggan Hynes,Benjamin,J,06/21/2013,male,Not captured,Not captured,Not captured,Not captured,Not captured,Not captured,Not captured,Not captured,Not captured,Not captured,Not captured,Not captured,Not captured,,,Not captured,Not captured,Not captured,Not captured,7211 IVY CHASE WAY NE,,ATLANTA,GA,30342,7703143449,,Not captured,Not captured,jenniduggan@gmail.com,Not captured,701824487,,Not captured,Not captured,Not captured,Not captured,Not captured,Not captured,
Not captured,Not captured,10/29/2018,Not captured,Not captured,863949,020,00072,ARS-02-0045412,Beacon America,Not captured,Not captured,Not captured,Passport(PC4943511),,,Duggan,Jennifer,A,06/07/1979,female,Not captured,Not captured,Not captured,Not captured,Not captured,Not captured,Not captured,Not captured,Not captured,Not captured,Not captured,Not captured,Not captured,,,Not captured,Not captured,Not captured,Not captured,7211 IVY CHASE WAY NE,,ATLANTA,GA,30342,7703143449,,Not captured,Not captured,jenniduggan@gmail.com,Not captured,701824486,,Not captured,Not captured,Not captured,Not captured,Not captured,Not captured,
Not captured,Not captured,10/30/2018,Not captured,Not captured,863949,020,00072,ARS-02-0045410,Beacon America,Not captured,Not captured,Not captured,,,,Krishnan,Vijayalakshmi,,04/05/1963,female,Not captured,Not captured,Not captured,Not captured,Not captured,Not captured,Not captured,Not captured,Not captured,Not captured,Not captured,Not captured,Not captured,,,Not captured,Not captured,Not captured,Not captured,6241 GLADE AVE,,WOODLAND HILLS,California,91367,,,Not captured,Not captured,shyamkumar.krishna@gmail.com,Not captured,701824483,,Not captured,Not captured,Not captured,Not captured,Not captured,Not captured,
Not captured,Not captured,10/30/2018,Not captured,Not captured,863949,020,00072,ARS-02-0045409,Beacon America,Not captured,Not captured,Not captured,Passport(R7346156),,,Manthramkottil Krishnan,Kumaran,,08/06/1951,male,Not captured,Not captured,Not captured,Not captured,Not captured,Not captured,Not captured,Not captured,Not captured,Not captured,Not captured,Not captured,Not captured,,,Not captured,Not captured,Not captured,Not captured,6241 GLADE AVE,,WOODLAND HILLS,California,91367,,,Not captured,Not captured,shyamkumar.krishna@gmail.com,Not captured,701824482,,Not captured,Not captured,Not captured,Not captured,Not captured,Not captured,
Not captured,Not captured,10/28/2018,Not captured,Not captured,863949,020,00072,ARS-01-0045407,Beacon International,Not captured,Not captured,Not captured,,,,Araujo,Adelaide,l,07/09/1960,female,Not captured,Not captured,Not captured,Not captured,Not captured,Not captured,Not captured,Not captured,Not captured,Not captured,Not captured,Not captured,Not captured,,,Not captured,Not captured,Not captured,Not captured,1537 nestlewood trail,,Orlando,Florida,32837,,,Not captured,Not captured,vieira32837@msn.com,Not captured,701824480,,Not captured,Not captured,Not captured,Not captured,Not captured,Not captured,
Not captured,Not captured,10/29/2018,Not captured,Not captured,863949,020,00072,OVI-28-0045406,OverseasCare Visitors Insurance Plan,Not captured,Not captured,Not captured,Passport(32765345),,,Oeveraas,Nathaniel ,,12/25/2008,male,Not captured,Not captured,Not captured,Not captured,Not captured,Not captured,Not captured,Not captured,Not captured,Not captured,Not captured,Not captured,Not captured,Yasjmine Oeveraas,Mother,Not captured,Not captured,Not captured,Not captured,Ronningveien 12 D,,Tolvsroed,Vestfold,3152,0034693691233,,Not captured,Not captured,yazoveras@gmail.com,Not captured,701824479,,Not captured,Not captured,Not captured,Not captured,Not captured,Not captured,
Not captured,Not captured,10/29/2018,Not captured,Not captured,863949,020,00072,OVI-28-0045405,OverseasCare Visitors Insurance Plan,Not captured,Not captured,Not captured,Passport(32765345),,,Oeveraas,Yasjmine,,02/12/1976,female,Not captured,Not captured,Not captured,Not captured,Not captured,Not captured,Not captured,Not captured,Not captured,Not captured,Not captured,Not captured,Not captured,Yasjmine Oeveraas,Mother,Not captured,Not captured,Not captured,Not captured,Ronningveien 12 D,,Tolvsroed,Vestfold,3152,0034693691233,,Not captured,Not captured,yazoveras@gmail.com,Not captured,701824478,,Not captured,Not captured,Not captured,Not captured,Not captured,Not captured,
Not captured,Not captured,10/28/2018,Not captured,Not captured,863949,020,00072,ARS-02-0045404,Beacon America,Not captured,Not captured,Not captured,,,,Odintsov,Victor,,05/09/1980,male,Not captured,Not captured,Not captured,Not captured,Not captured,Not captured,Not captured,Not captured,Not captured,Not captured,Not captured,Not captured,Not captured,,,Not captured,Not captured,Not captured,Not captured,30-102 Komsomolskaya str.,,Kaliningrad,,236023,,,Not captured,Not captured,victor_odintsov@yahoo.com,Not captured,701824477,,Not captured,Not captured,Not captured,Not captured,Not captured,Not captured,
Not captured,Not captured,10/28/2018,Not captured,Not captured,863949,020,00072,ARS-02-0045403,Beacon America,Not captured,Not captured,Not captured,,,,Petrova,Alina,,11/19/1987,female,Not captured,Not captured,Not captured,Not captured,Not captured,Not captured,Not captured,Not captured,Not captured,Not captured,Not captured,Not captured,Not captured,,,Not captured,Not captured,Not captured,Not captured,30-102 Komsomolskaya str.,,Kaliningrad,,236023,,,Not captured,Not captured,victor_odintsov@yahoo.com,Not captured,701824476,,Not captured,Not captured,Not captured,Not captured,Not captured,Not captured,
Not captured,Not captured,10/28/2018,Not captured,Not captured,863949,020,00072,ARS-01-0045402,Beacon International,Not captured,Not captured,Not captured,,,,ZHOU,BO,,08/02/1981,male,Not captured,Not captured,Not captured,Not captured,Not captured,Not captured,Not captured,Not captured,Not captured,Not captured,Not captured,Not captured,Not captured,,,Not captured,Not captured,Not captured,Not captured,9229 Regents Road L227,,La Jolla,California,92037,,,Not captured,Not captured,bcxzhiwen@gmail.com,Not captured,701824475,,Not captured,Not captured,Not captured,Not captured,Not captured,Not captured,