EE Transaction Type,Dependent Transaction Type,Effective Date,EE Signature,EE Signature Date,Control,Suffix,Account,Plan Number,Plan Name,Claim Office,Network ID Number,Customer Code,EE SSN,Dependent SSN,Dependent Relationship,Last Name,First Name,Middle Initial,DOB,Gender,Ethnicity,PCP/PCD,PCP/PCD Current Patient,Provider Cap Office Number,COB,Dep Student Indicator,Dep OOA Indicator,EE Prior Coverage Indicator,EE Late Entrant,EE Language Indicator,Hire Date,Earnings,Earnings Frequency,Beneficiary (Last Name First Name MI),Beneficiary Relationship,Continuation of Coverage Expiration Date,Continuation of Coverage Event Date,Continuation of Coverage Length of Coverage,Work Location Zip Code,Street Address Line 1,Street Address Line 2,City,State,Zip Code,Home Phone Number,Work Phone Number,Accept Code,Evidence Code,EE Email Address,Communication Disability Code,EE Alternate ID,Dep Alternate ID,Old Control,Old Suffix,Old Account,New Control,New Suffix,New Account,
Not captured,Not captured,10/21/2018,Not captured,Not captured,863949,020,00072,ARS-01-0045290,Beacon International,Not captured,Not captured,Not captured,,,,Goeser,Donald,,08/25/1969,male,Not captured,Not captured,Not captured,Not captured,Not captured,Not captured,Not captured,Not captured,Not captured,Not captured,Not captured,Not captured,Not captured,,,Not captured,Not captured,Not captured,Not captured,430 Bridle Path Road,,Bethlehem,Pennsylvania,18017,,,Not captured,Not captured,micheleanddonald@gmail.com,Not captured,701824284,,Not captured,Not captured,Not captured,Not captured,Not captured,Not captured,
Not captured,Not captured,10/21/2018,Not captured,Not captured,863949,020,00072,ARS-01-0045284,Beacon International,Not captured,Not captured,Not captured,,,,lauster,vivien,h,09/14/1958,female,Not captured,Not captured,Not captured,Not captured,Not captured,Not captured,Not captured,Not captured,Not captured,Not captured,Not captured,Not captured,Not captured,,,Not captured,Not captured,Not captured,Not captured,9625 cloverwood st.,,bellflower,California,90706,,,Not captured,Not captured,prvivien@gmail.com,Not captured,701824278,,Not captured,Not captured,Not captured,Not captured,Not captured,Not captured,
Not captured,Not captured,10/21/2018,Not captured,Not captured,863949,020,00072,ARS-02-0045283,Beacon America,Not captured,Not captured,Not captured,,,,Yin,Olivia,,08/03/2018,female,Not captured,Not captured,Not captured,Not captured,Not captured,Not captured,Not captured,Not captured,Not captured,Not captured,Not captured,Not captured,Not captured,Tianyu Yang,Spouse,Not captured,Not captured,Not captured,Not captured,229 Shelley Ave,,Campbell,California,95008,4136588724,,Not captured,Not captured,tyang.yty@gmail.com,Not captured,701824277,,Not captured,Not captured,Not captured,Not captured,Not captured,Not captured,
Not captured,Not captured,10/21/2018,Not captured,Not captured,863949,020,00072,ARS-02-0045282,Beacon America,Not captured,Not captured,Not captured,,,,Yin,Valentina,,08/31/2014,female,Not captured,Not captured,Not captured,Not captured,Not captured,Not captured,Not captured,Not captured,Not captured,Not captured,Not captured,Not captured,Not captured,Tianyu Yang,Spouse,Not captured,Not captured,Not captured,Not captured,229 Shelley Ave,,Campbell,California,95008,4136588724,,Not captured,Not captured,tyang.yty@gmail.com,Not captured,701824276,,Not captured,Not captured,Not captured,Not captured,Not captured,Not captured,
Not captured,Not captured,10/21/2018,Not captured,Not captured,863949,020,00072,ARS-02-0045281,Beacon America,Not captured,Not captured,Not captured,,,,Yang,Tianyu,,07/13/1980,female,Not captured,Not captured,Not captured,Not captured,Not captured,Not captured,Not captured,Not captured,Not captured,Not captured,Not captured,Not captured,Not captured,Tianyu Yang,Spouse,Not captured,Not captured,Not captured,Not captured,229 Shelley Ave,,Campbell,California,95008,4136588724,,Not captured,Not captured,tyang.yty@gmail.com,Not captured,701824275,,Not captured,Not captured,Not captured,Not captured,Not captured,Not captured,
Not captured,Not captured,10/21/2018,Not captured,Not captured,863949,020,00072,ARS-02-0045280,Beacon America,Not captured,Not captured,Not captured,Passport(HB673742),,,Yin,Hao,,11/18/1980,male,Not captured,Not captured,Not captured,Not captured,Not captured,Not captured,Not captured,Not captured,Not captured,Not captured,Not captured,Not captured,Not captured,Tianyu Yang,Spouse,Not captured,Not captured,Not captured,Not captured,229 Shelley Ave,,Campbell,California,95008,4136588724,,Not captured,Not captured,tyang.yty@gmail.com,Not captured,701824274,,Not captured,Not captured,Not captured,Not captured,Not captured,Not captured,
Not captured,Not captured,10/21/2018,Not captured,Not captured,863949,020,00072,ARS-01-0045279,Beacon International,Not captured,Not captured,Not captured,,,,werner,jennifer,,01/12/1960,female,Not captured,Not captured,Not captured,Not captured,Not captured,Not captured,Not captured,Not captured,Not captured,Not captured,Not captured,Not captured,Not captured,,,Not captured,Not captured,Not captured,Not captured,P.O. Box 101209,,Fort Worth,Texas,76185,,,Not captured,Not captured,mobilemejen@me.com,Not captured,701824273,,Not captured,Not captured,Not captured,Not captured,Not captured,Not captured,
Not captured,Not captured,10/21/2018,Not captured,Not captured,863949,020,00072,ARS-01-0045278,Beacon International,Not captured,Not captured,Not captured,,,,werner,Blaine,,12/04/1953,male,Not captured,Not captured,Not captured,Not captured,Not captured,Not captured,Not captured,Not captured,Not captured,Not captured,Not captured,Not captured,Not captured,,,Not captured,Not captured,Not captured,Not captured,P.O. Box 101209,,Fort Worth,Texas,76185,,,Not captured,Not captured,mobilemejen@me.com,Not captured,701824272,,Not captured,Not captured,Not captured,Not captured,Not captured,Not captured,
Not captured,Not captured,10/20/2018,Not captured,Not captured,863949,020,00072,ARS-01-0045277,Beacon International,Not captured,Not captured,Not captured,,,,Maire,Andrew,,11/03/1978,male,Not captured,Not captured,Not captured,Not captured,Not captured,Not captured,Not captured,Not captured,Not captured,Not captured,Not captured,Not captured,Not captured,,,Not captured,Not captured,Not captured,Not captured,PO Box 132,,Heber,Arizona,85928,,,Not captured,Not captured,andrew.maire@gmail.com,Not captured,701824271,,Not captured,Not captured,Not captured,Not captured,Not captured,Not captured,
Not captured,Not captured,10/20/2018,Not captured,Not captured,863949,020,00072,ARS-01-0045276,Beacon International,Not captured,Not captured,Not captured,,,,Lipar Jr.,Henry,P,04/22/1983,male,Not captured,Not captured,Not captured,Not captured,Not captured,Not captured,Not captured,Not captured,Not captured,Not captured,Not captured,Not captured,Not captured,,,Not captured,Not captured,Not captured,Not captured,861 Girard St,,San Francisco,California,94134,,,Not captured,Not captured,hliparjr@yahoo.com,Not captured,701824269,,Not captured,Not captured,Not captured,Not captured,Not captured,Not captured,
Not captured,Not captured,10/20/2018,Not captured,Not captured,863949,020,00072,ARS-01-0045275,Beacon International,Not captured,Not captured,Not captured,,,,Pun,Ashlyn,M,11/09/1990,female,Not captured,Not captured,Not captured,Not captured,Not captured,Not captured,Not captured,Not captured,Not captured,Not captured,Not captured,Not captured,Not captured,,,Not captured,Not captured,Not captured,Not captured,861 Girard St,,San Francisco,California,94134,,,Not captured,Not captured,hliparjr@yahoo.com,Not captured,701824268,,Not captured,Not captured,Not captured,Not captured,Not captured,Not captured,
Not captured,Not captured,10/20/2018,Not captured,Not captured,863949,020,00072,ARS-01-0045274,Beacon International,Not captured,Not captured,Not captured,,,,Suarez,Sacha,,05/13/1973,female,Not captured,Not captured,Not captured,Not captured,Not captured,Not captured,Not captured,Not captured,Not captured,Not captured,Not captured,Not captured,Not captured,,,Not captured,Not captured,Not captured,Not captured,236 S Lasky Dr,,Beverly Hills,California,90212,,,Not captured,Not captured,emarroquinmd@yahoo.com,Not captured,701824267,,Not captured,Not captured,Not captured,Not captured,Not captured,Not captured,
Not captured,Not captured,10/20/2018,Not captured,Not captured,863949,020,00072,ARS-01-0045273,Beacon International,Not captured,Not captured,Not captured,,,,Marroquin de Salcedo,Edmund,J,08/29/1963,male,Not captured,Not captured,Not captured,Not captured,Not captured,Not captured,Not captured,Not captured,Not captured,Not captured,Not captured,Not captured,Not captured,,,Not captured,Not captured,Not captured,Not captured,236 S Lasky Dr,,Beverly Hills,California,90212,,,Not captured,Not captured,emarroquinmd@yahoo.com,Not captured,701824266,,Not captured,Not captured,Not captured,Not captured,Not captured,Not captured,
Not captured,Not captured,10/20/2018,Not captured,Not captured,863949,020,00072,ARS-01-0045272,Beacon International,Not captured,Not captured,Not captured,,,,Gaff,Hannah,E,08/30/1984,female,Not captured,Not captured,Not captured,Not captured,Not captured,Not captured,Not captured,Not captured,Not captured,Not captured,Not captured,Not captured,Not captured,,,Not captured,Not captured,Not captured,Not captured,455A Valencia St,,San Francisco,California,94103,,,Not captured,Not captured,hannahgaff@gmail.com,Not captured,701824265,,Not captured,Not captured,Not captured,Not captured,Not captured,Not captured,
Not captured,Not captured,10/20/2018,Not captured,Not captured,863949,020,00072,ARS-01-0045271,Beacon International,Not captured,Not captured,Not captured,,,,Gawel,Brendon,J,03/22/1979,male,Not captured,Not captured,Not captured,Not captured,Not captured,Not captured,Not captured,Not captured,Not captured,Not captured,Not captured,Not captured,Not captured,,,Not captured,Not captured,Not captured,Not captured,938 South Saint Bernard Street,,Philadelphia,Pennsylvania,19143,,,Not captured,Not captured,brendongawel@gmail.com,Not captured,701824264,,Not captured,Not captured,Not captured,Not captured,Not captured,Not captured,
Not captured,Not captured,10/20/2018,Not captured,Not captured,863949,020,00072,ARS-01-0045269,Beacon International,Not captured,Not captured,Not captured,,,,Do,Darren,,03/11/1976,male,Not captured,Not captured,Not captured,Not captured,Not captured,Not captured,Not captured,Not captured,Not captured,Not captured,Not captured,Not captured,Not captured,,,Not captured,Not captured,Not captured,Not captured,111 lime ave,,San Gabriel,California,91776,,,Not captured,Not captured,darrenddo@yahoo.com,Not captured,701824262,,Not captured,Not captured,Not captured,Not captured,Not captured,Not captured,
Not captured,Not captured,10/20/2018,Not captured,Not captured,863949,020,00072,ARS-01-0045268,Beacon International,Not captured,Not captured,Not captured,,,,Hu,Xin,Y,12/20/1986,female,Not captured,Not captured,Not captured,Not captured,Not captured,Not captured,Not captured,Not captured,Not captured,Not captured,Not captured,Not captured,Not captured,,,Not captured,Not captured,Not captured,Not captured,3745 Gibson rd,,El Monte,California,91731,,,Not captured,Not captured,hu_doris@yahoo.com,Not captured,701824261,,Not captured,Not captured,Not captured,Not captured,Not captured,Not captured,
Not captured,Not captured,10/20/2018,Not captured,Not captured,863949,020,00072,ARS-02-0045267,Beacon America,Not captured,Not captured,Not captured,,,,Kanuga,Kalpana,,04/28/1942,female,Not captured,Not captured,Not captured,Not captured,Not captured,Not captured,Not captured,Not captured,Not captured,Not captured,Not captured,Not captured,Not captured,Sejal Shah,Daughter,Not captured,Not captured,Not captured,Not captured,747 Easton Lane,,Elk Grove Village,Illinois,60007,8473477510,,Not captured,Not captured,dmssds@yahoo.com,Not captured,701824260,,Not captured,Not captured,Not captured,Not captured,Not captured,Not captured,
Not captured,Not captured,10/19/2018,Not captured,Not captured,863949,020,00072,ARS-02-0045266,Beacon America,Not captured,Not captured,Not captured,Passport(512577181),,,AlSaif,Faisal,K,07/06/1999,male,Not captured,Not captured,Not captured,Not captured,Not captured,Not captured,Not captured,Not captured,Not captured,Not captured,Not captured,Not captured,Not captured,Khalid Alsaif,Father,Not captured,Not captured,Not captured,Not captured,9911 Hessick Ct.,,Great Falls,Virginia,22066,703 757 1838,703 980 8293,Not captured,Not captured,cyntheeah@aol.com,Not captured,701824259,,Not captured,Not captured,Not captured,Not captured,Not captured,Not captured,
Not captured,Not captured,10/19/2018,Not captured,Not captured,863949,020,00072,ARS-02-0045265,Beacon America,Not captured,Not captured,Not captured,,,,Hunger,Joanne,C,04/05/1973,female,Not captured,Not captured,Not captured,Not captured,Not captured,Not captured,Not captured,Not captured,Not captured,Not captured,Not captured,Not captured,Not captured,,,Not captured,Not captured,Not captured,Not captured,Strohgasse 35/5,,Vienna,,1030,,,Not captured,Not captured,joannehunger@gmail.com,Not captured,701824258,,Not captured,Not captured,Not captured,Not captured,Not captured,Not captured,
Not captured,Not captured,10/20/2018,Not captured,Not captured,863949,020,00072,ARS-01-0045264,Beacon International,Not captured,Not captured,Not captured,,,,Izzo,Sergio,,04/30/1959,male,Not captured,Not captured,Not captured,Not captured,Not captured,Not captured,Not captured,Not captured,Not captured,Not captured,Not captured,Not captured,Not captured,,,Not captured,Not captured,Not captured,Not captured,14150 SW 126th Street,,Miami,Florida,33186,,,Not captured,Not captured,gxgcorpus@gmail.com,Not captured,701824257,,Not captured,Not captured,Not captured,Not captured,Not captured,Not captured,
Not captured,Not captured,10/20/2018,Not captured,Not captured,863949,020,00072,ARS-01-0045263,Beacon International,Not captured,Not captured,Not captured,,,,Barker,Lex,,11/22/1965,male,Not captured,Not captured,Not captured,Not captured,Not captured,Not captured,Not captured,Not captured,Not captured,Not captured,Not captured,Not captured,Not captured,,,Not captured,Not captured,Not captured,Not captured,14150 SW 126th Street,,Miami,Florida,33186,,,Not captured,Not captured,gxgcorpus@gmail.com,Not captured,701824256,,Not captured,Not captured,Not captured,Not captured,Not captured,Not captured,
Not captured,Not captured,10/20/2018,Not captured,Not captured,863949,020,00072,ARS-01-0045262,Beacon International,Not captured,Not captured,Not captured,,,,Cardeno,Hernan,,10/08/1965,male,Not captured,Not captured,Not captured,Not captured,Not captured,Not captured,Not captured,Not captured,Not captured,Not captured,Not captured,Not captured,Not captured,,,Not captured,Not captured,Not captured,Not captured,14150 SW 126th Street,,Miami,Florida,33186,,,Not captured,Not captured,gxgcorpus@gmail.com,Not captured,701824255,,Not captured,Not captured,Not captured,Not captured,Not captured,Not captured,
Not captured,Not captured,10/20/2018,Not captured,Not captured,863949,020,00072,ARS-01-0045261,Beacon International,Not captured,Not captured,Not captured,,,,Kruglov,Galina,,05/28/1983,female,Not captured,Not captured,Not captured,Not captured,Not captured,Not captured,Not captured,Not captured,Not captured,Not captured,Not captured,Not captured,Not captured,,,Not captured,Not captured,Not captured,Not captured,14150 SW 126th Street,,Miami,Florida,33186,,,Not captured,Not captured,gxgcorpus@gmail.com,Not captured,701824254,,Not captured,Not captured,Not captured,Not captured,Not captured,Not captured,
Not captured,Not captured,10/20/2018,Not captured,Not captured,863949,020,00072,ARS-01-0045260,Beacon International,Not captured,Not captured,Not captured,,,,Salomon,Sabrice,,02/04/1992,male,Not captured,Not captured,Not captured,Not captured,Not captured,Not captured,Not captured,Not captured,Not captured,Not captured,Not captured,Not captured,Not captured,,,Not captured,Not captured,Not captured,Not captured,14150 SW 126th Street,,Miami,Florida,33186,,,Not captured,Not captured,gxgcorpus@gmail.com,Not captured,701824253,,Not captured,Not captured,Not captured,Not captured,Not captured,Not captured,
Not captured,Not captured,10/20/2018,Not captured,Not captured,863949,020,00072,ARS-01-0045259,Beacon International,Not captured,Not captured,Not captured,,,,Edmond,Cassandra,,01/18/1990,female,Not captured,Not captured,Not captured,Not captured,Not captured,Not captured,Not captured,Not captured,Not captured,Not captured,Not captured,Not captured,Not captured,,,Not captured,Not captured,Not captured,Not captured,14150 SW 126th Street,,Miami,Florida,33186,,,Not captured,Not captured,gxgcorpus@gmail.com,Not captured,701824252,,Not captured,Not captured,Not captured,Not captured,Not captured,Not captured,
Not captured,Not captured,10/19/2018,Not captured,Not captured,863949,020,00072,ARS-01-0045256,Beacon International,Not captured,Not captured,Not captured,,,,Daggett,Emily,G,03/24/1998,female,Not captured,Not captured,Not captured,Not captured,Not captured,Not captured,Not captured,Not captured,Not captured,Not captured,Not captured,Not captured,Not captured,,,Not captured,Not captured,Not captured,Not captured,2903 mid ln,,Houston,Texas,77027,,,Not captured,Not captured,dawndaggett24@gmail.com,Not captured,701824249,,Not captured,Not captured,Not captured,Not captured,Not captured,Not captured,
Not captured,Not captured,10/19/2018,Not captured,Not captured,863949,020,00072,ARS-01-0045255,Beacon International,Not captured,Not captured,Not captured,,,,Stoddard,Robert,,09/09/1991,male,Not captured,Not captured,Not captured,Not captured,Not captured,Not captured,Not captured,Not captured,Not captured,Not captured,Not captured,Not captured,Not captured,,,Not captured,Not captured,Not captured,Not captured,825 Moraga Dr,,Mountainview,California,94041,,,Not captured,Not captured,mcdavidstoddard@me.com,Not captured,701824248,,Not captured,Not captured,Not captured,Not captured,Not captured,Not captured,
Not captured,Not captured,10/20/2018,Not captured,Not captured,863949,020,00072,ARS-02-0045253,Beacon America,Not captured,Not captured,Not captured,Passport(FK899612),,,RODRIGUES,MONICA,MATOS CORREIA,02/23/1985,female,Not captured,Not captured,Not captured,Not captured,Not captured,Not captured,Not captured,Not captured,Not captured,Not captured,Not captured,Not captured,Not captured,SANDRA MATOS CORREIA,MOTHER,Not captured,Not captured,Not captured,Not captured,Rua Borges Lagoa,,SAO PAULO,Espirito Santo,04038000,+5511973434178,,Not captured,Not captured,monicamcr1@hotmail.com,Not captured,701824246,,Not captured,Not captured,Not captured,Not captured,Not captured,Not captured,
Not captured,Not captured,10/19/2018,Not captured,Not captured,863949,020,00072,ARS-01-0045252,Beacon International,Not captured,Not captured,Not captured,,,,Bhumralkar,Yogesh,,03/20/1976,male,Not captured,Not captured,Not captured,Not captured,Not captured,Not captured,Not captured,Not captured,Not captured,Not captured,Not captured,Not captured,Not captured,,,Not captured,Not captured,Not captured,Not captured,1617 Chula Vista Drive,,Belmont,California,94002,,,Not captured,Not captured,ykb20@yahoo.com,Not captured,701824245,,Not captured,Not captured,Not captured,Not captured,Not captured,Not captured,
Not captured,Not captured,10/19/2018,Not captured,Not captured,863949,020,00072,ARS-02-0045246,Beacon America,Not captured,Not captured,Not captured,,,,Irani,Joy,E,01/04/1969,female,Not captured,Not captured,Not captured,Not captured,Not captured,Not captured,Not captured,Not captured,Not captured,Not captured,Not captured,Not captured,Not captured,,,Not captured,Not captured,Not captured,Not captured,230 Wheeler Ave.,,Redwood City,California,94061,,,Not captured,Not captured,joyirani@gmail.com,Not captured,701824238,,Not captured,Not captured,Not captured,Not captured,Not captured,Not captured,
Not captured,Not captured,10/20/2018,Not captured,Not captured,863949,020,00072,ARS-01-0045245,Beacon International,Not captured,Not captured,Not captured,,,,Clifton,James,E,01/15/1992,male,Not captured,Not captured,Not captured,Not captured,Not captured,Not captured,Not captured,Not captured,Not captured,Not captured,Not captured,Not captured,Not captured,,,Not captured,Not captured,Not captured,Not captured,409 Marlborough Street,,Boston,Massachusetts,02115,,,Not captured,Not captured,jclifto295@gmail.com,Not captured,701824237,,Not captured,Not captured,Not captured,Not captured,Not captured,Not captured,
Not captured,Not captured,10/19/2018,Not captured,Not captured,863949,020,00072,OVI-28-0045244,OverseasCare Visitors Insurance Plan,Not captured,Not captured,Not captured,Passport(L1344663),,,Kolla,Surendranath,,08/19/1948,male,Not captured,Not captured,Not captured,Not captured,Not captured,Not captured,Not captured,Not captured,Not captured,Not captured,Not captured,Not captured,Not captured,Harsha Kolla,Son,Not captured,Not captured,Not captured,Not captured,13849 Chamomile Lane,,Frisco,Texas,75035,972-666-8381,,Not captured,Not captured,kollahus@yahoo.com,Not captured,701824236,,Not captured,Not captured,Not captured,Not captured,Not captured,Not captured,
Not captured,Not captured,10/19/2018,Not captured,Not captured,863949,020,00072,ARS-01-0045242,Beacon International,Not captured,Not captured,Not captured,,,,Groden,Judd,,11/16/1986,male,Not captured,Not captured,Not captured,Not captured,Not captured,Not captured,Not captured,Not captured,Not captured,Not captured,Not captured,Not captured,Not captured,,,Not captured,Not captured,Not captured,Not captured,15 Marion pl,,Huntington Station,New York,11746,,,Not captured,Not captured,judd.groden26@gmail.com,Not captured,701824233,,Not captured,Not captured,Not captured,Not captured,Not captured,Not captured,
Not captured,Not captured,10/19/2018,Not captured,Not captured,863949,020,00072,ARS-01-0045241,Beacon International,Not captured,Not captured,Not captured,,,,Bonilla,Walter,,03/17/1993,male,Not captured,Not captured,Not captured,Not captured,Not captured,Not captured,Not captured,Not captured,Not captured,Not captured,Not captured,Not captured,Not captured,,,Not captured,Not captured,Not captured,Not captured,Condominio Nazareth casa 4,,Cartago,,30306,,,Not captured,Not captured,jenicm94@gmail.com,Not captured,701824232,,Not captured,Not captured,Not captured,Not captured,Not captured,Not captured,
Not captured,Not captured,10/19/2018,Not captured,Not captured,863949,020,00072,ARS-01-0045240,Beacon International,Not captured,Not captured,Not captured,,,,Carvajal,Jennifer,,07/09/1994,female,Not captured,Not captured,Not captured,Not captured,Not captured,Not captured,Not captured,Not captured,Not captured,Not captured,Not captured,Not captured,Not captured,,,Not captured,Not captured,Not captured,Not captured,Condominio Nazareth casa 4,,Cartago,,30306,,,Not captured,Not captured,jenicm94@gmail.com,Not captured,701824231,,Not captured,Not captured,Not captured,Not captured,Not captured,Not captured,
Not captured,Not captured,10/18/2018,Not captured,Not captured,863949,020,00072,ARS-01-0045239,Beacon International,Not captured,Not captured,Not captured,,,,Hoogeveen,Marijke,,03/18/1982,female,Not captured,Not captured,Not captured,Not captured,Not captured,Not captured,Not captured,Not captured,Not captured,Not captured,Not captured,Not captured,Not captured,,,Not captured,Not captured,Not captured,Not captured,8501 e. Alameda ave,,Denver,Colorado,80230,,,Not captured,Not captured,Yo_marijke@hotmail.com,Not captured,701824230,,Not captured,Not captured,Not captured,Not captured,Not captured,Not captured,