EE Transaction Type,Dependent Transaction Type,Effective Date,EE Signature,EE Signature Date,Control,Suffix,Account,Plan Number,Plan Name,Claim Office,Network ID Number,Customer Code,EE SSN,Dependent SSN,Dependent Relationship,Last Name,First Name,Middle Initial,DOB,Gender,Ethnicity,PCP/PCD,PCP/PCD Current Patient,Provider Cap Office Number,COB,Dep Student Indicator,Dep OOA Indicator,EE Prior Coverage Indicator,EE Late Entrant,EE Language Indicator,Hire Date,Earnings,Earnings Frequency,Beneficiary (Last Name First Name MI),Beneficiary Relationship,Continuation of Coverage Expiration Date,Continuation of Coverage Event Date,Continuation of Coverage Length of Coverage,Work Location Zip Code,Street Address Line 1,Street Address Line 2,City,State,Zip Code,Home Phone Number,Work Phone Number,Accept Code,Evidence Code,EE Email Address,Communication Disability Code,EE Alternate ID,Dep Alternate ID,Old Control,Old Suffix,Old Account,New Control,New Suffix,New Account,
Not captured,Not captured,10/24/2018,Not captured,Not captured,863949,020,00072,ARS-01-0045342,Beacon International,Not captured,Not captured,Not captured,,,,Rhee,Donovan,M,12/30/1964,male,Not captured,Not captured,Not captured,Not captured,Not captured,Not captured,Not captured,Not captured,Not captured,Not captured,Not captured,Not captured,Not captured,,,Not captured,Not captured,Not captured,Not captured,15727 Tetley St. 5E,,Hacienda Heights,California,91745,,,Not captured,Not captured,forbycw@yahoo.com,Not captured,701824398,,Not captured,Not captured,Not captured,Not captured,Not captured,Not captured,
Not captured,Not captured,10/24/2018,Not captured,Not captured,863949,020,00072,ARS-01-0045341,Beacon International,Not captured,Not captured,Not captured,,,,hickey,sylvia,,05/12/1961,female,Not captured,Not captured,Not captured,Not captured,Not captured,Not captured,Not captured,Not captured,Not captured,Not captured,Not captured,Not captured,Not captured,,,Not captured,Not captured,Not captured,Not captured,13303 brighton view court,,phoenix,Maryland,21131,,,Not captured,Not captured,shickey125@gmail.com,Not captured,701824397,,Not captured,Not captured,Not captured,Not captured,Not captured,Not captured,
Not captured,Not captured,10/24/2018,Not captured,Not captured,863949,020,00072,ARS-01-0045340,Beacon International,Not captured,Not captured,Not captured,,,,hickey,david,b,11/06/1962,male,Not captured,Not captured,Not captured,Not captured,Not captured,Not captured,Not captured,Not captured,Not captured,Not captured,Not captured,Not captured,Not captured,,,Not captured,Not captured,Not captured,Not captured,13303 brighton view court,,phoenix,Maryland,21131,,,Not captured,Not captured,shickey125@gmail.com,Not captured,701824396,,Not captured,Not captured,Not captured,Not captured,Not captured,Not captured,
Not captured,Not captured,10/24/2018,Not captured,Not captured,863949,020,00072,ARS-01-0045339,Beacon International,Not captured,Not captured,Not captured,Passport(108847521),,,Moreno pernia,Lesbia ,Del carmen,12/18/1968,female,Not captured,Not captured,Not captured,Not captured,Not captured,Not captured,Not captured,Not captured,Not captured,Not captured,Not captured,Not captured,Not captured,Paola Murillo Valeria duque ,Hija,Not captured,Not captured,Not captured,Not captured,Lesbia68@hotmail.com,,San Cristobal,Tachira,5001,00584147284378,00582763478190,Not captured,Not captured,lesbia68@hotmail.com,Not captured,701824395,,Not captured,Not captured,Not captured,Not captured,Not captured,Not captured,
Not captured,Not captured,10/24/2018,Not captured,Not captured,863949,020,00072,ARS-01-0045336,Beacon International,Not captured,Not captured,Not captured,,,,Ybarra,Sandra,C,01/27/1972,female,Not captured,Not captured,Not captured,Not captured,Not captured,Not captured,Not captured,Not captured,Not captured,Not captured,Not captured,Not captured,Not captured,,,Not captured,Not captured,Not captured,Not captured,29776 PEACOCK MOUNTAIN DR,,MENIFEE,California,92584,,,Not captured,Not captured,ybarra15@yahoo.com,Not captured,701824392,,Not captured,Not captured,Not captured,Not captured,Not captured,Not captured,
Not captured,Not captured,10/24/2018,Not captured,Not captured,863949,020,00072,ARS-01-0045335,Beacon International,Not captured,Not captured,Not captured,,,,Ybarra,Daniel,T,01/25/1967,male,Not captured,Not captured,Not captured,Not captured,Not captured,Not captured,Not captured,Not captured,Not captured,Not captured,Not captured,Not captured,Not captured,,,Not captured,Not captured,Not captured,Not captured,29776 PEACOCK MOUNTAIN DR,,MENIFEE,California,92584,,,Not captured,Not captured,ybarra15@yahoo.com,Not captured,701824391,,Not captured,Not captured,Not captured,Not captured,Not captured,Not captured,
Not captured,Not captured,10/24/2018,Not captured,Not captured,863949,020,00072,ARS-01-0045334,Beacon International,Not captured,Not captured,Not captured,,,,Daffon,Vera Farah,,10/11/1978,female,Not captured,Not captured,Not captured,Not captured,Not captured,Not captured,Not captured,Not captured,Not captured,Not captured,Not captured,Not captured,Not captured,,,Not captured,Not captured,Not captured,Not captured,42 Kentucky Drive,,Muntinlupa City,,1771,,,Not captured,Not captured,dafave@gmail.com,Not captured,701824390,,Not captured,Not captured,Not captured,Not captured,Not captured,Not captured,
Not captured,Not captured,10/24/2018,Not captured,Not captured,863949,020,00072,ARS-01-0045333,Beacon International,Not captured,Not captured,Not captured,,,,Nieva,Lynwil,A,03/22/1980,female,Not captured,Not captured,Not captured,Not captured,Not captured,Not captured,Not captured,Not captured,Not captured,Not captured,Not captured,Not captured,Not captured,,,Not captured,Not captured,Not captured,Not captured,105 Lilly St. Apt. 2,,Schuylkill Haven,Pennsylvania,17972,,,Not captured,Not captured,candy32280@yahoo.com,Not captured,701824389,,Not captured,Not captured,Not captured,Not captured,Not captured,Not captured,
Not captured,Not captured,10/23/2018,Not captured,Not captured,863949,020,00072,ARS-01-0045329,Beacon International,Not captured,Not captured,Not captured,,,,Cohen,Mark,J,10/04/1966,male,Not captured,Not captured,Not captured,Not captured,Not captured,Not captured,Not captured,Not captured,Not captured,Not captured,Not captured,Not captured,Not captured,,,Not captured,Not captured,Not captured,Not captured,400 East 58 Street,,New york,New York,10022,,,Not captured,Not captured,cohenmark@earthlink.net,Not captured,701824384,,Not captured,Not captured,Not captured,Not captured,Not captured,Not captured,
Not captured,Not captured,10/23/2018,Not captured,Not captured,863949,020,00072,ARS-02-0045328,Beacon America,Not captured,Not captured,Not captured,,,,Tsai,Yu-Dai,,10/29/1986,male,Not captured,Not captured,Not captured,Not captured,Not captured,Not captured,Not captured,Not captured,Not captured,Not captured,Not captured,Not captured,Not captured,,,Not captured,Not captured,Not captured,Not captured,No 138 Shanxi S. St.,,Taichung,,40672,,,Not captured,Not captured,sgre999@gmail.com,Not captured,701824383,,Not captured,Not captured,Not captured,Not captured,Not captured,Not captured,
Not captured,Not captured,10/23/2018,Not captured,Not captured,863949,020,00072,ARS-01-0045324,Beacon International,Not captured,Not captured,Not captured,,,,RODNEY-CROOK,NICOLA,C,05/19/1980,female,Not captured,Not captured,Not captured,Not captured,Not captured,Not captured,Not captured,Not captured,Not captured,Not captured,Not captured,Not captured,Not captured,,,Not captured,Not captured,Not captured,Not captured,801 S St,,San Diego,California,92101,,,Not captured,Not captured,nicolarcrook@gmail.com,Not captured,701824378,,Not captured,Not captured,Not captured,Not captured,Not captured,Not captured,
Not captured,Not captured,10/23/2018,Not captured,Not captured,863949,020,00072,ARS-01-0045323,Beacon International,Not captured,Not captured,Not captured,,,,Werner,Christine ,Louise,08/23/1956,female,Not captured,Not captured,Not captured,Not captured,Not captured,Not captured,Not captured,Not captured,Not captured,Not captured,Not captured,Not captured,Not captured,Harley werner,Daughter,Not captured,Not captured,Not captured,Not captured,183 Promontory Drive West,,Newport Beach,California,92660,9142551225,,Not captured,Not captured,pwerner@pacwestassoc.com,Not captured,701824374,,Not captured,Not captured,Not captured,Not captured,Not captured,Not captured,
Not captured,Not captured,10/23/2018,Not captured,Not captured,863949,020,00072,ARS-01-0045322,Beacon International,Not captured,Not captured,Not captured,Passport(586160398),,,Werner,Philip,H,02/19/1949,male,Not captured,Not captured,Not captured,Not captured,Not captured,Not captured,Not captured,Not captured,Not captured,Not captured,Not captured,Not captured,Not captured,Harley werner,Daughter,Not captured,Not captured,Not captured,Not captured,183 Promontory Drive West,,Newport Beach,California,92660,9142551225,,Not captured,Not captured,pwerner@pacwestassoc.com,Not captured,701824373,,Not captured,Not captured,Not captured,Not captured,Not captured,Not captured,
Not captured,Not captured,10/23/2018,Not captured,Not captured,863949,020,00072,ARS-01-0045321,Beacon International,Not captured,Not captured,Not captured,,,,Perry,Tiffany,,02/09/1982,female,Not captured,Not captured,Not captured,Not captured,Not captured,Not captured,Not captured,Not captured,Not captured,Not captured,Not captured,Not captured,Not captured,,,Not captured,Not captured,Not captured,Not captured,PO Box 36861,,Indianapolis,Indiana,46236,,,Not captured,Not captured,perryt75@gmail.com,Not captured,701824329,,Not captured,Not captured,Not captured,Not captured,Not captured,Not captured,
Not captured,Not captured,10/23/2018,Not captured,Not captured,863949,020,00072,ARS-01-0045314,Beacon International,Not captured,Not captured,Not captured,,,,Raineri,Laura,G,01/01/1970,female,Not captured,Not captured,Not captured,Not captured,Not captured,Not captured,Not captured,Not captured,Not captured,Not captured,Not captured,Not captured,Not captured,,,Not captured,Not captured,Not captured,Not captured,63 OAK ST,,DOVER,New Hampshire,03820,,,Not captured,Not captured,shooshie@msn.com,Not captured,701824319,,Not captured,Not captured,Not captured,Not captured,Not captured,Not captured,
Not captured,Not captured,10/23/2018,Not captured,Not captured,863949,020,00072,ARS-03-0045177,Essential America,Not captured,Not captured,Not captured,Passport(HK268267),,,Kauntz,Karin,Michelle,04/24/1972,female,Not captured,Not captured,Not captured,Not captured,Not captured,Not captured,Not captured,Not captured,Not captured,Not captured,Not captured,Not captured,Not captured,,,Not captured,Not captured,Not captured,Not captured,172 Queen St N,,Kitchener,Ontario,N2H2Z2,5195032356,,Not captured,Not captured,om.namaste@gmail.com,Not captured,701824132,,Not captured,Not captured,Not captured,Not captured,Not captured,Not captured,
Not captured,Not captured,10/23/2018,Not captured,Not captured,863949,020,00072,ARS-03-0045177,Essential America,Not captured,Not captured,Not captured,,Passport(HC818653),Spouse,Tanner,Jonathon,,04/05/1977,male,Not captured,Not captured,Not captured,Not captured,Not captured,Not captured,Not captured,Not captured,Not captured,Not captured,Not captured,Not captured,Not captured,,,Not captured,Not captured,Not captured,Not captured,172 Queen St N,,Kitchener,Ontario,N2H2Z2,5195032356,,Not captured,Not captured,om.namaste@gmail.com,Not captured,,701824133,Not captured,Not captured,Not captured,Not captured,Not captured,Not captured,
Not captured,Not captured,10/23/2018,Not captured,Not captured,863949,020,00072,ARS-01-0045312,Beacon International,Not captured,Not captured,Not captured,,,,Robertson,Jazmine,,10/27/1990,female,Not captured,Not captured,Not captured,Not captured,Not captured,Not captured,Not captured,Not captured,Not captured,Not captured,Not captured,Not captured,Not captured,,,Not captured,Not captured,Not captured,Not captured,6381 Robertson Lane,,Smithfield,Virginia,23430,,,Not captured,Not captured,jazrae6@gmail.com,Not captured,701824317,,Not captured,Not captured,Not captured,Not captured,Not captured,Not captured,
Not captured,Not captured,10/23/2018,Not captured,Not captured,863949,020,00072,ARS-01-0045311,Beacon International,Not captured,Not captured,Not captured,,,,McDonough,Lee,A,02/09/1960,female,Not captured,Not captured,Not captured,Not captured,Not captured,Not captured,Not captured,Not captured,Not captured,Not captured,Not captured,Not captured,Not captured,,,Not captured,Not captured,Not captured,Not captured,1037 dauphine st,,New Orleans,Louisiana,70116,,,Not captured,Not captured,leeonroyal@aol.com,Not captured,701824312,,Not captured,Not captured,Not captured,Not captured,Not captured,Not captured,
Not captured,Not captured,10/23/2018,Not captured,Not captured,863949,020,00072,ARS-02-0045310,Beacon America,Not captured,Not captured,Not captured,,,,Favero,Nicolo,,10/14/1992,male,Not captured,Not captured,Not captured,Not captured,Not captured,Not captured,Not captured,Not captured,Not captured,Not captured,Not captured,Not captured,Not captured,,,Not captured,Not captured,Not captured,Not captured,Flat 3,,Oxford,,OX2 7BY,,,Not captured,Not captured,eurostarroma@yahoo.it,Not captured,701824311,,Not captured,Not captured,Not captured,Not captured,Not captured,Not captured,
Not captured,Not captured,10/23/2018,Not captured,Not captured,863949,020,00072,ARS-01-0045309,Beacon International,Not captured,Not captured,Not captured,,,,Saunders,Natasha,,10/02/1986,female,Not captured,Not captured,Not captured,Not captured,Not captured,Not captured,Not captured,Not captured,Not captured,Not captured,Not captured,Not captured,Not captured,,,Not captured,Not captured,Not captured,Not captured,1830 Fremont Cr NW,,Roanoke,Virginia,24017,,,Not captured,Not captured,nnsaunde@vt.edu,Not captured,701824310,,Not captured,Not captured,Not captured,Not captured,Not captured,Not captured,
Not captured,Not captured,10/23/2018,Not captured,Not captured,863949,020,00072,ARS-02-0045307,Beacon America,Not captured,Not captured,Not captured,,,,Reinhardt,Danielle,,04/03/1985,female,Not captured,Not captured,Not captured,Not captured,Not captured,Not captured,Not captured,Not captured,Not captured,Not captured,Not captured,Not captured,Not captured,,,Not captured,Not captured,Not captured,Not captured,Tower 3 AlGassar Resort,,Doha,,Na,,,Not captured,Not captured,daniellereinhardt@gmail.com,Not captured,701824308,,Not captured,Not captured,Not captured,Not captured,Not captured,Not captured,
Not captured,Not captured,10/23/2018,Not captured,Not captured,863949,020,00072,ARS-02-0045305,Beacon America,Not captured,Not captured,Not captured,,,,Birkmyre,Alexander,,05/24/1991,male,Not captured,Not captured,Not captured,Not captured,Not captured,Not captured,Not captured,Not captured,Not captured,Not captured,Not captured,Not captured,Not captured,,,Not captured,Not captured,Not captured,Not captured,138 The Grampians,,London,England,W6 7NB,7147138750,,Not captured,Not captured,alexander.birkmyre133@gmail.com,Not captured,701824306,,Not captured,Not captured,Not captured,Not captured,Not captured,Not captured,
Not captured,Not captured,10/22/2018,Not captured,Not captured,863949,020,00072,ARS-01-0045304,Beacon International,Not captured,Not captured,Not captured,,,,Coile,Courtney,M,02/20/1991,female,Not captured,Not captured,Not captured,Not captured,Not captured,Not captured,Not captured,Not captured,Not captured,Not captured,Not captured,Not captured,Not captured,,,Not captured,Not captured,Not captured,Not captured,1834 NE Hancock St,,Portland,Georgia,97212,,,Not captured,Not captured,cmcoile225@gmail.com,Not captured,701824305,,Not captured,Not captured,Not captured,Not captured,Not captured,Not captured,
Not captured,Not captured,10/23/2018,Not captured,Not captured,863949,020,00072,ARS-01-0045302,Beacon International,Not captured,Not captured,Not captured,,,,Schuler,Randy,M,04/04/1952,male,Not captured,Not captured,Not captured,Not captured,Not captured,Not captured,Not captured,Not captured,Not captured,Not captured,Not captured,Not captured,Not captured,,,Not captured,Not captured,Not captured,Not captured,2620 W CAMINO LLANO,,Tucson,Arizona,85742,,,Not captured,Not captured,rms110@comcast.net,Not captured,701824303,,Not captured,Not captured,Not captured,Not captured,Not captured,Not captured,
Not captured,Not captured,10/23/2018,Not captured,Not captured,863949,020,00072,ARS-01-0045301,Beacon International,Not captured,Not captured,Not captured,,,,Schuler,Breck,W,05/29/1981,male,Not captured,Not captured,Not captured,Not captured,Not captured,Not captured,Not captured,Not captured,Not captured,Not captured,Not captured,Not captured,Not captured,,,Not captured,Not captured,Not captured,Not captured,2620 W CAMINO LLANO,,Tucson,Arizona,85742,,,Not captured,Not captured,rms110@comcast.net,Not captured,701824302,,Not captured,Not captured,Not captured,Not captured,Not captured,Not captured,
Not captured,Not captured,10/22/2018,Not captured,Not captured,863949,020,00072,ARS-04-0045270,Enhanced International,Not captured,Not captured,Not captured,Passport(511131842),,,Gwynne,Timothy ,mark,01/20/1971,male,Not captured,Not captured,Not captured,Not captured,Not captured,Not captured,Not captured,Not captured,Not captured,Not captured,Not captured,Not captured,Not captured,,,Not captured,Not captured,Not captured,Not captured,99 High Street,,Brierley Hill,England,DY5 4RN,07732408952,,Not captured,Not captured,timmgwynne@gmail.com,Not captured,701824263,,Not captured,Not captured,Not captured,Not captured,Not captured,Not captured,
Not captured,Not captured,10/22/2018,Not captured,Not captured,863949,020,00072,ARS-01-0045300,Beacon International,Not captured,Not captured,Not captured,,,,Lovett,Rachel,,09/13/1983,female,Not captured,Not captured,Not captured,Not captured,Not captured,Not captured,Not captured,Not captured,Not captured,Not captured,Not captured,Not captured,Not captured,,,Not captured,Not captured,Not captured,Not captured,3719 Par Rd.,,Sebring,Florida,33872,,,Not captured,Not captured,rachel.lovett@aol.com,Not captured,701824296,,Not captured,Not captured,Not captured,Not captured,Not captured,Not captured,
Not captured,Not captured,10/22/2018,Not captured,Not captured,863949,020,00072,ARS-01-0045299,Beacon International,Not captured,Not captured,Not captured,,,,Lovett,Will,,09/16/1975,male,Not captured,Not captured,Not captured,Not captured,Not captured,Not captured,Not captured,Not captured,Not captured,Not captured,Not captured,Not captured,Not captured,,,Not captured,Not captured,Not captured,Not captured,3719 Par Rd.,,Sebring,Florida,33872,,,Not captured,Not captured,rachel.lovett@aol.com,Not captured,701824295,,Not captured,Not captured,Not captured,Not captured,Not captured,Not captured,
Not captured,Not captured,10/22/2018,Not captured,Not captured,863949,020,00072,ARS-01-0045297,Beacon International,Not captured,Not captured,Not captured,,,,Kanno,Mariam,,10/04/1991,female,Not captured,Not captured,Not captured,Not captured,Not captured,Not captured,Not captured,Not captured,Not captured,Not captured,Not captured,Not captured,Not captured,,,Not captured,Not captured,Not captured,Not captured,3022 putter Ct,,El Cajon,California,92019,,,Not captured,Not captured,samerkanno@gmail.com,Not captured,701824291,,Not captured,Not captured,Not captured,Not captured,Not captured,Not captured,
Not captured,Not captured,10/22/2018,Not captured,Not captured,863949,020,00072,ARS-01-0045296,Beacon International,Not captured,Not captured,Not captured,,,,kanno,Samer,,06/22/1979,male,Not captured,Not captured,Not captured,Not captured,Not captured,Not captured,Not captured,Not captured,Not captured,Not captured,Not captured,Not captured,Not captured,,,Not captured,Not captured,Not captured,Not captured,3022 putter Ct,,El Cajon,California,92019,,,Not captured,Not captured,samerkanno@gmail.com,Not captured,701824290,,Not captured,Not captured,Not captured,Not captured,Not captured,Not captured,
Not captured,Not captured,10/22/2018,Not captured,Not captured,863949,020,00072,ARS-01-0045295,Beacon International,Not captured,Not captured,Not captured,,,,Aragon,Yvette,,12/02/1987,female,Not captured,Not captured,Not captured,Not captured,Not captured,Not captured,Not captured,Not captured,Not captured,Not captured,Not captured,Not captured,Not captured,,,Not captured,Not captured,Not captured,Not captured,3469 Liberty Blvd,,South Gate,California,90280,,,Not captured,Not captured,powerram41@gmail.com,Not captured,701824289,,Not captured,Not captured,Not captured,Not captured,Not captured,Not captured,
Not captured,Not captured,10/22/2018,Not captured,Not captured,863949,020,00072,ARS-01-0045294,Beacon International,Not captured,Not captured,Not captured,,,,Herrera,Jose,,01/10/1987,male,Not captured,Not captured,Not captured,Not captured,Not captured,Not captured,Not captured,Not captured,Not captured,Not captured,Not captured,Not captured,Not captured,,,Not captured,Not captured,Not captured,Not captured,3469 Liberty Blvd,,South Gate,California,90280,,,Not captured,Not captured,powerram41@gmail.com,Not captured,701824288,,Not captured,Not captured,Not captured,Not captured,Not captured,Not captured,
Not captured,Not captured,10/22/2018,Not captured,Not captured,863949,020,00072,ARS-02-0045293,Beacon America,Not captured,Not captured,Not captured,,,,Harvey,Terence,,02/17/1955,male,Not captured,Not captured,Not captured,Not captured,Not captured,Not captured,Not captured,Not captured,Not captured,Not captured,Not captured,Not captured,Not captured,,,Not captured,Not captured,Not captured,Not captured,600 Greenfield Ave #1805,,Kitchener,Ontario,N2C2J9,,,Not captured,Not captured,yatikharvey@gmail.com,Not captured,701824287,,Not captured,Not captured,Not captured,Not captured,Not captured,Not captured,
Not captured,Not captured,10/22/2018,Not captured,Not captured,863949,020,00072,ARS-02-0045292,Beacon America,Not captured,Not captured,Not captured,,,,kahan,norhayati,,08/30/1960,female,Not captured,Not captured,Not captured,Not captured,Not captured,Not captured,Not captured,Not captured,Not captured,Not captured,Not captured,Not captured,Not captured,,,Not captured,Not captured,Not captured,Not captured,600 Greenfield Ave #1805,,Kitchener,Ontario,N2C2J9,,,Not captured,Not captured,yatikharvey@gmail.com,Not captured,701824286,,Not captured,Not captured,Not captured,Not captured,Not captured,Not captured,
Not captured,Not captured,10/22/2018,Not captured,Not captured,863949,020,00072,ARS-02-0045291,Beacon America,Not captured,Not captured,Not captured,,,,thompson,jen,,09/27/1984,male,Not captured,Not captured,Not captured,Not captured,Not captured,Not captured,Not captured,Not captured,Not captured,Not captured,Not captured,Not captured,Not captured,carol thompson,mum,Not captured,Not captured,Not captured,Not captured,938 N Genesse Ave,,los angeles,California,90046,6467072442,,Not captured,Not captured,jenni@jennithompson.co.uk,Not captured,701824285,,Not captured,Not captured,Not captured,Not captured,Not captured,Not captured,
Not captured,Not captured,10/21/2018,Not captured,Not captured,863949,020,00072,ARS-01-0045290,Beacon International,Not captured,Not captured,Not captured,,,,Goeser,Donald,,08/25/1969,male,Not captured,Not captured,Not captured,Not captured,Not captured,Not captured,Not captured,Not captured,Not captured,Not captured,Not captured,Not captured,Not captured,,,Not captured,Not captured,Not captured,Not captured,430 Bridle Path Road,,Bethlehem,Pennsylvania,18017,,,Not captured,Not captured,micheleanddonald@gmail.com,Not captured,701824284,,Not captured,Not captured,Not captured,Not captured,Not captured,Not captured,