EE Transaction Type,Dependent Transaction Type,Effective Date,EE Signature,EE Signature Date,Control,Suffix,Account,Plan Number,Plan Name,Claim Office,Network ID Number,Customer Code,EE SSN,Dependent SSN,Dependent Relationship,Last Name,First Name,Middle Initial,DOB,Gender,Ethnicity,PCP/PCD,PCP/PCD Current Patient,Provider Cap Office Number,COB,Dep Student Indicator,Dep OOA Indicator,EE Prior Coverage Indicator,EE Late Entrant,EE Language Indicator,Hire Date,Earnings,Earnings Frequency,Beneficiary (Last Name First Name MI),Beneficiary Relationship,Continuation of Coverage Expiration Date,Continuation of Coverage Event Date,Continuation of Coverage Length of Coverage,Work Location Zip Code,Street Address Line 1,Street Address Line 2,City,State,Zip Code,Home Phone Number,Work Phone Number,Accept Code,Evidence Code,EE Email Address,Communication Disability Code,EE Alternate ID,Dep Alternate ID,Old Control,Old Suffix,Old Account,New Control,New Suffix,New Account,
Not captured,Not captured,10/15/2018,Not captured,Not captured,863949,020,00072,ARS-01-0045171,Beacon International,Not captured,Not captured,Not captured,,,,Shevlin,Ryan,J,05/11/1983,male,Not captured,Not captured,Not captured,Not captured,Not captured,Not captured,Not captured,Not captured,Not captured,Not captured,Not captured,Not captured,Not captured,,,Not captured,Not captured,Not captured,Not captured,3408 Richmond Blvd,,Oakland,California,94611,,,Not captured,Not captured,ryanshevlin@outlook.com,Not captured,701824122,,Not captured,Not captured,Not captured,Not captured,Not captured,Not captured,
Not captured,Not captured,10/15/2018,Not captured,Not captured,863949,020,00072,ARS-01-0045165,Beacon International,Not captured,Not captured,Not captured,,,,Streicher,Rafael,,03/18/1968,male,Not captured,Not captured,Not captured,Not captured,Not captured,Not captured,Not captured,Not captured,Not captured,Not captured,Not captured,Not captured,Not captured,,,Not captured,Not captured,Not captured,Not captured,1118 48th Street,,Brooklyn,New York,11219,732-276-2445,,Not captured,Not captured,designbydevora@yahoo.com,Not captured,701824071,,Not captured,Not captured,Not captured,Not captured,Not captured,Not captured,
Not captured,Not captured,10/15/2018,Not captured,Not captured,863949,020,00072,ARS-02-0045162,Beacon America,Not captured,Not captured,Not captured,,,,kahan,norhayati,,08/30/1960,female,Not captured,Not captured,Not captured,Not captured,Not captured,Not captured,Not captured,Not captured,Not captured,Not captured,Not captured,Not captured,Not captured,,,Not captured,Not captured,Not captured,Not captured,600 Greenfield Ave #1805,,Kitchener,Ontario,N2C2J9,,,Not captured,Not captured,yatikharvey@gmail.com,Not captured,701824063,,Not captured,Not captured,Not captured,Not captured,Not captured,Not captured,
Not captured,Not captured,10/15/2018,Not captured,Not captured,863949,020,00072,ARS-02-0045161,Beacon America,Not captured,Not captured,Not captured,,,,Harvey,Terence,,02/17/1955,male,Not captured,Not captured,Not captured,Not captured,Not captured,Not captured,Not captured,Not captured,Not captured,Not captured,Not captured,Not captured,Not captured,,,Not captured,Not captured,Not captured,Not captured,600 Greenfield Ave #1805,,Kitchener,Ontario,N2C2J9,,,Not captured,Not captured,yatikharvey@gmail.com,Not captured,701824062,,Not captured,Not captured,Not captured,Not captured,Not captured,Not captured,
Not captured,Not captured,10/15/2018,Not captured,Not captured,863949,020,00072,ARS-01-0045158,Beacon International,Not captured,Not captured,Not captured,,,,Stanislowski,Sarah,A,09/13/1989,female,Not captured,Not captured,Not captured,Not captured,Not captured,Not captured,Not captured,Not captured,Not captured,Not captured,Not captured,Not captured,Not captured,,,Not captured,Not captured,Not captured,Not captured,4523 33rd st,,San diego,California,92116,,,Not captured,Not captured,safarigirl899@gmail.com,Not captured,701824059,,Not captured,Not captured,Not captured,Not captured,Not captured,Not captured,
Not captured,Not captured,10/15/2018,Not captured,Not captured,863949,020,00072,ARS-02-0045156,Beacon America,Not captured,Not captured,Not captured,,,,Tjon En Fa,Jair,J,10/19/1993,male,Not captured,Not captured,Not captured,Not captured,Not captured,Not captured,Not captured,Not captured,Not captured,Not captured,Not captured,Not captured,Not captured,,,Not captured,Not captured,Not captured,Not captured,14 Mafoengostraat,,Paramaribo,,0000,,,Not captured,Not captured,epfrankel@yahoo.com,Not captured,701824057,,Not captured,Not captured,Not captured,Not captured,Not captured,Not captured,
Not captured,Not captured,10/14/2018,Not captured,Not captured,863949,020,00072,ARS-01-0045155,Beacon International,Not captured,Not captured,Not captured,,,,Stanton,John,L,05/08/1949,male,Not captured,Not captured,Not captured,Not captured,Not captured,Not captured,Not captured,Not captured,Not captured,Not captured,Not captured,Not captured,Not captured,,,Not captured,Not captured,Not captured,Not captured,706 Omandale Dr,,Nashville,Tennessee,37204,,,Not captured,Not captured,vgstanton@yahoo.com,Not captured,701824042,,Not captured,Not captured,Not captured,Not captured,Not captured,Not captured,
Not captured,Not captured,10/14/2018,Not captured,Not captured,863949,020,00072,ARS-01-0045154,Beacon International,Not captured,Not captured,Not captured,,,,Stanton,Vickie,G,05/08/1957,female,Not captured,Not captured,Not captured,Not captured,Not captured,Not captured,Not captured,Not captured,Not captured,Not captured,Not captured,Not captured,Not captured,,,Not captured,Not captured,Not captured,Not captured,706 Omandale Dr,,Nashville,Tennessee,37204,,,Not captured,Not captured,vgstanton@yahoo.com,Not captured,701824041,,Not captured,Not captured,Not captured,Not captured,Not captured,Not captured,
Not captured,Not captured,10/14/2018,Not captured,Not captured,863949,020,00072,ARS-01-0045152,Beacon International,Not captured,Not captured,Not captured,,,,Langer,Eliana,H,06/06/1995,female,Not captured,Not captured,Not captured,Not captured,Not captured,Not captured,Not captured,Not captured,Not captured,Not captured,Not captured,Not captured,Not captured,,,Not captured,Not captured,Not captured,Not captured,140 W 74TH ST APT 2E,,New York,New York,10023,,,Not captured,Not captured,elianahlanger@gmail.com,Not captured,701824037,,Not captured,Not captured,Not captured,Not captured,Not captured,Not captured,
Not captured,Not captured,10/14/2018,Not captured,Not captured,863949,020,00072,ARS-01-0045151,Beacon International,Not captured,Not captured,Not captured,,,,Ho-Asjoe,Henrietta,C,06/24/1960,female,Not captured,Not captured,Not captured,Not captured,Not captured,Not captured,Not captured,Not captured,Not captured,Not captured,Not captured,Not captured,Not captured,,,Not captured,Not captured,Not captured,Not captured,1725 York Avenue,,New York,New York,10128,,,Not captured,Not captured,hojablon@earthlink.net,Not captured,701824036,,Not captured,Not captured,Not captured,Not captured,Not captured,Not captured,
Not captured,Not captured,10/14/2018,Not captured,Not captured,863949,020,00072,ARS-01-0045150,Beacon International,Not captured,Not captured,Not captured,,,,Jablon,Steven,D,12/01/1954,male,Not captured,Not captured,Not captured,Not captured,Not captured,Not captured,Not captured,Not captured,Not captured,Not captured,Not captured,Not captured,Not captured,,,Not captured,Not captured,Not captured,Not captured,1725 York Avenue,,New York,New York,10128,,,Not captured,Not captured,hojablon@earthlink.net,Not captured,701824035,,Not captured,Not captured,Not captured,Not captured,Not captured,Not captured,
Not captured,Not captured,10/14/2018,Not captured,Not captured,863949,020,00072,ARS-01-0045149,Beacon International,Not captured,Not captured,Not captured,,,,REILLY,MATTHEW,J,12/30/1958,male,Not captured,Not captured,Not captured,Not captured,Not captured,Not captured,Not captured,Not captured,Not captured,Not captured,Not captured,Not captured,Not captured,,,Not captured,Not captured,Not captured,Not captured,2625 Midway Branch Dr.,,Odenton,Maryland,21113,,,Not captured,Not captured,chartering@celticshipping.com,Not captured,701824034,,Not captured,Not captured,Not captured,Not captured,Not captured,Not captured,
Not captured,Not captured,10/15/2018,Not captured,Not captured,863949,020,00072,ARS-02-0045148,Beacon America,Not captured,Not captured,Not captured,Passport(23087998),,,Misiuniene,Aldona,,10/22/1939,male,Not captured,Not captured,Not captured,Not captured,Not captured,Not captured,Not captured,Not captured,Not captured,Not captured,Not captured,Not captured,Not captured,Vile Statkus,Daughter,Not captured,Not captured,Not captured,Not captured,16046 Johns Lake Overlook Dr,,Winter Garden,Florida,34787,407-334-4830,,Not captured,Not captured,lstatkus@gmail.com,Not captured,701824033,,Not captured,Not captured,Not captured,Not captured,Not captured,Not captured,
Not captured,Not captured,10/14/2018,Not captured,Not captured,863949,020,00072,ARS-01-0045147,Beacon International,Not captured,Not captured,Not captured,,,,Bennett,Cecile,,07/05/1946,female,Not captured,Not captured,Not captured,Not captured,Not captured,Not captured,Not captured,Not captured,Not captured,Not captured,Not captured,Not captured,Not captured,,,Not captured,Not captured,Not captured,Not captured,46 Slocum Path,,Palm Coast,Florida,32164,,,Not captured,Not captured,cecilebennett@bellsouth.net,Not captured,701824032,,Not captured,Not captured,Not captured,Not captured,Not captured,Not captured,
Not captured,Not captured,10/14/2018,Not captured,Not captured,863949,020,00072,ARS-01-0045146,Beacon International,Not captured,Not captured,Not captured,,,,Nehman,Barbara,,09/04/1942,female,Not captured,Not captured,Not captured,Not captured,Not captured,Not captured,Not captured,Not captured,Not captured,Not captured,Not captured,Not captured,Not captured,,,Not captured,Not captured,Not captured,Not captured,12307 Bar X Drive,,Austin,Texas,78727,,,Not captured,Not captured,gnehman@gmail.com,Not captured,701824031,,Not captured,Not captured,Not captured,Not captured,Not captured,Not captured,
Not captured,Not captured,10/14/2018,Not captured,Not captured,863949,020,00072,ARS-01-0045145,Beacon International,Not captured,Not captured,Not captured,,,,Nehman,Gerald,,01/07/1942,male,Not captured,Not captured,Not captured,Not captured,Not captured,Not captured,Not captured,Not captured,Not captured,Not captured,Not captured,Not captured,Not captured,,,Not captured,Not captured,Not captured,Not captured,12307 Bar X Drive,,Austin,Texas,78727,,,Not captured,Not captured,gnehman@gmail.com,Not captured,701824030,,Not captured,Not captured,Not captured,Not captured,Not captured,Not captured,
Not captured,Not captured,10/14/2018,Not captured,Not captured,863949,020,00072,ARS-01-0045144,Beacon International,Not captured,Not captured,Not captured,,,,McIntyre,Linda,L,12/30/1958,female,Not captured,Not captured,Not captured,Not captured,Not captured,Not captured,Not captured,Not captured,Not captured,Not captured,Not captured,Not captured,Not captured,,,Not captured,Not captured,Not captured,Not captured,10 Noblewoods Way,,ORMOND BEACH,Florida,32174,,,Not captured,Not captured,lmcintyre@earthlink.net,Not captured,701824029,,Not captured,Not captured,Not captured,Not captured,Not captured,Not captured,
Not captured,Not captured,10/14/2018,Not captured,Not captured,863949,020,00072,ARS-01-0045143,Beacon International,Not captured,Not captured,Not captured,,,,Dundara-Staub,Daniela,D,10/27/1965,female,Not captured,Not captured,Not captured,Not captured,Not captured,Not captured,Not captured,Not captured,Not captured,Not captured,Not captured,Not captured,Not captured,,,Not captured,Not captured,Not captured,Not captured,20 South St,,Haverstraw,New York,10927,,,Not captured,Not captured,Danielastaub@gmail.com,Not captured,701824028,,Not captured,Not captured,Not captured,Not captured,Not captured,Not captured,
Not captured,Not captured,10/14/2018,Not captured,Not captured,863949,020,00072,ARS-02-0045142,Beacon America,Not captured,Not captured,Not captured,,,,Porter,Heather,A,06/13/1986,female,Not captured,Not captured,Not captured,Not captured,Not captured,Not captured,Not captured,Not captured,Not captured,Not captured,Not captured,Not captured,Not captured,,,Not captured,Not captured,Not captured,Not captured,3060 NE MCwilliams RD #73,,Bremerton,Washington,98311,,,Not captured,Not captured,hporter86@gmail.com,Not captured,701824027,,Not captured,Not captured,Not captured,Not captured,Not captured,Not captured,
Not captured,Not captured,10/15/2018,Not captured,Not captured,863949,020,00072,ARS-01-0045141,Beacon International,Not captured,Not captured,Not captured,,,,Ogneva,Viktoriia,,09/27/1992,female,Not captured,Not captured,Not captured,Not captured,Not captured,Not captured,Not captured,Not captured,Not captured,Not captured,Not captured,Not captured,Not captured,,,Not captured,Not captured,Not captured,Not captured,Moskovskaya 15-13,,Volgograd,,400010,,,Not captured,Not captured,intvoker@gmail.com,Not captured,701824026,,Not captured,Not captured,Not captured,Not captured,Not captured,Not captured,
Not captured,Not captured,10/14/2018,Not captured,Not captured,863949,020,00072,ARS-01-0045140,Beacon International,Not captured,Not captured,Not captured,,,,Emelianov,Andrey,,05/24/1983,male,Not captured,Not captured,Not captured,Not captured,Not captured,Not captured,Not captured,Not captured,Not captured,Not captured,Not captured,Not captured,Not captured,,,Not captured,Not captured,Not captured,Not captured,2250 Monroe St 156,,Santa Clara,California,95050,,,Not captured,Not captured,intvoker@gmail.com,Not captured,701824025,,Not captured,Not captured,Not captured,Not captured,Not captured,Not captured,
Not captured,Not captured,10/14/2018,Not captured,Not captured,863949,020,00072,ARS-01-0045139,Beacon International,Not captured,Not captured,Not captured,,,,vantrees,aiyana,,03/10/1994,female,Not captured,Not captured,Not captured,Not captured,Not captured,Not captured,Not captured,Not captured,Not captured,Not captured,Not captured,Not captured,Not captured,,,Not captured,Not captured,Not captured,Not captured,8645 sw 57th place,,cooper city,Florida,33328,,,Not captured,Not captured,lara.vantrees@browardschools.com,Not captured,701824024,,Not captured,Not captured,Not captured,Not captured,Not captured,Not captured,
Not captured,Not captured,10/13/2018,Not captured,Not captured,863949,020,00072,ARS-01-0045138,Beacon International,Not captured,Not captured,Not captured,,,,Nalleweg,Garth,,06/28/1962,male,Not captured,Not captured,Not captured,Not captured,Not captured,Not captured,Not captured,Not captured,Not captured,Not captured,Not captured,Not captured,Not captured,,,Not captured,Not captured,Not captured,Not captured,P.O. 1834,,Rancho Mirage,California,92270,,,Not captured,Not captured,blbow1149@gmail.com,Not captured,701824023,,Not captured,Not captured,Not captured,Not captured,Not captured,Not captured,
Not captured,Not captured,10/13/2018,Not captured,Not captured,863949,020,00072,ARS-01-0045137,Beacon International,Not captured,Not captured,Not captured,,,,Bowen,Barry,,11/29/1949,male,Not captured,Not captured,Not captured,Not captured,Not captured,Not captured,Not captured,Not captured,Not captured,Not captured,Not captured,Not captured,Not captured,,,Not captured,Not captured,Not captured,Not captured,P.O. 1834,,Rancho Mirage,California,92270,,,Not captured,Not captured,blbow1149@gmail.com,Not captured,701824022,,Not captured,Not captured,Not captured,Not captured,Not captured,Not captured,
Not captured,Not captured,10/14/2018,Not captured,Not captured,863949,020,00072,ARS-01-0045133,Beacon International,Not captured,Not captured,Not captured,Passport(533788413),,,Quinly,Johnathan,J,03/11/1987,male,Not captured,Not captured,Not captured,Not captured,Not captured,Not captured,Not captured,Not captured,Not captured,Not captured,Not captured,Not captured,Not captured,,,Not captured,Not captured,Not captured,Not captured,110 Ravenhill Rd,,Orinda,California,94563,925-858-9000,,Not captured,Not captured,JohnQuinly@gmail.com,Not captured,701824018,,Not captured,Not captured,Not captured,Not captured,Not captured,Not captured,
Not captured,Not captured,10/14/2018,Not captured,Not captured,863949,020,00072,ARS-01-0045132,Beacon International,Not captured,Not captured,Not captured,Passport(94509194),,,Charria Sanin,Andres Hernan,,09/02/1975,male,Not captured,Not captured,Not captured,Not captured,Not captured,Not captured,Not captured,Not captured,Not captured,Not captured,Not captured,Not captured,Not captured,Camila Sanin,Mother,Not captured,Not captured,Not captured,Not captured,Carrera 102 17-37,,Cali,Valle del Cauca,760032,573165225105,573165225105,Not captured,Not captured,admin@cnx.co,Not captured,701824017,,Not captured,Not captured,Not captured,Not captured,Not captured,Not captured,
Not captured,Not captured,10/14/2018,Not captured,Not captured,863949,020,00072,ARS-01-0045130,Beacon International,Not captured,Not captured,Not captured,,,,Gibbs,Ann Marie,,08/05/1964,female,Not captured,Not captured,Not captured,Not captured,Not captured,Not captured,Not captured,Not captured,Not captured,Not captured,Not captured,Not captured,Not captured,,,Not captured,Not captured,Not captured,Not captured,3353 NE 2 ND DR,,Homeatead,Florida,33033,,,Not captured,Not captured,annmariegibbs90@hotmail.com,Not captured,701824015,,Not captured,Not captured,Not captured,Not captured,Not captured,Not captured,
Not captured,Not captured,10/13/2018,Not captured,Not captured,863949,020,00072,ARS-01-0045129,Beacon International,Not captured,Not captured,Not captured,,,,Wizorek,Johnny,,02/20/1972,female,Not captured,Not captured,Not captured,Not captured,Not captured,Not captured,Not captured,Not captured,Not captured,Not captured,Not captured,Not captured,Not captured,,,Not captured,Not captured,Not captured,Not captured,1412 Margina Ave,,Daytona Beach,Florida,32114,,,Not captured,Not captured,thewizz@gowizz.com,Not captured,701824014,,Not captured,Not captured,Not captured,Not captured,Not captured,Not captured,
Not captured,Not captured,10/13/2018,Not captured,Not captured,863949,020,00072,ARS-01-0045128,Beacon International,Not captured,Not captured,Not captured,,,,Zheng,Xingwei,,09/28/1992,male,Not captured,Not captured,Not captured,Not captured,Not captured,Not captured,Not captured,Not captured,Not captured,Not captured,Not captured,Not captured,Not captured,,,Not captured,Not captured,Not captured,Not captured,544 40TH ST,,Union City,New Jersey,07087,,,Not captured,Not captured,xingweizzzzz@gmail.com,Not captured,701824013,,Not captured,Not captured,Not captured,Not captured,Not captured,Not captured,
Not captured,Not captured,10/13/2018,Not captured,Not captured,863949,020,00072,ARS-01-0045127,Beacon International,Not captured,Not captured,Not captured,,,,Haydt,Jonah,,04/27/2016,male,Not captured,Not captured,Not captured,Not captured,Not captured,Not captured,Not captured,Not captured,Not captured,Not captured,Not captured,Not captured,Not captured,,,Not captured,Not captured,Not captured,Not captured,33 Niblick Ln,,Greenland,New Hampshire,03840,,,Not captured,Not captured,steffen@haydt.us,Not captured,701824012,,Not captured,Not captured,Not captured,Not captured,Not captured,Not captured,
Not captured,Not captured,10/13/2018,Not captured,Not captured,863949,020,00072,ARS-01-0045126,Beacon International,Not captured,Not captured,Not captured,,,,Haydt,Mareike,,11/05/1979,female,Not captured,Not captured,Not captured,Not captured,Not captured,Not captured,Not captured,Not captured,Not captured,Not captured,Not captured,Not captured,Not captured,,,Not captured,Not captured,Not captured,Not captured,33 Niblick Ln,,Greenland,New Hampshire,03840,,,Not captured,Not captured,steffen@haydt.us,Not captured,701824011,,Not captured,Not captured,Not captured,Not captured,Not captured,Not captured,
Not captured,Not captured,10/13/2018,Not captured,Not captured,863949,020,00072,ARS-01-0045125,Beacon International,Not captured,Not captured,Not captured,,,,Knight,Brandon,,09/10/1988,male,Not captured,Not captured,Not captured,Not captured,Not captured,Not captured,Not captured,Not captured,Not captured,Not captured,Not captured,Not captured,Not captured,,,Not captured,Not captured,Not captured,Not captured,804 fox trail,,Buffalo,Minnesota,55313,,,Not captured,Not captured,knigh149@gmail.com,Not captured,701824010,,Not captured,Not captured,Not captured,Not captured,Not captured,Not captured,
Not captured,Not captured,10/12/2018,Not captured,Not captured,863949,020,00072,ARS-02-0045114,Beacon America,Not captured,Not captured,Not captured,,,,Zhao,Xixing,,08/09/1973,male,Not captured,Not captured,Not captured,Not captured,Not captured,Not captured,Not captured,Not captured,Not captured,Not captured,Not captured,Not captured,Not captured,,,Not captured,Not captured,Not captured,Not captured,13 Stillman Cir,,Natick,Massachusetts,01760,,,Not captured,Not captured,amyang2002@gmail.com,Not captured,701823995,,Not captured,Not captured,Not captured,Not captured,Not captured,Not captured,
Not captured,Not captured,10/12/2018,Not captured,Not captured,863949,020,00072,ARS-01-0045113,Beacon International,Not captured,Not captured,Not captured,,,,Rosberg,Ellen,F,09/15/1989,female,Not captured,Not captured,Not captured,Not captured,Not captured,Not captured,Not captured,Not captured,Not captured,Not captured,Not captured,Not captured,Not captured,,,Not captured,Not captured,Not captured,Not captured,1104 N Marshall St,,Milwaukee,Wisconsin,53202,,,Not captured,Not captured,ellierosberg1@gmail.com,Not captured,701823994,,Not captured,Not captured,Not captured,Not captured,Not captured,Not captured,
Not captured,Not captured,10/12/2018,Not captured,Not captured,863949,020,00072,ARS-02-0045112,Beacon America,Not captured,Not captured,Not captured,,,,Trajanovic,Mila,,12/21/1967,female,Not captured,Not captured,Not captured,Not captured,Not captured,Not captured,Not captured,Not captured,Not captured,Not captured,Not captured,Not captured,Not captured,,,Not captured,Not captured,Not captured,Not captured,14 The Arbors,,New Providence,New Jersey,07974,,,Not captured,Not captured,mila.trajanovic@yahoo.com,Not captured,701823993,,Not captured,Not captured,Not captured,Not captured,Not captured,Not captured,
Not captured,Not captured,10/12/2018,Not captured,Not captured,863949,020,00072,ARS-01-0045111,Beacon International,Not captured,Not captured,Not captured,,,,McNally,Kathrine,,06/14/1976,female,Not captured,Not captured,Not captured,Not captured,Not captured,Not captured,Not captured,Not captured,Not captured,Not captured,Not captured,Not captured,Not captured,,,Not captured,Not captured,Not captured,Not captured,1444 Kilrush Drive,,Ormond Beach,Florida,32174,,,Not captured,Not captured,mcnally.lynn@gmail.com,Not captured,701823974,,Not captured,Not captured,Not captured,Not captured,Not captured,Not captured,
Not captured,Not captured,10/12/2018,Not captured,Not captured,863949,020,00072,ARS-01-0045110,Beacon International,Not captured,Not captured,Not captured,,,,McNally,Lynwood,,05/13/1949,female,Not captured,Not captured,Not captured,Not captured,Not captured,Not captured,Not captured,Not captured,Not captured,Not captured,Not captured,Not captured,Not captured,,,Not captured,Not captured,Not captured,Not captured,1444 Kilrush Drive,,Ormond Beach,Florida,32174,,,Not captured,Not captured,mcnally.lynn@gmail.com,Not captured,701823973,,Not captured,Not captured,Not captured,Not captured,Not captured,Not captured,