EE Transaction Type,Dependent Transaction Type,Effective Date,EE Signature,EE Signature Date,Control,Suffix,Account,Plan Number,Plan Name,Claim Office,Network ID Number,Customer Code,EE SSN,Dependent SSN,Dependent Relationship,Last Name,First Name,Middle Initial,DOB,Gender,Ethnicity,PCP/PCD,PCP/PCD Current Patient,Provider Cap Office Number,COB,Dep Student Indicator,Dep OOA Indicator,EE Prior Coverage Indicator,EE Late Entrant,EE Language Indicator,Hire Date,Earnings,Earnings Frequency,Beneficiary (Last Name First Name MI),Beneficiary Relationship,Continuation of Coverage Expiration Date,Continuation of Coverage Event Date,Continuation of Coverage Length of Coverage,Work Location Zip Code,Street Address Line 1,Street Address Line 2,City,State,Zip Code,Home Phone Number,Work Phone Number,Accept Code,Evidence Code,EE Email Address,Communication Disability Code,EE Alternate ID,Dep Alternate ID,Old Control,Old Suffix,Old Account,New Control,New Suffix,New Account,
Not captured,Not captured,10/10/2018,Not captured,Not captured,863949,020,00072,ARS-01-0045063,Beacon International,Not captured,Not captured,Not captured,,,,Heimfeld,David,,09/24/1999,male,Not captured,Not captured,Not captured,Not captured,Not captured,Not captured,Not captured,Not captured,Not captured,Not captured,Not captured,Not captured,Not captured,,,Not captured,Not captured,Not captured,Not captured,110 Hadassah Lane,,Lakewood,New Jersey,08701,732-330-0263,,Not captured,Not captured,joseph@edisonlitho.com,Not captured,701823891,,Not captured,Not captured,Not captured,Not captured,Not captured,Not captured,
Not captured,Not captured,10/10/2018,Not captured,Not captured,863949,020,00072,ARS-01-0045062,Beacon International,Not captured,Not captured,Not captured,,,,March,Yehoshuah,,04/21/2002,male,Not captured,Not captured,Not captured,Not captured,Not captured,Not captured,Not captured,Not captured,Not captured,Not captured,Not captured,Not captured,Not captured,,,Not captured,Not captured,Not captured,Not captured,740 omaha Court,,Lakewood,New Jersey,08701,908-910-4391,,Not captured,Not captured,ymsgraphics@gmail.com,Not captured,701823890,,Not captured,Not captured,Not captured,Not captured,Not captured,Not captured,
Not captured,Not captured,10/10/2018,Not captured,Not captured,863949,020,00072,ARS-01-0045060,Beacon International,Not captured,Not captured,Not captured,,,,Epstein,Leslie,,02/02/1966,female,Not captured,Not captured,Not captured,Not captured,Not captured,Not captured,Not captured,Not captured,Not captured,Not captured,Not captured,Not captured,Not captured,,,Not captured,Not captured,Not captured,Not captured,780 GREENWICH ST,,NEW YORK,New York,10014-5930,,,Not captured,Not captured,leslie.epstein@gmail.com,Not captured,701823888,,Not captured,Not captured,Not captured,Not captured,Not captured,Not captured,
Not captured,Not captured,10/10/2018,Not captured,Not captured,863949,020,00072,ARS-01-0045059,Beacon International,Not captured,Not captured,Not captured,,,,Stein ,Joseph Chaim,,06/14/1993,male,Not captured,Not captured,Not captured,Not captured,Not captured,Not captured,Not captured,Not captured,Not captured,Not captured,Not captured,Not captured,Not captured,,,Not captured,Not captured,Not captured,Not captured,1558 Coney Island Ave,,Brooklyn,New York,11230,347-355-7094,,Not captured,Not captured,Pinnyeff@gmail.co,Not captured,701823887,,Not captured,Not captured,Not captured,Not captured,Not captured,Not captured,
Not captured,Not captured,10/10/2018,Not captured,Not captured,863949,020,00072,ARS-02-0045053,Beacon America,Not captured,Not captured,Not captured,,,,Eisenberg,Saadia,,01/01/1970,female,Not captured,Not captured,Not captured,Not captured,Not captured,Not captured,Not captured,Not captured,Not captured,Not captured,Not captured,Not captured,Not captured,,,Not captured,Not captured,Not captured,Not captured,1758 East 29th street,,Brooklyn,New York,11230,347-515-1692,,Not captured,Not captured,skyesyx@aol.com,Not captured,701823879,,Not captured,Not captured,Not captured,Not captured,Not captured,Not captured,
Not captured,Not captured,10/10/2018,Not captured,Not captured,863949,020,00072,ARS-01-0045052,Beacon International,Not captured,Not captured,Not captured,,,,Sharar,Regina,R,07/26/1952,female,Not captured,Not captured,Not captured,Not captured,Not captured,Not captured,Not captured,Not captured,Not captured,Not captured,Not captured,Not captured,Not captured,,,Not captured,Not captured,Not captured,Not captured,Bill sharar,,Tucson,Arizona,85716,,,Not captured,Not captured,gsharar@mac.com,Not captured,701823877,,Not captured,Not captured,Not captured,Not captured,Not captured,Not captured,
Not captured,Not captured,10/10/2018,Not captured,Not captured,863949,020,00072,ARS-01-0045051,Beacon International,Not captured,Not captured,Not captured,,,,Pichon,Kimberly,A,10/06/1975,female,Not captured,Not captured,Not captured,Not captured,Not captured,Not captured,Not captured,Not captured,Not captured,Not captured,Not captured,Not captured,Not captured,,,Not captured,Not captured,Not captured,Not captured,775 Nettlebrook Ln,,Milton,Georgia,30004,,,Not captured,Not captured,azpichon@yahoo.com,Not captured,701823876,,Not captured,Not captured,Not captured,Not captured,Not captured,Not captured,
Not captured,Not captured,10/10/2018,Not captured,Not captured,863949,020,00072,ARS-01-0045050,Beacon International,Not captured,Not captured,Not captured,,,,Pichon,Adam,Z,03/29/1974,male,Not captured,Not captured,Not captured,Not captured,Not captured,Not captured,Not captured,Not captured,Not captured,Not captured,Not captured,Not captured,Not captured,,,Not captured,Not captured,Not captured,Not captured,775 Nettlebrook Ln,,Milton,Georgia,30004,,,Not captured,Not captured,azpichon@yahoo.com,Not captured,701823875,,Not captured,Not captured,Not captured,Not captured,Not captured,Not captured,
Not captured,Not captured,10/10/2018,Not captured,Not captured,863949,020,00072,ARS-01-0045049,Beacon International,Not captured,Not captured,Not captured,,,,Arcia,Benjamin,,09/15/1988,male,Not captured,Not captured,Not captured,Not captured,Not captured,Not captured,Not captured,Not captured,Not captured,Not captured,Not captured,Not captured,Not captured,,,Not captured,Not captured,Not captured,Not captured,338 W Thorn St,,San Diego,California,92103,,,Not captured,Not captured,benjamin.arcia@gmail.com,Not captured,701823874,,Not captured,Not captured,Not captured,Not captured,Not captured,Not captured,
Not captured,Not captured,10/10/2018,Not captured,Not captured,863949,020,00072,ARS-01-0045048,Beacon International,Not captured,Not captured,Not captured,,,,Callender,Lisa,A,01/14/1991,female,Not captured,Not captured,Not captured,Not captured,Not captured,Not captured,Not captured,Not captured,Not captured,Not captured,Not captured,Not captured,Not captured,,,Not captured,Not captured,Not captured,Not captured,338 W Thorn St,,San Diego,California,92103,,,Not captured,Not captured,benjamin.arcia@gmail.com,Not captured,701823873,,Not captured,Not captured,Not captured,Not captured,Not captured,Not captured,
Not captured,Not captured,10/10/2018,Not captured,Not captured,863949,020,00072,ARS-02-0045044,Beacon America,Not captured,Not captured,Not captured,,,,Kapustina,Nina,,08/01/1950,female,Not captured,Not captured,Not captured,Not captured,Not captured,Not captured,Not captured,Not captured,Not captured,Not captured,Not captured,Not captured,Not captured,,,Not captured,Not captured,Not captured,Not captured,3a Pervomayskaya Street Apt. 1,,Oktyabrsky Arkhagelskoi Oblasti,,165210,,,Not captured,Not captured,nvkapustina@gmail.com,Not captured,701823869,,Not captured,Not captured,Not captured,Not captured,Not captured,Not captured,
Not captured,Not captured,10/09/2018,Not captured,Not captured,863949,020,00072,ARS-02-0045034,Beacon America,Not captured,Not captured,Not captured,Passport(AU960947),,,ORTIZ VARGAS,RAFAEL ALBERTO,,06/09/1987,male,Not captured,Not captured,Not captured,Not captured,Not captured,Not captured,Not captured,Not captured,Not captured,Not captured,Not captured,Not captured,Not captured,JORGE ORTIZ ,PADRE,Not captured,Not captured,Not captured,Not captured,CARRERA 24A #194-47,,BOGOTA,Distrito Capltal de Santa Fe de Bogot&atilde;,057,3202709462,,Not captured,Not captured,RAFAEL.ORTIZ.VA@GMAIL.COM,Not captured,701823854,,Not captured,Not captured,Not captured,Not captured,Not captured,Not captured,
Not captured,Not captured,10/09/2018,Not captured,Not captured,863949,020,00072,ARS-01-0045031,Beacon International,Not captured,Not captured,Not captured,,,,Halloran,Jonathan,M,04/08/1970,male,Not captured,Not captured,Not captured,Not captured,Not captured,Not captured,Not captured,Not captured,Not captured,Not captured,Not captured,Not captured,Not captured,,,Not captured,Not captured,Not captured,Not captured,4514 N Whipple St,,Chicago,Illinois,60625,,,Not captured,Not captured,jonathan.halloran@gmail.com,Not captured,701823840,,Not captured,Not captured,Not captured,Not captured,Not captured,Not captured,
Not captured,Not captured,10/10/2018,Not captured,Not captured,863949,020,00072,OVI-28-0045030,OverseasCare Visitors Insurance Plan,Not captured,Not captured,Not captured,Passport(K9103529),,,Kothapalli,Sumathi,,05/25/1946,female,Not captured,Not captured,Not captured,Not captured,Not captured,Not captured,Not captured,Not captured,Not captured,Not captured,Not captured,Not captured,Not captured,Sridhar Kothaplli,Son,Not captured,Not captured,Not captured,Not captured,13024 Eagles Entry Drive,,Odessa,Florida,33556,8134315604,,Not captured,Not captured,skothapalli@yahoo.com,Not captured,701823839,,Not captured,Not captured,Not captured,Not captured,Not captured,Not captured,
Not captured,Not captured,10/10/2018,Not captured,Not captured,863949,020,00072,OVI-28-0045029,OverseasCare Visitors Insurance Plan,Not captured,Not captured,Not captured,Passport(K9103529),,,Kothapalli,Ramanaiah Naidu,,07/15/1939,male,Not captured,Not captured,Not captured,Not captured,Not captured,Not captured,Not captured,Not captured,Not captured,Not captured,Not captured,Not captured,Not captured,Sridhar Kothaplli,Son,Not captured,Not captured,Not captured,Not captured,13024 Eagles Entry Drive,,Odessa,Florida,33556,8134315604,,Not captured,Not captured,skothapalli@yahoo.com,Not captured,701823838,,Not captured,Not captured,Not captured,Not captured,Not captured,Not captured,
Not captured,Not captured,10/09/2018,Not captured,Not captured,863949,020,00072,ARS-03-0045009,Essential America,Not captured,Not captured,Not captured,Passport(DL#HOOPEBK397J6),,,Hoopes,Brett,K,04/26/1961,male,Not captured,Not captured,Not captured,Not captured,Not captured,Not captured,Not captured,Not captured,Not captured,Not captured,Not captured,Not captured,Not captured,,,Not captured,Not captured,Not captured,Not captured,80265 Riviera,,La Quinta,California,92253,2069998775,,Not captured,Not captured,hoopes9@gmail.com,Not captured,701823751,,Not captured,Not captured,Not captured,Not captured,Not captured,Not captured,
Not captured,Not captured,10/09/2018,Not captured,Not captured,863949,020,00072,ARS-03-0045009,Essential America,Not captured,Not captured,Not captured,,Passport(DL#HOOPESA322RC),Spouse,Hoopes,Stacey,Anne,12/03/1968,female,Not captured,Not captured,Not captured,Not captured,Not captured,Not captured,Not captured,Not captured,Not captured,Not captured,Not captured,Not captured,Not captured,,,Not captured,Not captured,Not captured,Not captured,80265 Riviera,,La Quinta,California,92253,2069998775,,Not captured,Not captured,hoopes9@gmail.com,Not captured,,701823752,Not captured,Not captured,Not captured,Not captured,Not captured,Not captured,
Not captured,Not captured,10/10/2018,Not captured,Not captured,863949,020,00072,ARS-01-0045028,Beacon International,Not captured,Not captured,Not captured,Passport(512766415),,,Saxton,Donald James,,06/26/1956,male,Not captured,Not captured,Not captured,Not captured,Not captured,Not captured,Not captured,Not captured,Not captured,Not captured,Not captured,Not captured,Not captured,Kyle Saxton,son,Not captured,Not captured,Not captured,Not captured,101 Ranchetts Rd,,Bigfork,Montana,59911,406 871 0162,,Not captured,Not captured,djsshimoda@gmail.com,Not captured,701823837,,Not captured,Not captured,Not captured,Not captured,Not captured,Not captured,
Not captured,Not captured,10/09/2018,Not captured,Not captured,863949,020,00072,ARS-01-0045025,Beacon International,Not captured,Not captured,Not captured,Passport(727128300),,,KORNILOV,SERGEY,GEORGIEVICH,10/12/1970,male,Not captured,Not captured,Not captured,Not captured,Not captured,Not captured,Not captured,Not captured,Not captured,Not captured,Not captured,Not captured,Not captured,Nina Ivanovna Kornilova,Friend,Not captured,Not captured,Not captured,Not captured,st Volokolamskiy proezd,,Moscow,Moskva,123060,+37281667995,,Not captured,Not captured,metsaimpex@bk.ru,Not captured,701823834,,Not captured,Not captured,Not captured,Not captured,Not captured,Not captured,
Not captured,Not captured,10/09/2018,Not captured,Not captured,863949,020,00072,ARS-01-0045024,Beacon International,Not captured,Not captured,Not captured,,,,Freund,Herman,,06/19/1996,male,Not captured,Not captured,Not captured,Not captured,Not captured,Not captured,Not captured,Not captured,Not captured,Not captured,Not captured,Not captured,Not captured,,,Not captured,Not captured,Not captured,Not captured,731 Wythe Avenue,,Brooklyn,,11249,,,Not captured,Not captured,Avrumy1155@gmail.Com,Not captured,701823833,,Not captured,Not captured,Not captured,Not captured,Not captured,Not captured,
Not captured,Not captured,10/09/2018,Not captured,Not captured,863949,020,00072,ARS-01-0045023,Beacon International,Not captured,Not captured,Not captured,,,,Wilner,Avrohom,,02/28/1995,male,Not captured,Not captured,Not captured,Not captured,Not captured,Not captured,Not captured,Not captured,Not captured,Not captured,Not captured,Not captured,Not captured,,,Not captured,Not captured,Not captured,Not captured,1235 45,,Brooklyn,,11219,,,Not captured,Not captured,Avrumy1155@gmail.Com,Not captured,701823832,,Not captured,Not captured,Not captured,Not captured,Not captured,Not captured,
Not captured,Not captured,10/09/2018,Not captured,Not captured,863949,020,00072,ARS-02-0045021,Beacon America,Not captured,Not captured,Not captured,Passport(R0519434),,,Zaman,Nazim,Khan,12/08/1960,male,Not captured,Not captured,Not captured,Not captured,Not captured,Not captured,Not captured,Not captured,Not captured,Not captured,Not captured,Not captured,Not captured,Bibi Shafeena Khan,Fiance,Not captured,Not captured,Not captured,Not captured,245 Hein Drive,,Clayton,,27527,6462447952,9192438839,Not captured,Not captured,tejroin@gmail.com,Not captured,701823830,,Not captured,Not captured,Not captured,Not captured,Not captured,Not captured,
Not captured,Not captured,10/08/2018,Not captured,Not captured,863949,020,00072,ARS-03-0044958,Essential International,Not captured,Not captured,Not captured,Passport(HK983646),,,MCGRATH,MARK,BERNARD,09/10/1957,male,Not captured,Not captured,Not captured,Not captured,Not captured,Not captured,Not captured,Not captured,Not captured,Not captured,Not captured,Not captured,Not captured,,,Not captured,Not captured,Not captured,Not captured,50 CHURCH ST,,TORONTO,Ontario,M4L1H5,4163896453,,Not captured,Not captured,loscabos29@yahoo.ca,Not captured,701823640,,Not captured,Not captured,Not captured,Not captured,Not captured,Not captured,
Not captured,Not captured,10/09/2018,Not captured,Not captured,863949,020,00072,ARS-01-0045017,Beacon International,Not captured,Not captured,Not captured,,,,Katz,Rachelle,,11/18/1976,female,Not captured,Not captured,Not captured,Not captured,Not captured,Not captured,Not captured,Not captured,Not captured,Not captured,Not captured,Not captured,Not captured,,,Not captured,Not captured,Not captured,Not captured,620 Apollo Road,,Lakewood,New Jersey,08701,732-961-9633,,Not captured,Not captured,Shaya@primeins.com,Not captured,701823780,,Not captured,Not captured,Not captured,Not captured,Not captured,Not captured,
Not captured,Not captured,10/08/2018,Not captured,Not captured,863949,020,00072,ARS-01-0045016,Beacon International,Not captured,Not captured,Not captured,,,,jones,Michael,s,10/01/1970,male,Not captured,Not captured,Not captured,Not captured,Not captured,Not captured,Not captured,Not captured,Not captured,Not captured,Not captured,Not captured,Not captured,,,Not captured,Not captured,Not captured,Not captured,214 fossil trace,,milton,Georgia,30004,,,Not captured,Not captured,Michael.Jones@thrivefarmers.com,Not captured,701823779,,Not captured,Not captured,Not captured,Not captured,Not captured,Not captured,
Not captured,Not captured,10/08/2018,Not captured,Not captured,863949,020,00072,ARS-01-0045015,Beacon International,Not captured,Not captured,Not captured,,,,Davies,Sean,,12/23/1991,male,Not captured,Not captured,Not captured,Not captured,Not captured,Not captured,Not captured,Not captured,Not captured,Not captured,Not captured,Not captured,Not captured,,,Not captured,Not captured,Not captured,Not captured,3461cheechako dr,,Reno,Nevada,89519,,,Not captured,Not captured,Spdavies@ymail.com,Not captured,701823778,,Not captured,Not captured,Not captured,Not captured,Not captured,Not captured,
Not captured,Not captured,10/09/2018,Not captured,Not captured,863949,020,00072,ARS-01-0045014,Beacon International,Not captured,Not captured,Not captured,,,,Katz,Rachelle,,11/18/1976,female,Not captured,Not captured,Not captured,Not captured,Not captured,Not captured,Not captured,Not captured,Not captured,Not captured,Not captured,Not captured,Not captured,,,Not captured,Not captured,Not captured,Not captured,620 Apollo road,,Lakewood,New Jersey,08701,7329619633,,Not captured,Not captured,shaya@primeins.com,Not captured,701823777,,Not captured,Not captured,Not captured,Not captured,Not captured,Not captured,
Not captured,Not captured,10/08/2018,Not captured,Not captured,863949,020,00072,ARS-01-0045013,Beacon International,Not captured,Not captured,Not captured,Passport(220222329),,,ELLENBERG,ETHAN,,09/29/1954,male,Not captured,Not captured,Not captured,Not captured,Not captured,Not captured,Not captured,Not captured,Not captured,Not captured,Not captured,Not captured,Not captured,BARBARA GLICKSTEIN,WIFE,Not captured,Not captured,Not captured,Not captured,548 BROADWAY,,NEW YORK,,10012,914-431-4554,212-431-4554,Not captured,Not captured,ETHAN@ETHANELLENBERG.COM,Not captured,701823776,,Not captured,Not captured,Not captured,Not captured,Not captured,Not captured,
Not captured,Not captured,10/08/2018,Not captured,Not captured,863949,020,00072,ARS-01-0045011,Beacon International,Not captured,Not captured,Not captured,,,,Parkman,Michael,D,05/02/1965,male,Not captured,Not captured,Not captured,Not captured,Not captured,Not captured,Not captured,Not captured,Not captured,Not captured,Not captured,Not captured,Not captured,,,Not captured,Not captured,Not captured,Not captured,859 Hanover Way,,Lakeland,Florida,33813-2676,,,Not captured,Not captured,mparkman1@gmail.com,Not captured,701823755,,Not captured,Not captured,Not captured,Not captured,Not captured,Not captured,
Not captured,Not captured,10/10/2018,Not captured,Not captured,863949,020,00072,ARS-01-0045008,Beacon International,Not captured,Not captured,Not captured,,,,Rivett,Sean,S,01/07/1989,male,Not captured,Not captured,Not captured,Not captured,Not captured,Not captured,Not captured,Not captured,Not captured,Not captured,Not captured,Not captured,Not captured,,,Not captured,Not captured,Not captured,Not captured,58 Kingsland Road,,London,,E2 8DP,,,Not captured,Not captured,seanrivett@gmail.com,Not captured,701823750,,Not captured,Not captured,Not captured,Not captured,Not captured,Not captured,
Not captured,Not captured,10/08/2018,Not captured,Not captured,863949,020,00072,ARS-01-0045006,Beacon International,Not captured,Not captured,Not captured,,,,Hoyt,Michael,,04/15/1958,male,Not captured,Not captured,Not captured,Not captured,Not captured,Not captured,Not captured,Not captured,Not captured,Not captured,Not captured,Not captured,Not captured,,,Not captured,Not captured,Not captured,Not captured,6789 Quail Hill Pkwy #809,,Irivine,California,92603,,,Not captured,Not captured,mhoyt@att.net,Not captured,701823748,,Not captured,Not captured,Not captured,Not captured,Not captured,Not captured,
Not captured,Not captured,10/08/2018,Not captured,Not captured,863949,020,00072,ARS-01-0045005,Beacon International,Not captured,Not captured,Not captured,,,,Torices,Maria,,08/08/1955,female,Not captured,Not captured,Not captured,Not captured,Not captured,Not captured,Not captured,Not captured,Not captured,Not captured,Not captured,Not captured,Not captured,,,Not captured,Not captured,Not captured,Not captured,6789 Quail Hill Pkwy #809,,Irivine,California,92603,,,Not captured,Not captured,mhoyt@att.net,Not captured,701823747,,Not captured,Not captured,Not captured,Not captured,Not captured,Not captured,
Not captured,Not captured,10/10/2018,Not captured,Not captured,863949,020,00072,ARS-02-0045004,Beacon America,Not captured,Not captured,Not captured,,,,Mehta,Mamta,R,11/08/1966,female,Not captured,Not captured,Not captured,Not captured,Not captured,Not captured,Not captured,Not captured,Not captured,Not captured,Not captured,Not captured,Not captured,Dhaval Mehta,Son,Not captured,Not captured,Not captured,Not captured,1580 SHORE PL,,SANTA CLARA,CA,95054,4046929744,,Not captured,Not captured,dhavalmehta.1990@gmail.com,Not captured,701823746,,Not captured,Not captured,Not captured,Not captured,Not captured,Not captured,
Not captured,Not captured,10/10/2018,Not captured,Not captured,863949,020,00072,ARS-02-0045003,Beacon America,Not captured,Not captured,Not captured,Passport(L6933898),,,Mehta,Rajesh,M,11/15/1963,male,Not captured,Not captured,Not captured,Not captured,Not captured,Not captured,Not captured,Not captured,Not captured,Not captured,Not captured,Not captured,Not captured,Dhaval Mehta,Son,Not captured,Not captured,Not captured,Not captured,1580 SHORE PL,,SANTA CLARA,CA,95054,4046929744,,Not captured,Not captured,dhavalmehta.1990@gmail.com,Not captured,701823745,,Not captured,Not captured,Not captured,Not captured,Not captured,Not captured,
Not captured,Not captured,10/10/2018,Not captured,Not captured,863949,020,00072,ARS-02-0045002,Beacon America,Not captured,Not captured,Not captured,Passport(H6855410),,,Sharma,Pramila,,12/19/1949,female,Not captured,Not captured,Not captured,Not captured,Not captured,Not captured,Not captured,Not captured,Not captured,Not captured,Not captured,Not captured,Not captured,Anurag Sharma,Anurag Sharma,Not captured,Not captured,Not captured,Not captured,10321 Ivalenes Hope Dr,,Austin,Texas,78717,8182092310,,Not captured,Not captured,anuragsharma01@yahoo.com,Not captured,701823744,,Not captured,Not captured,Not captured,Not captured,Not captured,Not captured,
Not captured,Not captured,10/07/2018,Not captured,Not captured,863949,020,00072,ARS-01-0044999,Beacon International,Not captured,Not captured,Not captured,,,,DiGiacinto,Lori,I,10/22/1954,female,Not captured,Not captured,Not captured,Not captured,Not captured,Not captured,Not captured,Not captured,Not captured,Not captured,Not captured,Not captured,Not captured,,,Not captured,Not captured,Not captured,Not captured,2060 Canterbury Lane,,Jamison,Pennsylvania,18929,,,Not captured,Not captured,jdig906@verizon.net,Not captured,701823741,,Not captured,Not captured,Not captured,Not captured,Not captured,Not captured,