EE Transaction Type,Dependent Transaction Type,Effective Date,EE Signature,EE Signature Date,Control,Suffix,Account,Plan Number,Plan Name,Claim Office,Network ID Number,Customer Code,EE SSN,Dependent SSN,Dependent Relationship,Last Name,First Name,Middle Initial,DOB,Gender,Ethnicity,PCP/PCD,PCP/PCD Current Patient,Provider Cap Office Number,COB,Dep Student Indicator,Dep OOA Indicator,EE Prior Coverage Indicator,EE Late Entrant,EE Language Indicator,Hire Date,Earnings,Earnings Frequency,Beneficiary (Last Name First Name MI),Beneficiary Relationship,Continuation of Coverage Expiration Date,Continuation of Coverage Event Date,Continuation of Coverage Length of Coverage,Work Location Zip Code,Street Address Line 1,Street Address Line 2,City,State,Zip Code,Home Phone Number,Work Phone Number,Accept Code,Evidence Code,EE Email Address,Communication Disability Code,EE Alternate ID,Dep Alternate ID,Old Control,Old Suffix,Old Account,New Control,New Suffix,New Account,
Not captured,Not captured,10/03/2018,Not captured,Not captured,863949,020,00072,ARS-01-0044905,Beacon International,Not captured,Not captured,Not captured,,,,Robinson,Donovan,D,03/20/1993,male,Not captured,Not captured,Not captured,Not captured,Not captured,Not captured,Not captured,Not captured,Not captured,Not captured,Not captured,Not captured,Not captured,,,Not captured,Not captured,Not captured,Not captured,2376 Ashford Drive,,Waldorf,Maryland,20603,,,Not captured,Not captured,donovanrobinson8@gmail.com,Not captured,701823508,,Not captured,Not captured,Not captured,Not captured,Not captured,Not captured,
Not captured,Not captured,10/02/2018,Not captured,Not captured,863949,020,00072,ARS-03-0044729,Essential America,Not captured,Not captured,Not captured,Passport(586684607),,,Herring,Callie,Marie,06/29/1991,female,Not captured,Not captured,Not captured,Not captured,Not captured,Not captured,Not captured,Not captured,Not captured,Not captured,Not captured,Not captured,Not captured,,,Not captured,Not captured,Not captured,Not captured,2554 NC 109 S,,Wadesboro,North Carolina,28170,+5930998605970,,Not captured,Not captured,herringcm29@gmail.com,Not captured,701823300,,Not captured,Not captured,Not captured,Not captured,Not captured,Not captured,
Not captured,Not captured,10/03/2018,Not captured,Not captured,863949,020,00072,ARS-02-0044900,Beacon America,Not captured,Not captured,Not captured,,,,Wang,Xiuqin,,06/24/1947,female,Not captured,Not captured,Not captured,Not captured,Not captured,Not captured,Not captured,Not captured,Not captured,Not captured,Not captured,Not captured,Not captured,,,Not captured,Not captured,Not captured,Not captured,136-82 39th Avenue #3F,,Flushing,New York,11354,7183130886,,Not captured,Not captured,info@nindecoverage.com,Not captured,701823496,,Not captured,Not captured,Not captured,Not captured,Not captured,Not captured,
Not captured,Not captured,10/03/2018,Not captured,Not captured,863949,020,00072,ARS-02-0044899,Beacon America,Not captured,Not captured,Not captured,,,,Sun,Rongqi,,05/26/1944,male,Not captured,Not captured,Not captured,Not captured,Not captured,Not captured,Not captured,Not captured,Not captured,Not captured,Not captured,Not captured,Not captured,,,Not captured,Not captured,Not captured,Not captured,136-82 39th Avenue #3F,,Flushing,New York,11354,718-313-0886,,Not captured,Not captured,info@nindecoverage.com,Not captured,701823495,,Not captured,Not captured,Not captured,Not captured,Not captured,Not captured,
Not captured,Not captured,10/03/2018,Not captured,Not captured,863949,020,00072,ARS-02-0044898,Beacon America,Not captured,Not captured,Not captured,,,,Sun,Hong,,01/05/1972,female,Not captured,Not captured,Not captured,Not captured,Not captured,Not captured,Not captured,Not captured,Not captured,Not captured,Not captured,Not captured,Not captured,,,Not captured,Not captured,Not captured,Not captured,136-82 39th Avenue #3F,,Flushing,New York,11354,917-963-5197,,Not captured,Not captured,info@nindecoverage.com,Not captured,701823494,,Not captured,Not captured,Not captured,Not captured,Not captured,Not captured,
Not captured,Not captured,10/03/2018,Not captured,Not captured,863949,020,00072,ARS-02-0044891,Beacon America,Not captured,Not captured,Not captured,,,,Gucciardo,Lynn,,12/20/1953,female,Not captured,Not captured,Not captured,Not captured,Not captured,Not captured,Not captured,Not captured,Not captured,Not captured,Not captured,Not captured,Not captured,,,Not captured,Not captured,Not captured,Not captured,3723 W St Kateri Drive,,Phoenix,Arizona,85041,,,Not captured,Not captured,guccilynn111@gmail.com,Not captured,701823463,,Not captured,Not captured,Not captured,Not captured,Not captured,Not captured,
Not captured,Not captured,10/03/2018,Not captured,Not captured,863949,020,00072,ARS-01-0044890,Beacon International,Not captured,Not captured,Not captured,,,,Washburn,Gregory,,08/10/1958,male,Not captured,Not captured,Not captured,Not captured,Not captured,Not captured,Not captured,Not captured,Not captured,Not captured,Not captured,Not captured,Not captured,,,Not captured,Not captured,Not captured,Not captured,901 Louise Wise Avenue NW,,ORTING,Washington,98360,,,Not captured,Not captured,gwashbug@gmail.com,Not captured,701823462,,Not captured,Not captured,Not captured,Not captured,Not captured,Not captured,
Not captured,Not captured,10/03/2018,Not captured,Not captured,863949,020,00072,ARS-01-0044889,Beacon International,Not captured,Not captured,Not captured,,,,Harper,Don,E,10/15/1938,male,Not captured,Not captured,Not captured,Not captured,Not captured,Not captured,Not captured,Not captured,Not captured,Not captured,Not captured,Not captured,Not captured,,,Not captured,Not captured,Not captured,Not captured,2355 Biltmore Ct.,,Colorado Springs,Colorado,80907,,,Not captured,Not captured,dharp2355@msn.com,Not captured,701823461,,Not captured,Not captured,Not captured,Not captured,Not captured,Not captured,
Not captured,Not captured,10/03/2018,Not captured,Not captured,863949,020,00072,ARS-01-0044884,Beacon International,Not captured,Not captured,Not captured,,,,Dubois,Valentin,,06/14/1987,male,Not captured,Not captured,Not captured,Not captured,Not captured,Not captured,Not captured,Not captured,Not captured,Not captured,Not captured,Not captured,Not captured,,,Not captured,Not captured,Not captured,Not captured,514 Harvard St.,,Brookline,Massachusetts,02446,,,Not captured,Not captured,vdubois@outlook.com,Not captured,701823456,,Not captured,Not captured,Not captured,Not captured,Not captured,Not captured,
Not captured,Not captured,10/03/2018,Not captured,Not captured,863949,020,00072,ARS-01-0044880,Beacon International,Not captured,Not captured,Not captured,,,,jun,miraya,,11/11/1987,female,Not captured,Not captured,Not captured,Not captured,Not captured,Not captured,Not captured,Not captured,Not captured,Not captured,Not captured,Not captured,Not captured,,,Not captured,Not captured,Not captured,Not captured,2124 1ST ST NW,,WASHINGTON,Dist. of Columbia,20001,,,Not captured,Not captured,mirayajun@gmail.com,Not captured,701823452,,Not captured,Not captured,Not captured,Not captured,Not captured,Not captured,
Not captured,Not captured,10/03/2018,Not captured,Not captured,863949,020,00072,ARS-01-0044879,Beacon International,Not captured,Not captured,Not captured,,,,Jun,Nina,K,06/13/1953,female,Not captured,Not captured,Not captured,Not captured,Not captured,Not captured,Not captured,Not captured,Not captured,Not captured,Not captured,Not captured,Not captured,,,Not captured,Not captured,Not captured,Not captured,2576 Falconer Way,,Orange,California,92867,,,Not captured,Not captured,mirayajun@gmail.com,Not captured,701823451,,Not captured,Not captured,Not captured,Not captured,Not captured,Not captured,
Not captured,Not captured,10/03/2018,Not captured,Not captured,863949,020,00072,ARS-01-0044878,Beacon International,Not captured,Not captured,Not captured,,,,Jun,Soowon,,11/01/1949,male,Not captured,Not captured,Not captured,Not captured,Not captured,Not captured,Not captured,Not captured,Not captured,Not captured,Not captured,Not captured,Not captured,,,Not captured,Not captured,Not captured,Not captured,2576 Falconer Way,,Orange,California,92867,,,Not captured,Not captured,mirayajun@gmail.com,Not captured,701823450,,Not captured,Not captured,Not captured,Not captured,Not captured,Not captured,
Not captured,Not captured,10/03/2018,Not captured,Not captured,863949,020,00072,ARS-01-0044876,Beacon International,Not captured,Not captured,Not captured,,,,schueller,frederick,r,06/01/1994,male,Not captured,Not captured,Not captured,Not captured,Not captured,Not captured,Not captured,Not captured,Not captured,Not captured,Not captured,Not captured,Not captured,,,Not captured,Not captured,Not captured,Not captured,14031 greenway,,prior lake,Minnesota,55372,,,Not captured,Not captured,rcabillot@farnamstreet.com,Not captured,701823448,,Not captured,Not captured,Not captured,Not captured,Not captured,Not captured,
Not captured,Not captured,10/03/2018,Not captured,Not captured,863949,020,00072,ARS-01-0044875,Beacon International,Not captured,Not captured,Not captured,,,,cabillot,raymond,e,11/07/1962,male,Not captured,Not captured,Not captured,Not captured,Not captured,Not captured,Not captured,Not captured,Not captured,Not captured,Not captured,Not captured,Not captured,,,Not captured,Not captured,Not captured,Not captured,14031 greenway,,prior lake,Minnesota,55372,,,Not captured,Not captured,rcabillot@farnamstreet.com,Not captured,701823447,,Not captured,Not captured,Not captured,Not captured,Not captured,Not captured,
Not captured,Not captured,10/03/2018,Not captured,Not captured,863949,020,00072,ARS-01-0044874,Beacon International,Not captured,Not captured,Not captured,,,,Frazel,Marea,A,07/09/1994,female,Not captured,Not captured,Not captured,Not captured,Not captured,Not captured,Not captured,Not captured,Not captured,Not captured,Not captured,Not captured,Not captured,,,Not captured,Not captured,Not captured,Not captured,233 Estrada Avenue,,St. Augustine,Florida,32084,,,Not captured,Not captured,mfrazel@ufl.edu,Not captured,701823446,,Not captured,Not captured,Not captured,Not captured,Not captured,Not captured,
Not captured,Not captured,10/03/2018,Not captured,Not captured,863949,020,00072,ARS-01-0044873,Beacon International,Not captured,Not captured,Not captured,,,,DSouza,Justine,,02/27/1986,female,Not captured,Not captured,Not captured,Not captured,Not captured,Not captured,Not captured,Not captured,Not captured,Not captured,Not captured,Not captured,Not captured,,,Not captured,Not captured,Not captured,Not captured,Maistr 37,,Munich,,80337,,,Not captured,Not captured,justine.dsouza@gmail.com,Not captured,701823445,,Not captured,Not captured,Not captured,Not captured,Not captured,Not captured,
Not captured,Not captured,10/03/2018,Not captured,Not captured,863949,020,00072,ARS-02-0044872,Beacon America,Not captured,Not captured,Not captured,,,,Bovkun,Iryna,,08/26/1983,female,Not captured,Not captured,Not captured,Not captured,Not captured,Not captured,Not captured,Not captured,Not captured,Not captured,Not captured,Not captured,Not captured,,,Not captured,Not captured,Not captured,Not captured,39 Black Prince Rd,,London,,SE11 6JJ,,,Not captured,Not captured,irynabovkun@gmail.com,Not captured,701823444,,Not captured,Not captured,Not captured,Not captured,Not captured,Not captured,
Not captured,Not captured,10/03/2018,Not captured,Not captured,863949,020,00072,ARS-01-0044871,Beacon International,Not captured,Not captured,Not captured,,,,Chang,Daniel,M,09/10/1995,male,Not captured,Not captured,Not captured,Not captured,Not captured,Not captured,Not captured,Not captured,Not captured,Not captured,Not captured,Not captured,Not captured,,,Not captured,Not captured,Not captured,Not captured,61 Albero Ct,,Rancho Palos Verdes,California,90275-5383,,,Not captured,Not captured,dchang.mcmxcv@gmail.com,Not captured,701823437,,Not captured,Not captured,Not captured,Not captured,Not captured,Not captured,
Not captured,Not captured,10/03/2018,Not captured,Not captured,863949,020,00072,ARS-38-0044868,Beacon Student Choice,Not captured,Not captured,Not captured,Passport(111656664),,,TEPEDINO VELASQUEZ,PAOLA,,07/17/1999,female,Not captured,Not captured,Not captured,Not captured,Not captured,Not captured,Not captured,Not captured,Not captured,Not captured,Not captured,Not captured,Not captured,CLAUDIA VELASQUEZ,MADRE,Not captured,Not captured,Not captured,Not captured,: 14169 MILLINGTON ST ORLANDO FL 32832 ORLANDO Florida,,ORLANDO,Florida,32832,+17864494761,+584143827210,Not captured,Not captured,csvc04@hotmail.com,Not captured,701823434,,Not captured,Not captured,Not captured,Not captured,Not captured,Not captured,
Not captured,Not captured,10/02/2018,Not captured,Not captured,863949,020,00072,ARS-01-0044863,Beacon International,Not captured,Not captured,Not captured,,,,Phoenix,Michele,,01/29/1968,female,Not captured,Not captured,Not captured,Not captured,Not captured,Not captured,Not captured,Not captured,Not captured,Not captured,Not captured,Not captured,Not captured,,,Not captured,Not captured,Not captured,Not captured,27W190 Emerson Court,,Winfield,Illinois,60190,,,Not captured,Not captured,shellphoenix@gmail.com,Not captured,701823428,,Not captured,Not captured,Not captured,Not captured,Not captured,Not captured,
Not captured,Not captured,10/02/2018,Not captured,Not captured,863949,020,00072,ARS-01-0044862,Beacon International,Not captured,Not captured,Not captured,Passport(550984170),,,Schwartz,Andrew,,01/27/1976,male,Not captured,Not captured,Not captured,Not captured,Not captured,Not captured,Not captured,Not captured,Not captured,Not captured,Not captured,Not captured,Not captured,Melissa Schwartz,Sister,Not captured,Not captured,Not captured,Not captured,1838 Hollyvista Ave,,Los Angeles,California,90027,818-266-9048,,Not captured,Not captured,andrewschwartz@gmail.com,Not captured,701823427,,Not captured,Not captured,Not captured,Not captured,Not captured,Not captured,
Not captured,Not captured,10/03/2018,Not captured,Not captured,863949,020,00072,ARS-01-0044861,Beacon International,Not captured,Not captured,Not captured,,,,Subotzky,Avraham Aharon,,09/18/2001,male,Not captured,Not captured,Not captured,Not captured,Not captured,Not captured,Not captured,Not captured,Not captured,Not captured,Not captured,Not captured,Not captured,,,Not captured,Not captured,Not captured,Not captured,23/12 nahal sorek,,beit shemesh,,9909135,,,Not captured,Not captured,bbsubotzky@gmail.com,Not captured,701823426,,Not captured,Not captured,Not captured,Not captured,Not captured,Not captured,
Not captured,Not captured,10/03/2018,Not captured,Not captured,863949,020,00072,ARS-01-0044860,Beacon International,Not captured,Not captured,Not captured,,,,Subotzky,Ian,,05/26/1976,male,Not captured,Not captured,Not captured,Not captured,Not captured,Not captured,Not captured,Not captured,Not captured,Not captured,Not captured,Not captured,Not captured,,,Not captured,Not captured,Not captured,Not captured,23/12 nahal sorek,,beit shemesh,,9909135,,,Not captured,Not captured,bbsubotzky@gmail.com,Not captured,701823425,,Not captured,Not captured,Not captured,Not captured,Not captured,Not captured,
Not captured,Not captured,10/02/2018,Not captured,Not captured,863949,020,00072,ARS-01-0044849,Beacon International,Not captured,Not captured,Not captured,,,,Racine,Jana,F,03/15/1982,female,Not captured,Not captured,Not captured,Not captured,Not captured,Not captured,Not captured,Not captured,Not captured,Not captured,Not captured,Not captured,Not captured,,,Not captured,Not captured,Not captured,Not captured,1788 Clay St,,San Francisco,California,94109,,,Not captured,Not captured,jana.racine@gmail.com,Not captured,701823411,,Not captured,Not captured,Not captured,Not captured,Not captured,Not captured,
Not captured,Not captured,10/02/2018,Not captured,Not captured,863949,020,00072,ARS-02-0044840,Beacon America,Not captured,Not captured,Not captured,Passport(C01734503),,,Gonzalez Fonseca,Carlos Ariel,,10/23/1985,male,Not captured,Not captured,Not captured,Not captured,Not captured,Not captured,Not captured,Not captured,Not captured,Not captured,Not captured,Not captured,Not captured,Nick Cassinis,other,Not captured,Not captured,Not captured,Not captured,3048 E Nichols Cir,,Centennial,Colorado,80122,970 402 4757,,Not captured,Not captured,nick.cassinis@gmail.com,Not captured,701823388,,Not captured,Not captured,Not captured,Not captured,Not captured,Not captured,
Not captured,Not captured,10/02/2018,Not captured,Not captured,863949,020,00072,ARS-02-0044839,Beacon America,Not captured,Not captured,Not captured,Passport(C01558974),,,Gonzalez Salgado,Carlos Adam,,02/11/1959,male,Not captured,Not captured,Not captured,Not captured,Not captured,Not captured,Not captured,Not captured,Not captured,Not captured,Not captured,Not captured,Not captured,Nick Cassinis,other,Not captured,Not captured,Not captured,Not captured,3048 E Nichols Cir,,Centennial,Colorado,80122,970 402 4757,,Not captured,Not captured,nick.cassinis@gmail.com,Not captured,701823387,,Not captured,Not captured,Not captured,Not captured,Not captured,Not captured,
Not captured,Not captured,10/01/2018,Not captured,Not captured,863949,020,00072,ARS-01-0044838,Beacon International,Not captured,Not captured,Not captured,,,,Trieu,Donavan,,08/10/1992,male,Not captured,Not captured,Not captured,Not captured,Not captured,Not captured,Not captured,Not captured,Not captured,Not captured,Not captured,Not captured,Not captured,,,Not captured,Not captured,Not captured,Not captured,1185 Ave of the Americas,,New York,New York,10036,,,Not captured,Not captured,bschlarp@getswift.co,Not captured,701823386,,Not captured,Not captured,Not captured,Not captured,Not captured,Not captured,
Not captured,Not captured,10/03/2018,Not captured,Not captured,863949,020,00072,ARS-01-0044836,Beacon International,Not captured,Not captured,Not captured,,,,Kamerling,Charles,,12/09/1968,male,Not captured,Not captured,Not captured,Not captured,Not captured,Not captured,Not captured,Not captured,Not captured,Not captured,Not captured,Not captured,Not captured,,,Not captured,Not captured,Not captured,Not captured,514 28th st,,Oakland,California,94609,,,Not captured,Not captured,greenhomeboy99@gmail.com,Not captured,701823383,,Not captured,Not captured,Not captured,Not captured,Not captured,Not captured,
Not captured,Not captured,10/01/2018,Not captured,Not captured,863949,020,00072,ARS-01-0044830,Beacon International,Not captured,Not captured,Not captured,,,,Murray,Patrick,E,04/18/1986,male,Not captured,Not captured,Not captured,Not captured,Not captured,Not captured,Not captured,Not captured,Not captured,Not captured,Not captured,Not captured,Not captured,,,Not captured,Not captured,Not captured,Not captured,108 w 2nd street,,Los Angeles,California,90012,,,Not captured,Not captured,murray.patrick.e@gmail.com,Not captured,701823360,,Not captured,Not captured,Not captured,Not captured,Not captured,Not captured,
Not captured,Not captured,10/01/2018,Not captured,Not captured,863949,020,00072,ARS-02-0044828,Beacon America,Not captured,Not captured,Not captured,,,,Lorentzen,Ragnar,,04/21/1976,male,Not captured,Not captured,Not captured,Not captured,Not captured,Not captured,Not captured,Not captured,Not captured,Not captured,Not captured,Not captured,Not captured,,,Not captured,Not captured,Not captured,Not captured,3 Thorpewood avenue,,London,,Se26 4bu,,,Not captured,Not captured,ragnar.lorentzen@gmail.com,Not captured,701823358,,Not captured,Not captured,Not captured,Not captured,Not captured,Not captured,
Not captured,Not captured,10/01/2018,Not captured,Not captured,863949,020,00072,OVI-28-0044825,OverseasCare Visitors Insurance Plan,Not captured,Not captured,Not captured,,,,Singaraju,Yasodhara,,08/04/1948,male,Not captured,Not captured,Not captured,Not captured,Not captured,Not captured,Not captured,Not captured,Not captured,Not captured,Not captured,Not captured,Not captured,Satish Appalakutty,Son,Not captured,Not captured,Not captured,Not captured,413 Bent Grass Terr,,Fremont,California,94539,4088234332,,Not captured,Not captured,appalakutty@gmail.com,Not captured,701823355,,Not captured,Not captured,Not captured,Not captured,Not captured,Not captured,
Not captured,Not captured,10/01/2018,Not captured,Not captured,863949,020,00072,OVI-28-0044824,OverseasCare Visitors Insurance Plan,Not captured,Not captured,Not captured,,,,Appalakutti,Prabhakar,,06/13/1947,male,Not captured,Not captured,Not captured,Not captured,Not captured,Not captured,Not captured,Not captured,Not captured,Not captured,Not captured,Not captured,Not captured,Satish Appalakutty,Son,Not captured,Not captured,Not captured,Not captured,413 Bent Grass Terr,,Fremont,California,94539,4088234332,,Not captured,Not captured,appalakutty@gmail.com,Not captured,701823354,,Not captured,Not captured,Not captured,Not captured,Not captured,Not captured,
Not captured,Not captured,10/02/2018,Not captured,Not captured,863949,020,00072,ARS-01-0044823,Beacon International,Not captured,Not captured,Not captured,,,,Tesch,Eric,,11/16/1961,male,Not captured,Not captured,Not captured,Not captured,Not captured,Not captured,Not captured,Not captured,Not captured,Not captured,Not captured,Not captured,Not captured,,,Not captured,Not captured,Not captured,Not captured,10370 Jims Trail,,Rogers,Arkansas,72756,479-263-4786,,Not captured,Not captured,erictesch@hotmail.com,Not captured,701823353,,Not captured,Not captured,Not captured,Not captured,Not captured,Not captured,
Not captured,Not captured,10/01/2018,Not captured,Not captured,863949,020,00072,ARS-01-0044821,Beacon International,Not captured,Not captured,Not captured,Passport(540702765),,,Hernandez,Freddy ,,03/03/1961,male,Not captured,Not captured,Not captured,Not captured,Not captured,Not captured,Not captured,Not captured,Not captured,Not captured,Not captured,Not captured,Not captured,Maria E. Hernandez,Spouse,Not captured,Not captured,Not captured,Not captured,14221 SW 120 Street Ste 127,,Miami,Florida,33186,7865541076,,Not captured,Not captured,freddy@spssusa.com,Not captured,701823349,,Not captured,Not captured,Not captured,Not captured,Not captured,Not captured,
Not captured,Not captured,09/26/2018,Not captured,Not captured,863949,020,00072,ARS-03-0044693,Essential America,Not captured,Not captured,Not captured,Driving License(f7781464),,,morgan,kate,elizabeth scarlett,02/25/1987,female,Not captured,Not captured,Not captured,Not captured,Not captured,Not captured,Not captured,Not captured,Not captured,Not captured,Not captured,Not captured,Not captured,,,Not captured,Not captured,Not captured,Not captured,427 westminster ave,,LA,California,90020,3236844875,,Not captured,Not captured,kateesmorgan@gmail.com,Not captured,701818542,,Not captured,Not captured,Not captured,Not captured,Not captured,Not captured,
Not captured,Not captured,10/02/2018,Not captured,Not captured,863949,020,00072,ARS-01-0044818,Beacon International,Not captured,Not captured,Not captured,,,,Parrish,Laurie,,04/10/1962,female,Not captured,Not captured,Not captured,Not captured,Not captured,Not captured,Not captured,Not captured,Not captured,Not captured,Not captured,Not captured,Not captured,,,Not captured,Not captured,Not captured,Not captured,3111 Vallette St,,Bellingham,Washington,98225,,,Not captured,Not captured,lauriecpa@att.net,Not captured,701823343,,Not captured,Not captured,Not captured,Not captured,Not captured,Not captured,