EE Transaction Type,Dependent Transaction Type,Effective Date,EE Signature,EE Signature Date,Control,Suffix,Account,Plan Number,Plan Name,Claim Office,Network ID Number,Customer Code,EE SSN,Dependent SSN,Dependent Relationship,Last Name,First Name,Middle Initial,DOB,Gender,Ethnicity,PCP/PCD,PCP/PCD Current Patient,Provider Cap Office Number,COB,Dep Student Indicator,Dep OOA Indicator,EE Prior Coverage Indicator,EE Late Entrant,EE Language Indicator,Hire Date,Earnings,Earnings Frequency,Beneficiary (Last Name First Name MI),Beneficiary Relationship,Continuation of Coverage Expiration Date,Continuation of Coverage Event Date,Continuation of Coverage Length of Coverage,Work Location Zip Code,Street Address Line 1,Street Address Line 2,City,State,Zip Code,Home Phone Number,Work Phone Number,Accept Code,Evidence Code,EE Email Address,Communication Disability Code,EE Alternate ID,Dep Alternate ID,Old Control,Old Suffix,Old Account,New Control,New Suffix,New Account,
Not captured,Not captured,09/24/2018,Not captured,Not captured,863949,020,00072,ARS-02-0044664,Beacon America,Not captured,Not captured,Not captured,Passport(07025911),,,Manandhar,Palpasa ,,12/31/1989,female,Not captured,Not captured,Not captured,Not captured,Not captured,Not captured,Not captured,Not captured,Not captured,Not captured,Not captured,Not captured,Not captured,Sujan Manandhar,Brother,Not captured,Not captured,Not captured,Not captured,15917 SE 1st ST,,Bellevue,,98008,5153573950,,Not captured,Not captured,manandharpal4@gmail.com,Not captured,701813324,,Not captured,Not captured,Not captured,Not captured,Not captured,Not captured,
Not captured,Not captured,09/24/2018,Not captured,Not captured,863949,020,00072,ARS-01-0044653,Beacon International,Not captured,Not captured,Not captured,,,,Brink,Donald,M,10/21/1980,male,Not captured,Not captured,Not captured,Not captured,Not captured,Not captured,Not captured,Not captured,Not captured,Not captured,Not captured,Not captured,Not captured,,,Not captured,Not captured,Not captured,Not captured,2930 Camino Capistrano,,San Clemente,California,92672,,,Not captured,Not captured,donald@brinksurf.com,Not captured,701817288,,Not captured,Not captured,Not captured,Not captured,Not captured,Not captured,
Not captured,Not captured,09/24/2018,Not captured,Not captured,863949,020,00072,ARS-03-0044600,Essential America,Not captured,Not captured,Not captured,SSN(257910470),,,Bland,Robert,Luis,11/15/1994,male,Not captured,Not captured,Not captured,Not captured,Not captured,Not captured,Not captured,Not captured,Not captured,Not captured,Not captured,Not captured,Not captured,,,Not captured,Not captured,Not captured,Not captured,2835 meridian drive,,Dacula,Georgia,30019,7705722707,,Not captured,Not captured,Robert.luis.bland@gmail.com,Not captured,701823160,,Not captured,Not captured,Not captured,Not captured,Not captured,Not captured,
Not captured,Not captured,09/24/2018,Not captured,Not captured,863949,020,00072,ARS-01-0044651,Beacon International,Not captured,Not captured,Not captured,,,,McCally III,Albert,W,12/14/1954,male,Not captured,Not captured,Not captured,Not captured,Not captured,Not captured,Not captured,Not captured,Not captured,Not captured,Not captured,Not captured,Not captured,,,Not captured,Not captured,Not captured,Not captured,327 W. Belden Ave.,,Chicago,Illinois,60614,,,Not captured,Not captured,awmccally@aol.com,Not captured,701817286,,Not captured,Not captured,Not captured,Not captured,Not captured,Not captured,
Not captured,Not captured,09/24/2018,Not captured,Not captured,863949,020,00072,ARS-01-0044650,Beacon International,Not captured,Not captured,Not captured,,,,Nowak,Adam,M,06/13/1978,male,Not captured,Not captured,Not captured,Not captured,Not captured,Not captured,Not captured,Not captured,Not captured,Not captured,Not captured,Not captured,Not captured,,,Not captured,Not captured,Not captured,Not captured,9215 26th Ave NW,,Seattle,Washington,98117,,,Not captured,Not captured,adamnowak@gmail.com,Not captured,701817285,,Not captured,Not captured,Not captured,Not captured,Not captured,Not captured,
Not captured,Not captured,09/24/2018,Not captured,Not captured,863949,020,00072,ARS-03-0044316,Essential America,Not captured,Not captured,Not captured,Passport(532568908),,,Moultray,william,ryan,11/16/1972,male,Not captured,Not captured,Not captured,Not captured,Not captured,Not captured,Not captured,Not captured,Not captured,Not captured,Not captured,Not captured,Not captured,,,Not captured,Not captured,Not captured,Not captured,110 calle principal,,Balfate Colon,,,50498612649,,Not captured,Not captured,rmoults@gmail.com,Not captured,701817468,,Not captured,Not captured,Not captured,Not captured,Not captured,Not captured,
Not captured,Not captured,09/24/2018,Not captured,Not captured,863949,020,00072,ARS-03-0044316,Essential America,Not captured,Not captured,Not captured,,Passport(532568904),Spouse,Moultray,heidi,ann,05/20/1974,female,Not captured,Not captured,Not captured,Not captured,Not captured,Not captured,Not captured,Not captured,Not captured,Not captured,Not captured,Not captured,Not captured,,,Not captured,Not captured,Not captured,Not captured,110 calle principal,,Balfate Colon,,,50498612649,,Not captured,Not captured,rmoults@gmail.com,Not captured,,701817469,Not captured,Not captured,Not captured,Not captured,Not captured,Not captured,
Not captured,Not captured,09/24/2018,Not captured,Not captured,863949,020,00072,ARS-03-0044316,Essential America,Not captured,Not captured,Not captured,,Passport(538220011),Dependant,Moultray,william,lukkes,08/12/2004,male,Not captured,Not captured,Not captured,Not captured,Not captured,Not captured,Not captured,Not captured,Not captured,Not captured,Not captured,Not captured,Not captured,,,Not captured,Not captured,Not captured,Not captured,110 calle principal,,Balfate Colon,,,50498612649,,Not captured,Not captured,rmoults@gmail.com,Not captured,,701817470,Not captured,Not captured,Not captured,Not captured,Not captured,Not captured,
Not captured,Not captured,09/24/2018,Not captured,Not captured,863949,020,00072,ARS-03-0044316,Essential America,Not captured,Not captured,Not captured,,Passport(534246306),Dependant,Moultray,owen,matthew,07/03/2006,male,Not captured,Not captured,Not captured,Not captured,Not captured,Not captured,Not captured,Not captured,Not captured,Not captured,Not captured,Not captured,Not captured,,,Not captured,Not captured,Not captured,Not captured,110 calle principal,,Balfate Colon,,,50498612649,,Not captured,Not captured,rmoults@gmail.com,Not captured,,701817471,Not captured,Not captured,Not captured,Not captured,Not captured,Not captured,
Not captured,Not captured,09/24/2018,Not captured,Not captured,863949,020,00072,ARS-03-0044316,Essential America,Not captured,Not captured,Not captured,,Passport(538220007),Dependant,Moultray,Juliet,heather,06/07/2009,female,Not captured,Not captured,Not captured,Not captured,Not captured,Not captured,Not captured,Not captured,Not captured,Not captured,Not captured,Not captured,Not captured,,,Not captured,Not captured,Not captured,Not captured,110 calle principal,,Balfate Colon,,,50498612649,,Not captured,Not captured,rmoults@gmail.com,Not captured,,701817472,Not captured,Not captured,Not captured,Not captured,Not captured,Not captured,
Not captured,Not captured,09/24/2018,Not captured,Not captured,863949,020,00072,ARS-02-0044645,Beacon America,Not captured,Not captured,Not captured,,,,Burgess,Timothy,J,06/03/1963,male,Not captured,Not captured,Not captured,Not captured,Not captured,Not captured,Not captured,Not captured,Not captured,Not captured,Not captured,Not captured,Not captured,,,Not captured,Not captured,Not captured,Not captured,2-29-4-903 Shiohama,,Koto-ku Tokyo,,135-0043,,,Not captured,Not captured,info@ontica.com,Not captured,701817275,,Not captured,Not captured,Not captured,Not captured,Not captured,Not captured,
Not captured,Not captured,09/23/2018,Not captured,Not captured,863949,020,00072,ARS-02-0044644,Beacon America,Not captured,Not captured,Not captured,,,,natarajan,vijaya,,11/09/1958,male,Not captured,Not captured,Not captured,Not captured,Not captured,Not captured,Not captured,Not captured,Not captured,Not captured,Not captured,Not captured,Not captured,navaneetha subramanian,son in law,Not captured,Not captured,Not captured,Not captured,359 wheat grass ter,,fremont,California,94539,4158271872,,Not captured,Not captured,sn_krish@yahoo.com,Not captured,701817274,,Not captured,Not captured,Not captured,Not captured,Not captured,Not captured,
Not captured,Not captured,09/23/2018,Not captured,Not captured,863949,020,00072,ARS-01-0044643,Beacon International,Not captured,Not captured,Not captured,,,,Mattison,Michael,S,12/17/1973,male,Not captured,Not captured,Not captured,Not captured,Not captured,Not captured,Not captured,Not captured,Not captured,Not captured,Not captured,Not captured,Not captured,,,Not captured,Not captured,Not captured,Not captured,59-191 Ke Nui Rd,,Haleiwa,Hawaii,96712,,,Not captured,Not captured,mattison808@gmail.com,Not captured,701817273,,Not captured,Not captured,Not captured,Not captured,Not captured,Not captured,
Not captured,Not captured,09/23/2018,Not captured,Not captured,863949,020,00072,ARS-01-0044641,Beacon International,Not captured,Not captured,Not captured,,,,Benkelman,Jefrey,R,05/17/1955,male,Not captured,Not captured,Not captured,Not captured,Not captured,Not captured,Not captured,Not captured,Not captured,Not captured,Not captured,Not captured,Not captured,,,Not captured,Not captured,Not captured,Not captured,912 Shore Drive,,North Palm Beach,Florida,33408,,,Not captured,Not captured,boatfoam@msn.com,Not captured,701823205,,Not captured,Not captured,Not captured,Not captured,Not captured,Not captured,
Not captured,Not captured,09/23/2018,Not captured,Not captured,863949,020,00072,ARS-01-0044637,Beacon International,Not captured,Not captured,Not captured,,,,Hess,Iain,,10/27/1999,male,Not captured,Not captured,Not captured,Not captured,Not captured,Not captured,Not captured,Not captured,Not captured,Not captured,Not captured,Not captured,Not captured,,,Not captured,Not captured,Not captured,Not captured,7356 S. Meadow Court,,Boulder,Colorado,80301,,,Not captured,Not captured,iainhess@gmail.com,Not captured,701823201,,Not captured,Not captured,Not captured,Not captured,Not captured,Not captured,
Not captured,Not captured,09/23/2018,Not captured,Not captured,863949,020,00072,ARS-02-0044636,Beacon America,Not captured,Not captured,Not captured,,,,Landau,Breindel,,09/28/2017,female,Not captured,Not captured,Not captured,Not captured,Not captured,Not captured,Not captured,Not captured,Not captured,Not captured,Not captured,Not captured,Not captured,,,Not captured,Not captured,Not captured,Not captured,2 Lublin Way,,Monroe,New York,10950,,,Not captured,Not captured,landau545@gmail.com,Not captured,701823200,,Not captured,Not captured,Not captured,Not captured,Not captured,Not captured,
Not captured,Not captured,09/23/2018,Not captured,Not captured,863949,020,00072,ARS-02-0044635,Beacon America,Not captured,Not captured,Not captured,,,,Landau,Sarah,,11/21/1997,female,Not captured,Not captured,Not captured,Not captured,Not captured,Not captured,Not captured,Not captured,Not captured,Not captured,Not captured,Not captured,Not captured,,,Not captured,Not captured,Not captured,Not captured,2 Lublin Way,,Monroe,New York,10950,,,Not captured,Not captured,landau545@gmail.com,Not captured,701823199,,Not captured,Not captured,Not captured,Not captured,Not captured,Not captured,
Not captured,Not captured,09/23/2018,Not captured,Not captured,863949,020,00072,ARS-02-0044634,Beacon America,Not captured,Not captured,Not captured,,,,Landau,Wolf,,03/22/1997,male,Not captured,Not captured,Not captured,Not captured,Not captured,Not captured,Not captured,Not captured,Not captured,Not captured,Not captured,Not captured,Not captured,,,Not captured,Not captured,Not captured,Not captured,2 Lublin Way,,Monroe,New York,10950,,,Not captured,Not captured,landau545@gmail.com,Not captured,701823198,,Not captured,Not captured,Not captured,Not captured,Not captured,Not captured,
Not captured,Not captured,09/23/2018,Not captured,Not captured,863949,020,00072,ARS-01-0044633,Beacon International,Not captured,Not captured,Not captured,Passport(72 7128300),,,KORNILOV,SERGEY,GEORGIEVICH,10/12/1970,male,Not captured,Not captured,Not captured,Not captured,Not captured,Not captured,Not captured,Not captured,Not captured,Not captured,Not captured,Not captured,Not captured,Nina Kornilova,friend,Not captured,Not captured,Not captured,Not captured,1st Volokolamskiy proezd,,Moscow,Moskovskaya oblast,123060,+37281667995,+553192745700,Not captured,Not captured,metsaimpex@bk.ru,Not captured,701823197,,Not captured,Not captured,Not captured,Not captured,Not captured,Not captured,
Not captured,Not captured,09/23/2018,Not captured,Not captured,863949,020,00072,ARS-01-0044632,Beacon International,Not captured,Not captured,Not captured,,,,Bettis,Andrew,D,10/02/1986,male,Not captured,Not captured,Not captured,Not captured,Not captured,Not captured,Not captured,Not captured,Not captured,Not captured,Not captured,Not captured,Not captured,,,Not captured,Not captured,Not captured,Not captured,2343 W Winona St,,Chicago,Illinois,60625,,,Not captured,Not captured,bettis.andrew@gmail.com,Not captured,701823196,,Not captured,Not captured,Not captured,Not captured,Not captured,Not captured,
Not captured,Not captured,09/23/2018,Not captured,Not captured,863949,020,00072,ARS-01-0044631,Beacon International,Not captured,Not captured,Not captured,,,,Morales Vargas,Jeidy Lisbeht,,06/25/1994,female,Not captured,Not captured,Not captured,Not captured,Not captured,Not captured,Not captured,Not captured,Not captured,Not captured,Not captured,Not captured,Not captured,,,Not captured,Not captured,Not captured,Not captured,Cr 21 C1 # 29J - 57 Los Laureles,,Santa Marta,,Cr 21 C1 # 29J - 57 Los Laureles,,,Not captured,Not captured,jelimova@gmail.com,Not captured,701823195,,Not captured,Not captured,Not captured,Not captured,Not captured,Not captured,
Not captured,Not captured,09/23/2018,Not captured,Not captured,863949,020,00072,ARS-01-0044630,Beacon International,Not captured,Not captured,Not captured,,,,Pesic,Sara,,08/08/1998,female,Not captured,Not captured,Not captured,Not captured,Not captured,Not captured,Not captured,Not captured,Not captured,Not captured,Not captured,Not captured,Not captured,,,Not captured,Not captured,Not captured,Not captured,39 Kebo street,,Bar Harbor,,04609,,,Not captured,Not captured,sara.pesic@hotmail.com,Not captured,701823194,,Not captured,Not captured,Not captured,Not captured,Not captured,Not captured,
Not captured,Not captured,09/23/2018,Not captured,Not captured,863949,020,00072,ARS-01-0044629,Beacon International,Not captured,Not captured,Not captured,,,,Fisher,Samantha,R,02/28/1998,female,Not captured,Not captured,Not captured,Not captured,Not captured,Not captured,Not captured,Not captured,Not captured,Not captured,Not captured,Not captured,Not captured,,,Not captured,Not captured,Not captured,Not captured,17057 28th ave ne,,seattle,Washington,98155,,,Not captured,Not captured,jill.c.fisher@gmail.com,Not captured,701823193,,Not captured,Not captured,Not captured,Not captured,Not captured,Not captured,
Not captured,Not captured,09/23/2018,Not captured,Not captured,863949,020,00072,ARS-01-0044628,Beacon International,Not captured,Not captured,Not captured,,,,Ghermoul,Yasmine,,04/18/1997,female,Not captured,Not captured,Not captured,Not captured,Not captured,Not captured,Not captured,Not captured,Not captured,Not captured,Not captured,Not captured,Not captured,,,Not captured,Not captured,Not captured,Not captured,1155 w 49th ave,,Vancouver,British Columbia,V6M 2P9,,,Not captured,Not captured,adrielgoodwin@gmail.com,Not captured,701823192,,Not captured,Not captured,Not captured,Not captured,Not captured,Not captured,
Not captured,Not captured,09/23/2018,Not captured,Not captured,863949,020,00072,ARS-02-0044626,Beacon America,Not captured,Not captured,Not captured,,,,Katz,Yerachmiel,,06/11/2018,male,Not captured,Not captured,Not captured,Not captured,Not captured,Not captured,Not captured,Not captured,Not captured,Not captured,Not captured,Not captured,Not captured,,,Not captured,Not captured,Not captured,Not captured,98 Aspen Court,,Lakewood,New Jersey,08701,7327255006,,Not captured,Not captured,Doublejkatz@gmail.com,Not captured,701823190,,Not captured,Not captured,Not captured,Not captured,Not captured,Not captured,
Not captured,Not captured,09/23/2018,Not captured,Not captured,863949,020,00072,ARS-02-0044625,Beacon America,Not captured,Not captured,Not captured,,,,Katz,Chaim,,04/29/2015,male,Not captured,Not captured,Not captured,Not captured,Not captured,Not captured,Not captured,Not captured,Not captured,Not captured,Not captured,Not captured,Not captured,,,Not captured,Not captured,Not captured,Not captured,98 Aspen Court,,Lakewood,New Jersey,08701,7327255006,,Not captured,Not captured,Doublejkatz@gmail.com,Not captured,701823189,,Not captured,Not captured,Not captured,Not captured,Not captured,Not captured,
Not captured,Not captured,09/23/2018,Not captured,Not captured,863949,020,00072,ARS-02-0044624,Beacon America,Not captured,Not captured,Not captured,,,,Katz,Esther,,05/22/2013,female,Not captured,Not captured,Not captured,Not captured,Not captured,Not captured,Not captured,Not captured,Not captured,Not captured,Not captured,Not captured,Not captured,,,Not captured,Not captured,Not captured,Not captured,98 Aspen Court,,Lakewood,New Jersey,08701,7327255006,,Not captured,Not captured,Doublejkatz@gmail.com,Not captured,701823188,,Not captured,Not captured,Not captured,Not captured,Not captured,Not captured,
Not captured,Not captured,09/23/2018,Not captured,Not captured,863949,020,00072,ARS-02-0044623,Beacon America,Not captured,Not captured,Not captured,,,,Katz,Chaya,,09/15/1983,female,Not captured,Not captured,Not captured,Not captured,Not captured,Not captured,Not captured,Not captured,Not captured,Not captured,Not captured,Not captured,Not captured,,,Not captured,Not captured,Not captured,Not captured,98 Aspen Court,,Lakewood,New Jersey,08701,7327255006,,Not captured,Not captured,Doublejkatz@gmail.com,Not captured,701823187,,Not captured,Not captured,Not captured,Not captured,Not captured,Not captured,
Not captured,Not captured,09/23/2018,Not captured,Not captured,863949,020,00072,ARS-02-0044622,Beacon America,Not captured,Not captured,Not captured,,,,Katz,Yaacov,,09/20/1980,male,Not captured,Not captured,Not captured,Not captured,Not captured,Not captured,Not captured,Not captured,Not captured,Not captured,Not captured,Not captured,Not captured,,,Not captured,Not captured,Not captured,Not captured,98 Aspen Court,,Lakewood,New Jersey,08701,7327255006,,Not captured,Not captured,Doublejkatz@gmail.com,Not captured,701823186,,Not captured,Not captured,Not captured,Not captured,Not captured,Not captured,
Not captured,Not captured,09/24/2018,Not captured,Not captured,863949,020,00072,ARS-01-0044620,Beacon International,Not captured,Not captured,Not captured,,,,Mamuri,Alexander,,09/30/1982,male,Not captured,Not captured,Not captured,Not captured,Not captured,Not captured,Not captured,Not captured,Not captured,Not captured,Not captured,Not captured,Not captured,,,Not captured,Not captured,Not captured,Not captured,7817 Beckwith Rd.,,Morton Grove,Illinois,60053,,,Not captured,Not captured,alexmamuri@gmail.com,Not captured,701823182,,Not captured,Not captured,Not captured,Not captured,Not captured,Not captured,
Not captured,Not captured,09/22/2018,Not captured,Not captured,863949,020,00072,ARS-02-0044618,Beacon America,Not captured,Not captured,Not captured,,,,Kuwabara,Yu,,11/16/1984,male,Not captured,Not captured,Not captured,Not captured,Not captured,Not captured,Not captured,Not captured,Not captured,Not captured,Not captured,Not captured,Not captured,,,Not captured,Not captured,Not captured,Not captured,1-8-13-203 Nihonbashihoridomecho,,Tokyo,,103-0012,,,Not captured,Not captured,yuandlaura@gmail.com,Not captured,701823178,,Not captured,Not captured,Not captured,Not captured,Not captured,Not captured,
Not captured,Not captured,09/22/2018,Not captured,Not captured,863949,020,00072,ARS-02-0044617,Beacon America,Not captured,Not captured,Not captured,,,,Kuwabara,Laura,,03/30/1989,female,Not captured,Not captured,Not captured,Not captured,Not captured,Not captured,Not captured,Not captured,Not captured,Not captured,Not captured,Not captured,Not captured,,,Not captured,Not captured,Not captured,Not captured,1-8-13-203 Nihonbashihoridomecho,,Tokyo,,103-0012,,,Not captured,Not captured,yuandlaura@gmail.com,Not captured,701823177,,Not captured,Not captured,Not captured,Not captured,Not captured,Not captured,
Not captured,Not captured,09/22/2018,Not captured,Not captured,863949,020,00072,ARS-01-0044616,Beacon International,Not captured,Not captured,Not captured,,,,Pfeifer,Kirsten,,05/01/1994,female,Not captured,Not captured,Not captured,Not captured,Not captured,Not captured,Not captured,Not captured,Not captured,Not captured,Not captured,Not captured,Not captured,,,Not captured,Not captured,Not captured,Not captured,1565 Farmhill Drive,,Algonquin,Illinois,60102,,,Not captured,Not captured,kirstenapfeifer@gmail.com,Not captured,701823176,,Not captured,Not captured,Not captured,Not captured,Not captured,Not captured,
Not captured,Not captured,09/22/2018,Not captured,Not captured,863949,020,00072,ARS-01-0044615,Beacon International,Not captured,Not captured,Not captured,,,,Myles,Erek,J,09/22/1982,male,Not captured,Not captured,Not captured,Not captured,Not captured,Not captured,Not captured,Not captured,Not captured,Not captured,Not captured,Not captured,Not captured,,,Not captured,Not captured,Not captured,Not captured,7415 Garland mist ln,,Richmond,Texas,77407,,,Not captured,Not captured,fightintexag03@yahoo.com,Not captured,701823175,,Not captured,Not captured,Not captured,Not captured,Not captured,Not captured,
Not captured,Not captured,09/22/2018,Not captured,Not captured,863949,020,00072,ARS-01-0044614,Beacon International,Not captured,Not captured,Not captured,,,,Byrd,Sheri,M,09/27/1981,female,Not captured,Not captured,Not captured,Not captured,Not captured,Not captured,Not captured,Not captured,Not captured,Not captured,Not captured,Not captured,Not captured,,,Not captured,Not captured,Not captured,Not captured,7415 Garland mist ln,,Richmond,Texas,77407,,,Not captured,Not captured,fightintexag03@yahoo.com,Not captured,701823174,,Not captured,Not captured,Not captured,Not captured,Not captured,Not captured,
Not captured,Not captured,09/23/2018,Not captured,Not captured,863949,020,00072,ARS-01-0044613,Beacon International,Not captured,Not captured,Not captured,Passport(TB631144),,,DEOSARAN,DOOLING,N,06/26/1937,female,Not captured,Not captured,Not captured,Not captured,Not captured,Not captured,Not captured,Not captured,Not captured,Not captured,Not captured,Not captured,Not captured,ROOPNARINE DEOSARAN ,SON,Not captured,Not captured,Not captured,Not captured,PO BOX 544,,GRAND CAYMAN,WB,KY1 9006,345-325-6558,345-325-6558,Not captured,Not captured,tdeosaran@hotmail.com,Not captured,701823173,,Not captured,Not captured,Not captured,Not captured,Not captured,Not captured,