EE Transaction Type,Dependent Transaction Type,Effective Date,EE Signature,EE Signature Date,Control,Suffix,Account,Plan Number,Plan Name,Claim Office,Network ID Number,Customer Code,EE SSN,Dependent SSN,Dependent Relationship,Last Name,First Name,Middle Initial,DOB,Gender,Ethnicity,PCP/PCD,PCP/PCD Current Patient,Provider Cap Office Number,COB,Dep Student Indicator,Dep OOA Indicator,EE Prior Coverage Indicator,EE Late Entrant,EE Language Indicator,Hire Date,Earnings,Earnings Frequency,Beneficiary (Last Name First Name MI),Beneficiary Relationship,Continuation of Coverage Expiration Date,Continuation of Coverage Event Date,Continuation of Coverage Length of Coverage,Work Location Zip Code,Street Address Line 1,Street Address Line 2,City,State,Zip Code,Home Phone Number,Work Phone Number,Accept Code,Evidence Code,EE Email Address,Communication Disability Code,EE Alternate ID,Dep Alternate ID,Old Control,Old Suffix,Old Account,New Control,New Suffix,New Account,
Not captured,Not captured,09/18/2018,Not captured,Not captured,863949,020,00072,ARS-01-0044488,Beacon International,Not captured,Not captured,Not captured,,,,misiewicz,urszula,,08/05/1951,female,Not captured,Not captured,Not captured,Not captured,Not captured,Not captured,Not captured,Not captured,Not captured,Not captured,Not captured,Not captured,Not captured,,,Not captured,Not captured,Not captured,Not captured,10908 185th ave,,bonney lake,Washington,98391,,,Not captured,Not captured,marccram12@gmail.com,Not captured,701820429,,Not captured,Not captured,Not captured,Not captured,Not captured,Not captured,
Not captured,Not captured,09/18/2018,Not captured,Not captured,863949,020,00072,ARS-01-0044487,Beacon International,Not captured,Not captured,Not captured,,,,Sisemore,Destin,,06/22/1993,male,Not captured,Not captured,Not captured,Not captured,Not captured,Not captured,Not captured,Not captured,Not captured,Not captured,Not captured,Not captured,Not captured,,,Not captured,Not captured,Not captured,Not captured,654 Park Place,,Brooklyn,New York,11216,,,Not captured,Not captured,destin@routehappy.com,Not captured,701820428,,Not captured,Not captured,Not captured,Not captured,Not captured,Not captured,
Not captured,Not captured,09/18/2018,Not captured,Not captured,863949,020,00072,ARS-01-0044486,Beacon International,Not captured,Not captured,Not captured,,,,McKerr,Marianne,F,09/21/1960,female,Not captured,Not captured,Not captured,Not captured,Not captured,Not captured,Not captured,Not captured,Not captured,Not captured,Not captured,Not captured,Not captured,Jerry McKerr,spouse,Not captured,Not captured,Not captured,Not captured,2581 Independence,,Glenview,Illinois,60026,3124021406,8478280447,Not captured,Not captured,mariannemckerr@mac.com,Not captured,701820422,,Not captured,Not captured,Not captured,Not captured,Not captured,Not captured,
Not captured,Not captured,09/18/2018,Not captured,Not captured,863949,020,00072,ARS-01-0044480,Beacon International,Not captured,Not captured,Not captured,,,,Black,Katrina,D,09/14/1978,female,Not captured,Not captured,Not captured,Not captured,Not captured,Not captured,Not captured,Not captured,Not captured,Not captured,Not captured,Not captured,Not captured,,,Not captured,Not captured,Not captured,Not captured,66 Austin Circle,,Rossville,Georgia,30741,,,Not captured,Not captured,ugatuwana@yahoo.com,Not captured,701820414,,Not captured,Not captured,Not captured,Not captured,Not captured,Not captured,
Not captured,Not captured,09/18/2018,Not captured,Not captured,863949,020,00072,ARS-01-0044479,Beacon International,Not captured,Not captured,Not captured,,,,Commons,Tuwana,M,12/11/1976,female,Not captured,Not captured,Not captured,Not captured,Not captured,Not captured,Not captured,Not captured,Not captured,Not captured,Not captured,Not captured,Not captured,,,Not captured,Not captured,Not captured,Not captured,66 Austin Circle,,Rossville,Georgia,30741,,,Not captured,Not captured,ugatuwana@yahoo.com,Not captured,701820413,,Not captured,Not captured,Not captured,Not captured,Not captured,Not captured,
Not captured,Not captured,09/18/2018,Not captured,Not captured,863949,020,00072,ARS-01-0044468,Beacon International,Not captured,Not captured,Not captured,,,,Valek,Edward,J,11/19/1960,male,Not captured,Not captured,Not captured,Not captured,Not captured,Not captured,Not captured,Not captured,Not captured,Not captured,Not captured,Not captured,Not captured,,,Not captured,Not captured,Not captured,Not captured,2919 Pony Lane,,Sarasota,Florida,34232,,,Not captured,Not captured,kjvalek@comcast.net,Not captured,701820402,,Not captured,Not captured,Not captured,Not captured,Not captured,Not captured,
Not captured,Not captured,09/18/2018,Not captured,Not captured,863949,020,00072,ARS-01-0044467,Beacon International,Not captured,Not captured,Not captured,,,,BRUURSEMA,CHERRY,S,10/04/1981,female,Not captured,Not captured,Not captured,Not captured,Not captured,Not captured,Not captured,Not captured,Not captured,Not captured,Not captured,Not captured,Not captured,,,Not captured,Not captured,Not captured,Not captured,5643 SE 83RD AVE,,Portland,Michigan,97266,,,Not captured,Not captured,cherryk8@gmail.com,Not captured,701820401,,Not captured,Not captured,Not captured,Not captured,Not captured,Not captured,
Not captured,Not captured,09/18/2018,Not captured,Not captured,863949,020,00072,ARS-01-0044466,Beacon International,Not captured,Not captured,Not captured,,,,Szatko,Slavek,K,10/04/1978,male,Not captured,Not captured,Not captured,Not captured,Not captured,Not captured,Not captured,Not captured,Not captured,Not captured,Not captured,Not captured,Not captured,,,Not captured,Not captured,Not captured,Not captured,1321 Rose Ave,,Carol Stream,Illinois,60188,,,Not captured,Not captured,sslawii@yahoo.com,Not captured,701821526,,Not captured,Not captured,Not captured,Not captured,Not captured,Not captured,
Not captured,Not captured,09/18/2018,Not captured,Not captured,863949,020,00072,ARS-02-0044465,Beacon America,Not captured,Not captured,Not captured,,,,Tanis,Juliana,,09/15/1980,female,Not captured,Not captured,Not captured,Not captured,Not captured,Not captured,Not captured,Not captured,Not captured,Not captured,Not captured,Not captured,Not captured,,,Not captured,Not captured,Not captured,Not captured,504 WABASH AVE,,GRANITE FALLS,Washington,98252,,,Not captured,Not captured,daleandjulie@hotmail.com,Not captured,701821525,,Not captured,Not captured,Not captured,Not captured,Not captured,Not captured,
Not captured,Not captured,09/18/2018,Not captured,Not captured,863949,020,00072,ARS-02-0044464,Beacon America,Not captured,Not captured,Not captured,,,,BARNECH,MARIANA,,07/03/1986,female,Not captured,Not captured,Not captured,Not captured,Not captured,Not captured,Not captured,Not captured,Not captured,Not captured,Not captured,Not captured,Not captured,,,Not captured,Not captured,Not captured,Not captured,3749 MANUELA PEDRAZA,,BUENOS AIRES,,1430,,,Not captured,Not captured,marianbarnech@gmail.com,Not captured,701821524,,Not captured,Not captured,Not captured,Not captured,Not captured,Not captured,
Not captured,Not captured,09/18/2018,Not captured,Not captured,863949,020,00072,ARS-02-0044463,Beacon America,Not captured,Not captured,Not captured,,,,Sengayi,Nyasha,G,09/08/1985,female,Not captured,Not captured,Not captured,Not captured,Not captured,Not captured,Not captured,Not captured,Not captured,Not captured,Not captured,Not captured,Not captured,,,Not captured,Not captured,Not captured,Not captured,12 Abbey Court Avenues,,Harare,,94114,,,Not captured,Not captured,nyashasengayi@gmail.com,Not captured,701821523,,Not captured,Not captured,Not captured,Not captured,Not captured,Not captured,
Not captured,Not captured,09/17/2018,Not captured,Not captured,863949,020,00072,ARS-01-0044462,Beacon International,Not captured,Not captured,Not captured,,,,Plummer,Kristen,L,06/27/1969,female,Not captured,Not captured,Not captured,Not captured,Not captured,Not captured,Not captured,Not captured,Not captured,Not captured,Not captured,Not captured,Not captured,,,Not captured,Not captured,Not captured,Not captured,928 Turnberry Lane,,Southlake,Texas,76092,,,Not captured,Not captured,kris@groupmetier.com,Not captured,701821522,,Not captured,Not captured,Not captured,Not captured,Not captured,Not captured,
Not captured,Not captured,09/17/2018,Not captured,Not captured,863949,020,00072,ARS-01-0044461,Beacon International,Not captured,Not captured,Not captured,,,,Weinberger,Hyaman,,08/08/1955,male,Not captured,Not captured,Not captured,Not captured,Not captured,Not captured,Not captured,Not captured,Not captured,Not captured,Not captured,Not captured,Not captured,,,Not captured,Not captured,Not captured,Not captured,4800 14th Ave,,Brooklyn,New York,11219,8454250680,,Not captured,Not captured,madammw@aol.com,Not captured,701821521,,Not captured,Not captured,Not captured,Not captured,Not captured,Not captured,
Not captured,Not captured,09/17/2018,Not captured,Not captured,863949,020,00072,ARS-01-0044460,Beacon International,Not captured,Not captured,Not captured,,,,Weinberger,Margerate  ,,05/16/1957,female,Not captured,Not captured,Not captured,Not captured,Not captured,Not captured,Not captured,Not captured,Not captured,Not captured,Not captured,Not captured,Not captured,,,Not captured,Not captured,Not captured,Not captured,4800 14th Ave,,Brooklyn,New York,11219,8454250680,,Not captured,Not captured,madammw@aol.com,Not captured,701821520,,Not captured,Not captured,Not captured,Not captured,Not captured,Not captured,
Not captured,Not captured,09/17/2018,Not captured,Not captured,863949,020,00072,OVI-28-0044458,OverseasCare Visitors Insurance Plan,Not captured,Not captured,Not captured,Passport(L4031785),,,Katpally,Sunitha,,01/16/1963,female,Not captured,Not captured,Not captured,Not captured,Not captured,Not captured,Not captured,Not captured,Not captured,Not captured,Not captured,Not captured,Not captured,Kiran Kumar Reddy Katpally,Son,Not captured,Not captured,Not captured,Not captured,565 Oaks Ln,,Pompano Beach,Florida,33069,9043160784,,Not captured,Not captured,kiranrcse@gmail.com,Not captured,701821518,,Not captured,Not captured,Not captured,Not captured,Not captured,Not captured,
Not captured,Not captured,09/17/2018,Not captured,Not captured,863949,020,00072,OVI-28-0044457,OverseasCare Visitors Insurance Plan,Not captured,Not captured,Not captured,Passport(L4031785),,,Katpally,Narayan Reddy,,03/15/1959,male,Not captured,Not captured,Not captured,Not captured,Not captured,Not captured,Not captured,Not captured,Not captured,Not captured,Not captured,Not captured,Not captured,Kiran Kumar Reddy Katpally,Son,Not captured,Not captured,Not captured,Not captured,565 Oaks Ln,,Pompano Beach,Florida,33069,9043160784,,Not captured,Not captured,kiranrcse@gmail.com,Not captured,701821517,,Not captured,Not captured,Not captured,Not captured,Not captured,Not captured,
Not captured,Not captured,09/17/2018,Not captured,Not captured,863949,020,00072,ARS-05-0043986,Clear America,Not captured,Not captured,Not captured,Passport(EQ0001023),,,Rahmato,Aychiluhm,Beyene,10/10/1974,male,Not captured,Not captured,Not captured,Not captured,Not captured,Not captured,Not captured,Not captured,Not captured,Not captured,Not captured,Not captured,Not captured,,,Not captured,Not captured,Not captured,Not captured,2304 Zanker Road,,San Jose,California,95131,4082325600,,Not captured,Not captured,aychiluhm@yahoo.com,Not captured,701800275,,Not captured,Not captured,Not captured,Not captured,Not captured,Not captured,
Not captured,Not captured,09/17/2018,Not captured,Not captured,863949,020,00072,ARS-05-0043986,Clear America,Not captured,Not captured,Not captured,,Passport(EP3945902),Spouse,Tilahun,Tsega,Wondimagegnehu,10/13/1982,female,Not captured,Not captured,Not captured,Not captured,Not captured,Not captured,Not captured,Not captured,Not captured,Not captured,Not captured,Not captured,Not captured,,,Not captured,Not captured,Not captured,Not captured,2304 Zanker Road,,San Jose,California,95131,4082325600,,Not captured,Not captured,aychiluhm@yahoo.com,Not captured,,701800276,Not captured,Not captured,Not captured,Not captured,Not captured,Not captured,
Not captured,Not captured,09/17/2018,Not captured,Not captured,863949,020,00072,ARS-05-0043986,Clear America,Not captured,Not captured,Not captured,,Passport(EP3660192),Dependant,Beyene,Fikir,Aychiluhm,11/23/2009,female,Not captured,Not captured,Not captured,Not captured,Not captured,Not captured,Not captured,Not captured,Not captured,Not captured,Not captured,Not captured,Not captured,,,Not captured,Not captured,Not captured,Not captured,2304 Zanker Road,,San Jose,California,95131,4082325600,,Not captured,Not captured,aychiluhm@yahoo.com,Not captured,,701800277,Not captured,Not captured,Not captured,Not captured,Not captured,Not captured,
Not captured,Not captured,09/17/2018,Not captured,Not captured,863949,020,00072,ARS-05-0043986,Clear America,Not captured,Not captured,Not captured,,Passport(EP2213249),Dependant,Beyene,Hasset,Aychilluhm,01/15/2012,female,Not captured,Not captured,Not captured,Not captured,Not captured,Not captured,Not captured,Not captured,Not captured,Not captured,Not captured,Not captured,Not captured,,,Not captured,Not captured,Not captured,Not captured,2304 Zanker Road,,San Jose,California,95131,4082325600,,Not captured,Not captured,aychiluhm@yahoo.com,Not captured,,701800278,Not captured,Not captured,Not captured,Not captured,Not captured,Not captured,
Not captured,Not captured,09/17/2018,Not captured,Not captured,863949,020,00072,ARS-05-0043986,Clear America,Not captured,Not captured,Not captured,,Passport(EP3660306),Dependant,Beyene,Shalom,Aychiluhm,05/26/2015,male,Not captured,Not captured,Not captured,Not captured,Not captured,Not captured,Not captured,Not captured,Not captured,Not captured,Not captured,Not captured,Not captured,,,Not captured,Not captured,Not captured,Not captured,2304 Zanker Road,,San Jose,California,95131,4082325600,,Not captured,Not captured,aychiluhm@yahoo.com,Not captured,,701800279,Not captured,Not captured,Not captured,Not captured,Not captured,Not captured,
Not captured,Not captured,09/17/2018,Not captured,Not captured,863949,020,00072,ARS-05-0043986,Clear America,Not captured,Not captured,Not captured,,Passport(ETH1001A),Dependant,Beyene,Ethan,Aychiluhm,08/13/2018,male,Not captured,Not captured,Not captured,Not captured,Not captured,Not captured,Not captured,Not captured,Not captured,Not captured,Not captured,Not captured,Not captured,,,Not captured,Not captured,Not captured,Not captured,2304 Zanker Road,,San Jose,California,95131,4082325600,,Not captured,Not captured,aychiluhm@yahoo.com,Not captured,,701800280,Not captured,Not captured,Not captured,Not captured,Not captured,Not captured,
Not captured,Not captured,09/17/2018,Not captured,Not captured,863949,020,00072,ARS-05-0043986,Clear America,Not captured,Not captured,Not captured,,Passport(ETH1001A),Dependant,Beyene,Nathan,Aychiluhm,08/13/2013,male,Not captured,Not captured,Not captured,Not captured,Not captured,Not captured,Not captured,Not captured,Not captured,Not captured,Not captured,Not captured,Not captured,,,Not captured,Not captured,Not captured,Not captured,2304 Zanker Road,,San Jose,California,95131,4082325600,,Not captured,Not captured,aychiluhm@yahoo.com,Not captured,,701800281,Not captured,Not captured,Not captured,Not captured,Not captured,Not captured,
Not captured,Not captured,09/17/2018,Not captured,Not captured,863949,020,00072,ARS-01-0044442,Beacon International,Not captured,Not captured,Not captured,,,,Eastman,Abby,,05/26/1980,female,Not captured,Not captured,Not captured,Not captured,Not captured,Not captured,Not captured,Not captured,Not captured,Not captured,Not captured,Not captured,Not captured,,,Not captured,Not captured,Not captured,Not captured,16488 Redington Drive,,Redington Beach,Florida,33708,,,Not captured,Not captured,jacobeastman@gmail.com,Not captured,701852689,,Not captured,Not captured,Not captured,Not captured,Not captured,Not captured,
Not captured,Not captured,09/17/2018,Not captured,Not captured,863949,020,00072,ARS-01-0044441,Beacon International,Not captured,Not captured,Not captured,,,,Eastman,Jacob,,03/25/1979,male,Not captured,Not captured,Not captured,Not captured,Not captured,Not captured,Not captured,Not captured,Not captured,Not captured,Not captured,Not captured,Not captured,,,Not captured,Not captured,Not captured,Not captured,16488 Redington Drive,,Redington Beach,Florida,33708,,,Not captured,Not captured,jacobeastman@gmail.com,Not captured,701852688,,Not captured,Not captured,Not captured,Not captured,Not captured,Not captured,
Not captured,Not captured,09/18/2018,Not captured,Not captured,863949,020,00072,ARS-01-0044440,Beacon International,Not captured,Not captured,Not captured,,,,KUMAR,GOVIN,N,02/04/1980,male,Not captured,Not captured,Not captured,Not captured,Not captured,Not captured,Not captured,Not captured,Not captured,Not captured,Not captured,Not captured,Not captured,GOVIN KUMAR,SPOUSE,Not captured,Not captured,Not captured,Not captured,3 SPRINGVALE ROAD,,VALSAYN SOUTH,VALSAYN SOUTH,00000,8687324007,,Not captured,Not captured,vanita.lutchmeesingh@gmail.com,Not captured,701852683,,Not captured,Not captured,Not captured,Not captured,Not captured,Not captured,
Not captured,Not captured,09/18/2018,Not captured,Not captured,863949,020,00072,ARS-01-0044439,Beacon International,Not captured,Not captured,Not captured,Passport(TB015401),,,LUTCHMEESINGH,VANITA,V,11/25/1979,female,Not captured,Not captured,Not captured,Not captured,Not captured,Not captured,Not captured,Not captured,Not captured,Not captured,Not captured,Not captured,Not captured,GOVIN KUMAR,SPOUSE,Not captured,Not captured,Not captured,Not captured,3 SPRINGVALE ROAD,,VALSAYN SOUTH,VALSAYN SOUTH,00000,8687324007,,Not captured,Not captured,vanita.lutchmeesingh@gmail.com,Not captured,701852682,,Not captured,Not captured,Not captured,Not captured,Not captured,Not captured,
Not captured,Not captured,09/17/2018,Not captured,Not captured,863949,020,00072,ARS-01-0044438,Beacon International,Not captured,Not captured,Not captured,,,,Bailey,Kaylin,P,01/03/1991,female,Not captured,Not captured,Not captured,Not captured,Not captured,Not captured,Not captured,Not captured,Not captured,Not captured,Not captured,Not captured,Not captured,,,Not captured,Not captured,Not captured,Not captured,803 Stillman Ave,,Redlands,California,92374,,,Not captured,Not captured,chino6017@gmail.com,Not captured,701852671,,Not captured,Not captured,Not captured,Not captured,Not captured,Not captured,
Not captured,Not captured,09/17/2018,Not captured,Not captured,863949,020,00072,ARS-01-0044437,Beacon International,Not captured,Not captured,Not captured,,,,Reyes,Andrew,J,09/26/1984,male,Not captured,Not captured,Not captured,Not captured,Not captured,Not captured,Not captured,Not captured,Not captured,Not captured,Not captured,Not captured,Not captured,,,Not captured,Not captured,Not captured,Not captured,803 Stillman Ave,,Redlands,California,92374,,,Not captured,Not captured,chino6017@gmail.com,Not captured,701852670,,Not captured,Not captured,Not captured,Not captured,Not captured,Not captured,
Not captured,Not captured,09/17/2018,Not captured,Not captured,863949,020,00072,ARS-01-0044436,Beacon International,Not captured,Not captured,Not captured,,,,Burgess,Timoty,J,06/03/1963,male,Not captured,Not captured,Not captured,Not captured,Not captured,Not captured,Not captured,Not captured,Not captured,Not captured,Not captured,Not captured,Not captured,,,Not captured,Not captured,Not captured,Not captured,2-29-4-903 Shiohama,,Koto-ku Tokyo,,135-0043,,,Not captured,Not captured,info@ontica.com,Not captured,701852669,,Not captured,Not captured,Not captured,Not captured,Not captured,Not captured,
Not captured,Not captured,09/16/2018,Not captured,Not captured,863949,020,00072,ARS-02-0044434,Beacon America,Not captured,Not captured,Not captured,,,,abdul,rahim khan,k,08/18/1983,male,Not captured,Not captured,Not captured,Not captured,Not captured,Not captured,Not captured,Not captured,Not captured,Not captured,Not captured,Not captured,Not captured,Fatima Begum,spouse,Not captured,Not captured,Not captured,Not captured,23 157th Ave SE,,Bellevue,Washington,98008,2069471968,,Not captured,Not captured,rahim.it83@gmail.com,Not captured,701852667,,Not captured,Not captured,Not captured,Not captured,Not captured,Not captured,
Not captured,Not captured,09/17/2018,Not captured,Not captured,863949,020,00072,ARS-01-0044433,Beacon International,Not captured,Not captured,Not captured,,,,Barsukova,Vasilisa,O,03/21/1989,female,Not captured,Not captured,Not captured,Not captured,Not captured,Not captured,Not captured,Not captured,Not captured,Not captured,Not captured,Not captured,Not captured,,,Not captured,Not captured,Not captured,Not captured,P.O. Box 332,,Bronwood,Georgia,39826,,,Not captured,Not captured,ruslana64@yahoo.com,Not captured,701852666,,Not captured,Not captured,Not captured,Not captured,Not captured,Not captured,
Not captured,Not captured,09/16/2018,Not captured,Not captured,863949,020,00072,ARS-01-0044430,Beacon International,Not captured,Not captured,Not captured,,,,Sledge,Dana,S,09/29/1980,female,Not captured,Not captured,Not captured,Not captured,Not captured,Not captured,Not captured,Not captured,Not captured,Not captured,Not captured,Not captured,Not captured,,,Not captured,Not captured,Not captured,Not captured,512 N. Louise st,,Glendale,California,91206,,,Not captured,Not captured,Danasimone@gmail.com,Not captured,701852662,,Not captured,Not captured,Not captured,Not captured,Not captured,Not captured,
Not captured,Not captured,09/17/2018,Not captured,Not captured,863949,020,00072,ARS-01-0044429,Beacon International,Not captured,Not captured,Not captured,Passport(561187177),,,selengut,yehudis,,11/18/1998,female,Not captured,Not captured,Not captured,Not captured,Not captured,Not captured,Not captured,Not captured,Not captured,Not captured,Not captured,Not captured,Not captured,keren yisroel,other,Not captured,Not captured,Not captured,Not captured,610 monmouth,,lkwd,New Jersey,08701,7327790713,7327790713,Not captured,Not captured,sele399@yahoo.com,Not captured,701852661,,Not captured,Not captured,Not captured,Not captured,Not captured,Not captured,
Not captured,Not captured,09/17/2018,Not captured,Not captured,863949,020,00072,ARS-01-0044428,Beacon International,Not captured,Not captured,Not captured,Passport(561187176),,,selengut,yocheved,,11/18/1998,female,Not captured,Not captured,Not captured,Not captured,Not captured,Not captured,Not captured,Not captured,Not captured,Not captured,Not captured,Not captured,Not captured,keren yisroel,other,Not captured,Not captured,Not captured,Not captured,209 2nd st,,lkwd,New Jersey,08701,7327790713,7327790713,Not captured,Not captured,sele399@yahoo.com,Not captured,701852660,,Not captured,Not captured,Not captured,Not captured,Not captured,Not captured,
Not captured,Not captured,09/16/2018,Not captured,Not captured,863949,020,00072,ARS-01-0044426,Beacon International,Not captured,Not captured,Not captured,,,,Ryckman,Jessica,,04/08/1982,female,Not captured,Not captured,Not captured,Not captured,Not captured,Not captured,Not captured,Not captured,Not captured,Not captured,Not captured,Not captured,Not captured,,,Not captured,Not captured,Not captured,Not captured,10817 Madison Street,,Kensington,Maryland,20895,,,Not captured,Not captured,jlryckman@gmail.com,Not captured,701852658,,Not captured,Not captured,Not captured,Not captured,Not captured,Not captured,