EE Transaction Type,Dependent Transaction Type,Effective Date,EE Signature,EE Signature Date,Control,Suffix,Account,Plan Number,Plan Name,Claim Office,Network ID Number,Customer Code,EE SSN,Dependent SSN,Dependent Relationship,Last Name,First Name,Middle Initial,DOB,Gender,Ethnicity,PCP/PCD,PCP/PCD Current Patient,Provider Cap Office Number,COB,Dep Student Indicator,Dep OOA Indicator,EE Prior Coverage Indicator,EE Late Entrant,EE Language Indicator,Hire Date,Earnings,Earnings Frequency,Beneficiary (Last Name First Name MI),Beneficiary Relationship,Continuation of Coverage Expiration Date,Continuation of Coverage Event Date,Continuation of Coverage Length of Coverage,Work Location Zip Code,Street Address Line 1,Street Address Line 2,City,State,Zip Code,Home Phone Number,Work Phone Number,Accept Code,Evidence Code,EE Email Address,Communication Disability Code,EE Alternate ID,Dep Alternate ID,Old Control,Old Suffix,Old Account,New Control,New Suffix,New Account,
Not captured,Not captured,09/10/2018,Not captured,Not captured,863949,020,00072,ARS-01-0044281,Beacon International,Not captured,Not captured,Not captured,,,,Aguilar,Cristina,,12/26/1977,female,Not captured,Not captured,Not captured,Not captured,Not captured,Not captured,Not captured,Not captured,Not captured,Not captured,Not captured,Not captured,Not captured,,,Not captured,Not captured,Not captured,Not captured,1528-A Apache DR,,Chula Vista,California,91910,,,Not captured,Not captured,rocarrillo16@gmail.com,Not captured,701821413,,Not captured,Not captured,Not captured,Not captured,Not captured,Not captured,
Not captured,Not captured,09/10/2018,Not captured,Not captured,863949,020,00072,ARS-01-0044280,Beacon International,Not captured,Not captured,Not captured,,,,Carrillo,Roberto,,07/01/1973,male,Not captured,Not captured,Not captured,Not captured,Not captured,Not captured,Not captured,Not captured,Not captured,Not captured,Not captured,Not captured,Not captured,,,Not captured,Not captured,Not captured,Not captured,1528-A Apache DR,,Chula Vista,California,91910,,,Not captured,Not captured,rocarrillo16@gmail.com,Not captured,701821412,,Not captured,Not captured,Not captured,Not captured,Not captured,Not captured,
Not captured,Not captured,09/10/2018,Not captured,Not captured,863949,020,00072,ARS-02-0044278,Beacon America,Not captured,Not captured,Not captured,,,,DIAO,NINA,,11/27/1942,female,Not captured,Not captured,Not captured,Not captured,Not captured,Not captured,Not captured,Not captured,Not captured,Not captured,Not captured,Not captured,Not captured,ECHO JIN YILMAZ,DAUGHTER,Not captured,Not captured,Not captured,Not captured,16093 TAMARIND TERRACE,,CHINO HILLS,California,91709,9093250873,,Not captured,Not captured,ECHOJYILMAZ@HOTMAIL.COM,Not captured,701821409,,Not captured,Not captured,Not captured,Not captured,Not captured,Not captured,
Not captured,Not captured,09/10/2018,Not captured,Not captured,863949,020,00072,ARS-01-0044273,Beacon International,Not captured,Not captured,Not captured,,,,Henning,John,,07/25/1964,male,Not captured,Not captured,Not captured,Not captured,Not captured,Not captured,Not captured,Not captured,Not captured,Not captured,Not captured,Not captured,Not captured,John Henning,Husband ,Not captured,Not captured,Not captured,Not captured,548 Market St. #13776,,San Francisco,California,94104,4159399752,,Not captured,Not captured,danlabbe@granitesolutionsgroupe.com,Not captured,701821389,,Not captured,Not captured,Not captured,Not captured,Not captured,Not captured,
Not captured,Not captured,09/10/2018,Not captured,Not captured,863949,020,00072,ARS-01-0044272,Beacon International,Not captured,Not captured,Not captured,,,,Labbe,Daniel,,01/26/1970,male,Not captured,Not captured,Not captured,Not captured,Not captured,Not captured,Not captured,Not captured,Not captured,Not captured,Not captured,Not captured,Not captured,John Henning,Husband ,Not captured,Not captured,Not captured,Not captured,548 Market St. #13776,,San Francisco,California,94104,4159399752,,Not captured,Not captured,danlabbe@granitesolutionsgroupe.com,Not captured,701821388,,Not captured,Not captured,Not captured,Not captured,Not captured,Not captured,
Not captured,Not captured,09/10/2018,Not captured,Not captured,863949,020,00072,ARS-01-0044270,Beacon International,Not captured,Not captured,Not captured,,,,Jabro,Sarah,R,08/02/1990,female,Not captured,Not captured,Not captured,Not captured,Not captured,Not captured,Not captured,Not captured,Not captured,Not captured,Not captured,Not captured,Not captured,,,Not captured,Not captured,Not captured,Not captured,1595 avenida oceano,,Oceanside,California,92056,,,Not captured,Not captured,sarahjabro@gmail.com,Not captured,701821386,,Not captured,Not captured,Not captured,Not captured,Not captured,Not captured,
Not captured,Not captured,09/10/2018,Not captured,Not captured,863949,020,00072,ARS-01-0044269,Beacon International,Not captured,Not captured,Not captured,,,,Sandell,William,E,06/12/1965,male,Not captured,Not captured,Not captured,Not captured,Not captured,Not captured,Not captured,Not captured,Not captured,Not captured,Not captured,Not captured,Not captured,,,Not captured,Not captured,Not captured,Not captured,2338 NW 95th St,,Seattle,Washington,98117,,,Not captured,Not captured,wsandell@comcast.net,Not captured,701821381,,Not captured,Not captured,Not captured,Not captured,Not captured,Not captured,
Not captured,Not captured,09/10/2018,Not captured,Not captured,863949,020,00072,ARS-01-0044268,Beacon International,Not captured,Not captured,Not captured,,,,Richards,Melissa,,11/03/1971,female,Not captured,Not captured,Not captured,Not captured,Not captured,Not captured,Not captured,Not captured,Not captured,Not captured,Not captured,Not captured,Not captured,,,Not captured,Not captured,Not captured,Not captured,2338 NW 95th St,,Seattle,Washington,98117,,,Not captured,Not captured,wsandell@comcast.net,Not captured,701821380,,Not captured,Not captured,Not captured,Not captured,Not captured,Not captured,
Not captured,Not captured,09/10/2018,Not captured,Not captured,863949,020,00072,ARS-01-0044267,Beacon International,Not captured,Not captured,Not captured,,,,Eley,Erica,,04/02/1991,female,Not captured,Not captured,Not captured,Not captured,Not captured,Not captured,Not captured,Not captured,Not captured,Not captured,Not captured,Not captured,Not captured,,,Not captured,Not captured,Not captured,Not captured,6210 Belcrest Road Apt 1347,,Hyattsville,Maryland,20782,,,Not captured,Not captured,bcass9@vt.edu,Not captured,701821373,,Not captured,Not captured,Not captured,Not captured,Not captured,Not captured,
Not captured,Not captured,09/10/2018,Not captured,Not captured,863949,020,00072,ARS-01-0044266,Beacon International,Not captured,Not captured,Not captured,,,,Cassidy,Brian,,10/26/1990,male,Not captured,Not captured,Not captured,Not captured,Not captured,Not captured,Not captured,Not captured,Not captured,Not captured,Not captured,Not captured,Not captured,,,Not captured,Not captured,Not captured,Not captured,6210 Belcrest Road Apt 1347,,Hyattsville,Maryland,20782,,,Not captured,Not captured,bcass9@vt.edu,Not captured,701821372,,Not captured,Not captured,Not captured,Not captured,Not captured,Not captured,
Not captured,Not captured,09/10/2018,Not captured,Not captured,863949,020,00072,ARS-01-0044265,Beacon International,Not captured,Not captured,Not captured,,,,Kvedaras,Vytautas,,09/07/1985,male,Not captured,Not captured,Not captured,Not captured,Not captured,Not captured,Not captured,Not captured,Not captured,Not captured,Not captured,Not captured,Not captured,,,Not captured,Not captured,Not captured,Not captured,Konows gate 75a,,Oslo,,0196,,,Not captured,Not captured,vkvedaras85@gmail.com,Not captured,701821371,,Not captured,Not captured,Not captured,Not captured,Not captured,Not captured,
Not captured,Not captured,09/10/2018,Not captured,Not captured,863949,020,00072,ARS-01-0044263,Beacon International,Not captured,Not captured,Not captured,,,,French,Erin,,12/06/1982,female,Not captured,Not captured,Not captured,Not captured,Not captured,Not captured,Not captured,Not captured,Not captured,Not captured,Not captured,Not captured,Not captured,,,Not captured,Not captured,Not captured,Not captured,15737 NE 59th Way,,Remond,Washington,98052,,,Not captured,Not captured,efrenche@live.com,Not captured,701823685,,Not captured,Not captured,Not captured,Not captured,Not captured,Not captured,
Not captured,Not captured,09/09/2018,Not captured,Not captured,863949,020,00072,ARS-01-0044259,Beacon International,Not captured,Not captured,Not captured,,,,Fallone,Deborah,A,09/18/1951,female,Not captured,Not captured,Not captured,Not captured,Not captured,Not captured,Not captured,Not captured,Not captured,Not captured,Not captured,Not captured,Not captured,,,Not captured,Not captured,Not captured,Not captured,201 East 19th St Apt 15G,,New York,New York,10003,,,Not captured,Not captured,kristen.fallone@gmail.com,Not captured,701823680,,Not captured,Not captured,Not captured,Not captured,Not captured,Not captured,
Not captured,Not captured,09/09/2018,Not captured,Not captured,863949,020,00072,ARS-01-0044258,Beacon International,Not captured,Not captured,Not captured,,,,Fallone,Kristen,,04/10/1981,female,Not captured,Not captured,Not captured,Not captured,Not captured,Not captured,Not captured,Not captured,Not captured,Not captured,Not captured,Not captured,Not captured,,,Not captured,Not captured,Not captured,Not captured,201 East 19th St Apt 15G,,New York,New York,10003,,,Not captured,Not captured,kristen.fallone@gmail.com,Not captured,701823679,,Not captured,Not captured,Not captured,Not captured,Not captured,Not captured,
Not captured,Not captured,09/09/2018,Not captured,Not captured,863949,020,00072,ARS-02-0044255,Beacon America,Not captured,Not captured,Not captured,,,,Bennett,Zachary,M,10/16/1992,male,Not captured,Not captured,Not captured,Not captured,Not captured,Not captured,Not captured,Not captured,Not captured,Not captured,Not captured,Not captured,Not captured,,,Not captured,Not captured,Not captured,Not captured,550 central ave,,Thunder bay,Ontario,P7b2r1,,,Not captured,Not captured,zackbee77@gmail.com,Not captured,701823676,,Not captured,Not captured,Not captured,Not captured,Not captured,Not captured,
Not captured,Not captured,09/10/2018,Not captured,Not captured,863949,020,00072,ARS-01-0044242,Beacon International,Not captured,Not captured,Not captured,,,,Dias,Marina,,10/06/1991,female,Not captured,Not captured,Not captured,Not captured,Not captured,Not captured,Not captured,Not captured,Not captured,Not captured,Not captured,Not captured,Not captured,Maria Julieta Graca Resio Dias,Mother,Not captured,Not captured,Not captured,Not captured,Rua Manuel Batista Barros 121,,Maia,Porto,4470 395,911090118,,Not captured,Not captured,marina.resio@gmail.com,Not captured,701823663,,Not captured,Not captured,Not captured,Not captured,Not captured,Not captured,
Not captured,Not captured,09/09/2018,Not captured,Not captured,863949,020,00072,ARS-02-0044240,Beacon America,Not captured,Not captured,Not captured,,,,O&rsquo;Grady,Billy,,10/12/1990,male,Not captured,Not captured,Not captured,Not captured,Not captured,Not captured,Not captured,Not captured,Not captured,Not captured,Not captured,Not captured,Not captured,,,Not captured,Not captured,Not captured,Not captured,Flat 3 493 kingsland road,,London,,E8 4AU,,,Not captured,Not captured,laurenrosemiller@gmail.com,Not captured,701823661,,Not captured,Not captured,Not captured,Not captured,Not captured,Not captured,
Not captured,Not captured,09/09/2018,Not captured,Not captured,863949,020,00072,ARS-02-0044239,Beacon America,Not captured,Not captured,Not captured,,,,Miller,Lauren,,07/20/1993,female,Not captured,Not captured,Not captured,Not captured,Not captured,Not captured,Not captured,Not captured,Not captured,Not captured,Not captured,Not captured,Not captured,,,Not captured,Not captured,Not captured,Not captured,Flat 3 493 kingsland road,,London,,E8 4AU,,,Not captured,Not captured,laurenrosemiller@gmail.com,Not captured,701823660,,Not captured,Not captured,Not captured,Not captured,Not captured,Not captured,
Not captured,Not captured,09/09/2018,Not captured,Not captured,863949,020,00072,ARS-01-0044238,Beacon International,Not captured,Not captured,Not captured,,,,Patterson,Mark,C,08/24/1975,male,Not captured,Not captured,Not captured,Not captured,Not captured,Not captured,Not captured,Not captured,Not captured,Not captured,Not captured,Not captured,Not captured,,,Not captured,Not captured,Not captured,Not captured,4531 Wallace Ln,,Salt Lake City,Utah,84117,,,Not captured,Not captured,markcp4@yahoo.com,Not captured,701823659,,Not captured,Not captured,Not captured,Not captured,Not captured,Not captured,
Not captured,Not captured,09/09/2018,Not captured,Not captured,863949,020,00072,ARS-01-0044237,Beacon International,Not captured,Not captured,Not captured,,,,Goryl,James,R,12/14/1973,male,Not captured,Not captured,Not captured,Not captured,Not captured,Not captured,Not captured,Not captured,Not captured,Not captured,Not captured,Not captured,Not captured,,,Not captured,Not captured,Not captured,Not captured,316 W Burlington Ave,,Westomt,Illinois,60559,,,Not captured,Not captured,jgregistration@yahoo.com,Not captured,701823658,,Not captured,Not captured,Not captured,Not captured,Not captured,Not captured,
Not captured,Not captured,09/09/2018,Not captured,Not captured,863949,020,00072,OVI-28-0044234,OverseasCare Visitors Insurance Plan,Not captured,Not captured,Not captured,Passport(463402045),,,Young,Thomas,L,01/27/1943,male,Not captured,Not captured,Not captured,Not captured,Not captured,Not captured,Not captured,Not captured,Not captured,Not captured,Not captured,Not captured,Not captured,,,Not captured,Not captured,Not captured,Not captured,8910 COBBLESTONE LN,,CUMMING,Georgia,30041,6789933998,,Not captured,Not captured,darren.heath66@gmail.com,Not captured,701823651,,Not captured,Not captured,Not captured,Not captured,Not captured,Not captured,
Not captured,Not captured,09/09/2018,Not captured,Not captured,863949,020,00072,OVI-28-0044233,OverseasCare Visitors Insurance Plan,Not captured,Not captured,Not captured,Passport(463402045),,,Young,Irene,,10/06/1946,female,Not captured,Not captured,Not captured,Not captured,Not captured,Not captured,Not captured,Not captured,Not captured,Not captured,Not captured,Not captured,Not captured,,,Not captured,Not captured,Not captured,Not captured,8910 COBBLESTONE LN,,CUMMING,Georgia,30041,6789933998,,Not captured,Not captured,darren.heath66@gmail.com,Not captured,701823650,,Not captured,Not captured,Not captured,Not captured,Not captured,Not captured,
Not captured,Not captured,09/09/2018,Not captured,Not captured,863949,020,00072,ARS-01-0044232,Beacon International,Not captured,Not captured,Not captured,,,,Hansen,Gregory,,12/30/1947,male,Not captured,Not captured,Not captured,Not captured,Not captured,Not captured,Not captured,Not captured,Not captured,Not captured,Not captured,Not captured,Not captured,,,Not captured,Not captured,Not captured,Not captured,134 Meleana place,,Honolulu,Hawaii,96817,,,Not captured,Not captured,sue@chjustice.com,Not captured,701823649,,Not captured,Not captured,Not captured,Not captured,Not captured,Not captured,
Not captured,Not captured,09/08/2018,Not captured,Not captured,863949,020,00072,ARS-01-0044231,Beacon International,Not captured,Not captured,Not captured,,,,Dingman,Alexander,,01/25/1991,male,Not captured,Not captured,Not captured,Not captured,Not captured,Not captured,Not captured,Not captured,Not captured,Not captured,Not captured,Not captured,Not captured,,,Not captured,Not captured,Not captured,Not captured,Alexander Dingman,,Peachtree City,Georgia,30269,,,Not captured,Not captured,adingman@bellsouth.net,Not captured,701823648,,Not captured,Not captured,Not captured,Not captured,Not captured,Not captured,
Not captured,Not captured,09/08/2018,Not captured,Not captured,863949,020,00072,ARS-01-0044230,Beacon International,Not captured,Not captured,Not captured,,,,Born,Levin,,01/05/1985,male,Not captured,Not captured,Not captured,Not captured,Not captured,Not captured,Not captured,Not captured,Not captured,Not captured,Not captured,Not captured,Not captured,,,Not captured,Not captured,Not captured,Not captured,105 Macdougal St,,New York,New York,10012,,,Not captured,Not captured,roxzylok@gmail.com,Not captured,701823647,,Not captured,Not captured,Not captured,Not captured,Not captured,Not captured,
Not captured,Not captured,09/08/2018,Not captured,Not captured,863949,020,00072,ARS-01-0044229,Beacon International,Not captured,Not captured,Not captured,,,,Dyssell,Roxsanne,,06/03/1985,female,Not captured,Not captured,Not captured,Not captured,Not captured,Not captured,Not captured,Not captured,Not captured,Not captured,Not captured,Not captured,Not captured,,,Not captured,Not captured,Not captured,Not captured,105 Macdougal St,,New York,New York,10012,,,Not captured,Not captured,roxzylok@gmail.com,Not captured,701823646,,Not captured,Not captured,Not captured,Not captured,Not captured,Not captured,
Not captured,Not captured,09/08/2018,Not captured,Not captured,863949,020,00072,ARS-01-0044228,Beacon International,Not captured,Not captured,Not captured,,,,Born,Levin,,01/05/1985,male,Not captured,Not captured,Not captured,Not captured,Not captured,Not captured,Not captured,Not captured,Not captured,Not captured,Not captured,Not captured,Not captured,,,Not captured,Not captured,Not captured,Not captured,105 Macdougal St,,New York,New York,10012,,,Not captured,Not captured,roxzylok@gmail.com,Not captured,701823645,,Not captured,Not captured,Not captured,Not captured,Not captured,Not captured,
Not captured,Not captured,09/08/2018,Not captured,Not captured,863949,020,00072,ARS-01-0044227,Beacon International,Not captured,Not captured,Not captured,,,,Dyssell,Roxsanne,,06/03/1985,female,Not captured,Not captured,Not captured,Not captured,Not captured,Not captured,Not captured,Not captured,Not captured,Not captured,Not captured,Not captured,Not captured,,,Not captured,Not captured,Not captured,Not captured,105 Macdougal St,,New York,New York,10012,,,Not captured,Not captured,roxzylok@gmail.com,Not captured,701823644,,Not captured,Not captured,Not captured,Not captured,Not captured,Not captured,
Not captured,Not captured,09/08/2018,Not captured,Not captured,863949,020,00072,ARS-01-0044226,Beacon International,Not captured,Not captured,Not captured,,,,Morehead,William Edward,S,06/23/2000,male,Not captured,Not captured,Not captured,Not captured,Not captured,Not captured,Not captured,Not captured,Not captured,Not captured,Not captured,Not captured,Not captured,,,Not captured,Not captured,Not captured,Not captured,3004 Willing Ave,,Fort Worth,Texas,76110,,,Not captured,Not captured,oldworldhomesoftx@sbcglobal.net,Not captured,701823643,,Not captured,Not captured,Not captured,Not captured,Not captured,Not captured,
Not captured,Not captured,09/08/2018,Not captured,Not captured,863949,020,00072,ARS-01-0044225,Beacon International,Not captured,Not captured,Not captured,,,,Deschell,Sondra,D,07/05/1953,female,Not captured,Not captured,Not captured,Not captured,Not captured,Not captured,Not captured,Not captured,Not captured,Not captured,Not captured,Not captured,Not captured,,,Not captured,Not captured,Not captured,Not captured,16517 Currie Rd. SE,,Monroe,Washington,98272,,,Not captured,Not captured,angeltouch@seanet.com,Not captured,701823642,,Not captured,Not captured,Not captured,Not captured,Not captured,Not captured,
Not captured,Not captured,09/08/2018,Not captured,Not captured,863949,020,00072,ARS-01-0044224,Beacon International,Not captured,Not captured,Not captured,,,,Patel,Disha,,10/24/1988,female,Not captured,Not captured,Not captured,Not captured,Not captured,Not captured,Not captured,Not captured,Not captured,Not captured,Not captured,Not captured,Not captured,,,Not captured,Not captured,Not captured,Not captured,8420 Ashford blvd,,Laurel,Maryland,20707,,,Not captured,Not captured,hugujju@gmail.com,Not captured,701809717,,Not captured,Not captured,Not captured,Not captured,Not captured,Not captured,
Not captured,Not captured,09/08/2018,Not captured,Not captured,863949,020,00072,ARS-01-0044223,Beacon International,Not captured,Not captured,Not captured,,,,Pancholi,Niel,,01/27/1983,male,Not captured,Not captured,Not captured,Not captured,Not captured,Not captured,Not captured,Not captured,Not captured,Not captured,Not captured,Not captured,Not captured,,,Not captured,Not captured,Not captured,Not captured,8420 Ashford blvd,,Laurel,Maryland,20707,,,Not captured,Not captured,hugujju@gmail.com,Not captured,701809716,,Not captured,Not captured,Not captured,Not captured,Not captured,Not captured,
Not captured,Not captured,09/08/2018,Not captured,Not captured,863949,020,00072,ARS-01-0044222,Beacon International,Not captured,Not captured,Not captured,,,,Shapiro,Edward,H,11/25/1989,male,Not captured,Not captured,Not captured,Not captured,Not captured,Not captured,Not captured,Not captured,Not captured,Not captured,Not captured,Not captured,Not captured,,,Not captured,Not captured,Not captured,Not captured,227 Adams Street,,Hoboken,New Jersey,07030,,,Not captured,Not captured,eddyshapiro@gmail.com,Not captured,701809715,,Not captured,Not captured,Not captured,Not captured,Not captured,Not captured,
Not captured,Not captured,09/07/2018,Not captured,Not captured,863949,020,00072,ARS-01-0044221,Beacon International,Not captured,Not captured,Not captured,,,,Nuttall,Cindy,L,12/21/1987,female,Not captured,Not captured,Not captured,Not captured,Not captured,Not captured,Not captured,Not captured,Not captured,Not captured,Not captured,Not captured,Not captured,,,Not captured,Not captured,Not captured,Not captured,230 N KENWOOD ST,,BURBANK,California,91505,,,Not captured,Not captured,marconuttall@gmail.com,Not captured,701809714,,Not captured,Not captured,Not captured,Not captured,Not captured,Not captured,
Not captured,Not captured,09/07/2018,Not captured,Not captured,863949,020,00072,OVI-28-0044220,OverseasCare Visitors Insurance Plan,Not captured,Not captured,Not captured,Passport(N8065737),,,Chouhan,Radha Rani,,01/11/1950,female,Not captured,Not captured,Not captured,Not captured,Not captured,Not captured,Not captured,Not captured,Not captured,Not captured,Not captured,Not captured,Not captured,Ramnivas Singh,Son in law,Not captured,Not captured,Not captured,Not captured,15 Pinoak Dr,,NORTH BRUNSWICK,New Jersey,08902,7328958148,,Not captured,Not captured,ramnivas.singh@gmail.com,Not captured,701809713,,Not captured,Not captured,Not captured,Not captured,Not captured,Not captured,
Not captured,Not captured,09/07/2018,Not captured,Not captured,863949,020,00072,ARS-01-0044218,Beacon International,Not captured,Not captured,Not captured,Passport(K145-5579-2604),,,Kaplan,Melissa,S,01/04/1992,female,Not captured,Not captured,Not captured,Not captured,Not captured,Not captured,Not captured,Not captured,Not captured,Not captured,Not captured,Not captured,Not captured,,,Not captured,Not captured,Not captured,Not captured,1986 Sheridan Rd.,,Buffalo Grove,Illinois,60089,847-331-4530,,Not captured,Not captured,PLKaplan@comcast.net,Not captured,701809710,,Not captured,Not captured,Not captured,Not captured,Not captured,Not captured,
Not captured,Not captured,09/07/2018,Not captured,Not captured,863949,020,00072,ARS-01-0044217,Beacon International,Not captured,Not captured,Not captured,,,,Lane,victoria,J,12/17/1985,female,Not captured,Not captured,Not captured,Not captured,Not captured,Not captured,Not captured,Not captured,Not captured,Not captured,Not captured,Not captured,Not captured,,,Not captured,Not captured,Not captured,Not captured,1421 Shucker Circle,,Mount Pleasant,South Carolina,29464,,,Not captured,Not captured,vjlaneward@gmail.com,Not captured,701809709,,Not captured,Not captured,Not captured,Not captured,Not captured,Not captured,