EE Transaction Type,Dependent Transaction Type,Effective Date,EE Signature,EE Signature Date,Control,Suffix,Account,Plan Number,Plan Name,Claim Office,Network ID Number,Customer Code,EE SSN,Dependent SSN,Dependent Relationship,Last Name,First Name,Middle Initial,DOB,Gender,Ethnicity,PCP/PCD,PCP/PCD Current Patient,Provider Cap Office Number,COB,Dep Student Indicator,Dep OOA Indicator,EE Prior Coverage Indicator,EE Late Entrant,EE Language Indicator,Hire Date,Earnings,Earnings Frequency,Beneficiary (Last Name First Name MI),Beneficiary Relationship,Continuation of Coverage Expiration Date,Continuation of Coverage Event Date,Continuation of Coverage Length of Coverage,Work Location Zip Code,Street Address Line 1,Street Address Line 2,City,State,Zip Code,Home Phone Number,Work Phone Number,Accept Code,Evidence Code,EE Email Address,Communication Disability Code,EE Alternate ID,Dep Alternate ID,Old Control,Old Suffix,Old Account,New Control,New Suffix,New Account,
Not captured,Not captured,09/04/2018,Not captured,Not captured,863949,020,00072,ARS-01-0044141,Beacon International,Not captured,Not captured,Not captured,,,,Boersma,Andrew,,01/04/1997,male,Not captured,Not captured,Not captured,Not captured,Not captured,Not captured,Not captured,Not captured,Not captured,Not captured,Not captured,Not captured,Not captured,,,Not captured,Not captured,Not captured,Not captured,2304 Page Rd,,Durham,North Carolina,27703,,,Not captured,Not captured,andrew.boersma@catchthefire.com,Not captured,701823116,,Not captured,Not captured,Not captured,Not captured,Not captured,Not captured,
Not captured,Not captured,09/04/2018,Not captured,Not captured,863949,020,00072,ARS-01-0044140,Beacon International,Not captured,Not captured,Not captured,,,,Leader,Victoria,J,08/30/1989,female,Not captured,Not captured,Not captured,Not captured,Not captured,Not captured,Not captured,Not captured,Not captured,Not captured,Not captured,Not captured,Not captured,,,Not captured,Not captured,Not captured,Not captured,5660 Keith Rd,,West Vancouver,British Columbia,V7W2N5,,,Not captured,Not captured,victoriajleader@gmail.com,Not captured,701823115,,Not captured,Not captured,Not captured,Not captured,Not captured,Not captured,
Not captured,Not captured,09/04/2018,Not captured,Not captured,863949,020,00072,ARS-01-0044139,Beacon International,Not captured,Not captured,Not captured,,,,Prakash,Andrew,,08/02/1988,male,Not captured,Not captured,Not captured,Not captured,Not captured,Not captured,Not captured,Not captured,Not captured,Not captured,Not captured,Not captured,Not captured,,,Not captured,Not captured,Not captured,Not captured,760 Harbor Cliff Way,,Oceanside,California,92054,,,Not captured,Not captured,andrewprakash88@gmail.com,Not captured,701823114,,Not captured,Not captured,Not captured,Not captured,Not captured,Not captured,
Not captured,Not captured,09/04/2018,Not captured,Not captured,863949,020,00072,ARS-01-0044131,Beacon International,Not captured,Not captured,Not captured,,,,Friera,Gustavo,D,04/01/1962,male,Not captured,Not captured,Not captured,Not captured,Not captured,Not captured,Not captured,Not captured,Not captured,Not captured,Not captured,Not captured,Not captured,,,Not captured,Not captured,Not captured,Not captured,8356 Lurline Ave,,Winnetka,California,91306,,,Not captured,Not captured,vincefriera@gmail.com,Not captured,701823105,,Not captured,Not captured,Not captured,Not captured,Not captured,Not captured,
Not captured,Not captured,09/04/2018,Not captured,Not captured,863949,020,00072,ARS-03-0043905,Essential America,Not captured,Not captured,Not captured,Passport(TB005367),,,Rahael,Anthony,Michael,07/23/2000,male,Not captured,Not captured,Not captured,Not captured,Not captured,Not captured,Not captured,Not captured,Not captured,Not captured,Not captured,Not captured,Not captured,,,Not captured,Not captured,Not captured,Not captured,74 Ascot Road,,Trinidad,,00000,18687775914,,Not captured,Not captured,anthony.rahael@rhllt.com,Not captured,701800135,,Not captured,Not captured,Not captured,Not captured,Not captured,Not captured,
Not captured,Not captured,09/03/2018,Not captured,Not captured,863949,020,00072,ARS-02-0044127,Beacon America,Not captured,Not captured,Not captured,Passport(J5572238),,,SHAH,KAILASBAHEN,,03/29/1966,female,Not captured,Not captured,Not captured,Not captured,Not captured,Not captured,Not captured,Not captured,Not captured,Not captured,Not captured,Not captured,Not captured,DARSHAN SHAH,Son,Not captured,Not captured,Not captured,Not captured,6875 peachtree dunwoody road,,sandy spring,Georgia,30328,7323477774,7323477774,Not captured,Not captured,d.s.shah2811@gmail.com,Not captured,701823090,,Not captured,Not captured,Not captured,Not captured,Not captured,Not captured,
Not captured,Not captured,09/04/2018,Not captured,Not captured,863949,020,00072,ARS-02-0044126,Beacon America,Not captured,Not captured,Not captured,Passport(AA9941823),,,Nighat,Mahmooda,,08/06/1925,female,Not captured,Not captured,Not captured,Not captured,Not captured,Not captured,Not captured,Not captured,Not captured,Not captured,Not captured,Not captured,Not captured,rashid khan,son,Not captured,Not captured,Not captured,Not captured,12 beach hill dr,,northport,newyork,11768,6316866408,,Not captured,Not captured,RASHIDKHAN@AOL.COM,Not captured,701823089,,Not captured,Not captured,Not captured,Not captured,Not captured,Not captured,
Not captured,Not captured,09/04/2018,Not captured,Not captured,863949,020,00072,ARS-01-0044125,Beacon International,Not captured,Not captured,Not captured,,,,Barrett,Bendi,O,09/05/1986,male,Not captured,Not captured,Not captured,Not captured,Not captured,Not captured,Not captured,Not captured,Not captured,Not captured,Not captured,Not captured,Not captured,,,Not captured,Not captured,Not captured,Not captured,1900 S Clark St,,Chicago,Illinois,60616,,,Not captured,Not captured,reisnerad@gmail.com,Not captured,701823088,,Not captured,Not captured,Not captured,Not captured,Not captured,Not captured,
Not captured,Not captured,09/04/2018,Not captured,Not captured,863949,020,00072,ARS-01-0044124,Beacon International,Not captured,Not captured,Not captured,,,,Reisner,Alexander,D,11/24/1986,male,Not captured,Not captured,Not captured,Not captured,Not captured,Not captured,Not captured,Not captured,Not captured,Not captured,Not captured,Not captured,Not captured,,,Not captured,Not captured,Not captured,Not captured,1900 S Clark St,,Chicago,Illinois,60616,,,Not captured,Not captured,reisnerad@gmail.com,Not captured,701823087,,Not captured,Not captured,Not captured,Not captured,Not captured,Not captured,
Not captured,Not captured,09/04/2018,Not captured,Not captured,863949,020,00072,ARS-02-0044122,Beacon America,Not captured,Not captured,Not captured,,,,LOZIER,THOMAS,G,10/10/1961,male,Not captured,Not captured,Not captured,Not captured,Not captured,Not captured,Not captured,Not captured,Not captured,Not captured,Not captured,Not captured,Not captured,,,Not captured,Not captured,Not captured,Not captured,106 WHITE OAK RD,,ELIZAVILLE,New York,12523-1215,,,Not captured,Not captured,npmtomcat@aol.com,Not captured,701823085,,Not captured,Not captured,Not captured,Not captured,Not captured,Not captured,
Not captured,Not captured,09/03/2018,Not captured,Not captured,863949,020,00072,ARS-01-0044120,Beacon International,Not captured,Not captured,Not captured,,,,Bixby,Elizabeth,A,11/05/1989,female,Not captured,Not captured,Not captured,Not captured,Not captured,Not captured,Not captured,Not captured,Not captured,Not captured,Not captured,Not captured,Not captured,,,Not captured,Not captured,Not captured,Not captured,1701 E. Cinnabar Ave.,,Phoenix,Arizona,85020,,,Not captured,Not captured,klsinaz@gmail.com,Not captured,701852487,,Not captured,Not captured,Not captured,Not captured,Not captured,Not captured,
Not captured,Not captured,09/03/2018,Not captured,Not captured,863949,020,00072,ARS-01-0044119,Beacon International,Not captured,Not captured,Not captured,,,,Stahl,Julie,,11/23/1965,female,Not captured,Not captured,Not captured,Not captured,Not captured,Not captured,Not captured,Not captured,Not captured,Not captured,Not captured,Not captured,Not captured,,,Not captured,Not captured,Not captured,Not captured,34 West 27th Street 8th Floor,,New York,New York,10001,,,Not captured,Not captured,julie@blondeandco.com,Not captured,701852486,,Not captured,Not captured,Not captured,Not captured,Not captured,Not captured,
Not captured,Not captured,09/03/2018,Not captured,Not captured,863949,020,00072,ARS-01-0044115,Beacon International,Not captured,Not captured,Not captured,,,,Wilner,Avrohom,,02/28/1995,male,Not captured,Not captured,Not captured,Not captured,Not captured,Not captured,Not captured,Not captured,Not captured,Not captured,Not captured,Not captured,Not captured,,,Not captured,Not captured,Not captured,Not captured,1235 45,,Brooklyn,,11219,,,Not captured,Not captured,Avrumy1155@gmail.Com,Not captured,701852482,,Not captured,Not captured,Not captured,Not captured,Not captured,Not captured,
Not captured,Not captured,09/04/2018,Not captured,Not captured,863949,020,00072,OVI-28-0044114,OverseasCare Visitors Insurance Plan,Not captured,Not captured,Not captured,Passport(315037536),,,Hsieh,Wan Chin,,07/22/1985,female,Not captured,Not captured,Not captured,Not captured,Not captured,Not captured,Not captured,Not captured,Not captured,Not captured,Not captured,Not captured,Not captured,Wen Long Hsieh,Father,Not captured,Not captured,Not captured,Not captured,karlovo namesti 319/3,,Prague,Prague (Praha hlavni mesto),12000,+420608609443,,Not captured,Not captured,jhp1314@hotmail.com,Not captured,701852481,,Not captured,Not captured,Not captured,Not captured,Not captured,Not captured,
Not captured,Not captured,09/04/2018,Not captured,Not captured,863949,020,00072,ARS-01-0044112,Beacon International,Not captured,Not captured,Not captured,Passport(562218567),,,Priddy,Lulu,K,10/23/1998,female,Not captured,Not captured,Not captured,Not captured,Not captured,Not captured,Not captured,Not captured,Not captured,Not captured,Not captured,Not captured,Not captured,Katherine Richmond,mother,Not captured,Not captured,Not captured,Not captured,17 White Street,,New York,New York,10013,9176868056,,Not captured,Not captured,lupriddy@gmail.com,Not captured,701852479,,Not captured,Not captured,Not captured,Not captured,Not captured,Not captured,
Not captured,Not captured,09/03/2018,Not captured,Not captured,863949,020,00072,ARS-01-0044110,Beacon International,Not captured,Not captured,Not captured,,,,Sams,Melissa,L,07/28/1973,female,Not captured,Not captured,Not captured,Not captured,Not captured,Not captured,Not captured,Not captured,Not captured,Not captured,Not captured,Not captured,Not captured,,,Not captured,Not captured,Not captured,Not captured,711 E 28th Ave,,Spokane,Washington,99203,,,Not captured,Not captured,cljorge7@gmail.com,Not captured,701852477,,Not captured,Not captured,Not captured,Not captured,Not captured,Not captured,
Not captured,Not captured,09/03/2018,Not captured,Not captured,863949,020,00072,ARS-02-0044108,Beacon America,Not captured,Not captured,Not captured,,,,Dockstader,Hayleigh,E,11/08/1994,female,Not captured,Not captured,Not captured,Not captured,Not captured,Not captured,Not captured,Not captured,Not captured,Not captured,Not captured,Not captured,Not captured,Joseph Dockstader,Husband,Not captured,Not captured,Not captured,Not captured,451 Ralston Avenue,,Mill Valley,California,94941,4152720333,,Not captured,Not captured,leigh.moore1994@gmail.com,Not captured,701852475,,Not captured,Not captured,Not captured,Not captured,Not captured,Not captured,
Not captured,Not captured,09/03/2018,Not captured,Not captured,863949,020,00072,OVI-28-0044107,OverseasCare Visitors Insurance Plan,Not captured,Not captured,Not captured,,,,NELLUTLA,PADMAVATHI,,01/06/1951,female,Not captured,Not captured,Not captured,Not captured,Not captured,Not captured,Not captured,Not captured,Not captured,Not captured,Not captured,Not captured,Not captured,,,Not captured,Not captured,Not captured,Not captured,904 PATRIOT LANE,,NORRISTOWN,Pennsylvania,19403,6106350633,,Not captured,Not captured,kamalnellutla@gmail.com,Not captured,701852474,,Not captured,Not captured,Not captured,Not captured,Not captured,Not captured,
Not captured,Not captured,09/03/2018,Not captured,Not captured,863949,020,00072,OVI-28-0044106,OverseasCare Visitors Insurance Plan,Not captured,Not captured,Not captured,,,,NELLUTLA,VENKATADRI,,03/25/1945,male,Not captured,Not captured,Not captured,Not captured,Not captured,Not captured,Not captured,Not captured,Not captured,Not captured,Not captured,Not captured,Not captured,,,Not captured,Not captured,Not captured,Not captured,904 PATRIOT LANE,,NORRISTOWN,Pennsylvania,19403,6106350633,,Not captured,Not captured,kamalnellutla@gmail.com,Not captured,701852473,,Not captured,Not captured,Not captured,Not captured,Not captured,Not captured,
Not captured,Not captured,09/04/2018,Not captured,Not captured,863949,020,00072,ARS-01-0044105,Beacon International,Not captured,Not captured,Not captured,,,,rubinstein,benjamin,M,07/07/1979,male,Not captured,Not captured,Not captured,Not captured,Not captured,Not captured,Not captured,Not captured,Not captured,Not captured,Not captured,Not captured,Not captured,,,Not captured,Not captured,Not captured,Not captured,1130-54 st,,brooklyn,New York,11219,7188514526,,Not captured,Not captured,7828717@gmail.com,Not captured,701852472,,Not captured,Not captured,Not captured,Not captured,Not captured,Not captured,
Not captured,Not captured,09/03/2018,Not captured,Not captured,863949,020,00072,ARS-01-0044104,Beacon International,Not captured,Not captured,Not captured,,,,Emerich,John,W,03/22/1955,male,Not captured,Not captured,Not captured,Not captured,Not captured,Not captured,Not captured,Not captured,Not captured,Not captured,Not captured,Not captured,Not captured,,,Not captured,Not captured,Not captured,Not captured,645 W. 207 St. 4a,,New York,New York,10034,,,Not captured,Not captured,bhla3212@gmail.com,Not captured,701852471,,Not captured,Not captured,Not captured,Not captured,Not captured,Not captured,
Not captured,Not captured,09/03/2018,Not captured,Not captured,863949,020,00072,OVI-28-0044103,OverseasCare Visitors Insurance Plan,Not captured,Not captured,Not captured,Passport(J4743331),,,Sarathchandran,Amminkutty,,11/15/1954,female,Not captured,Not captured,Not captured,Not captured,Not captured,Not captured,Not captured,Not captured,Not captured,Not captured,Not captured,Not captured,Not captured,mahesh chennamkumarath,son in law,Not captured,Not captured,Not captured,Not captured,10212 PAXTON RUN ROAD,,CHARLOTTE,North Carolina,28277,2814686984,,Not captured,Not captured,mahesh_c1975@yahoo.com,Not captured,701852470,,Not captured,Not captured,Not captured,Not captured,Not captured,Not captured,
Not captured,Not captured,09/03/2018,Not captured,Not captured,863949,020,00072,OVI-28-0044102,OverseasCare Visitors Insurance Plan,Not captured,Not captured,Not captured,Passport(J4743331),,,Kadanthayil,Sarathchandran,,11/04/1950,male,Not captured,Not captured,Not captured,Not captured,Not captured,Not captured,Not captured,Not captured,Not captured,Not captured,Not captured,Not captured,Not captured,mahesh chennamkumarath,son in law,Not captured,Not captured,Not captured,Not captured,10212 PAXTON RUN ROAD,,CHARLOTTE,North Carolina,28277,2814686984,,Not captured,Not captured,mahesh_c1975@yahoo.com,Not captured,701852469,,Not captured,Not captured,Not captured,Not captured,Not captured,Not captured,
Not captured,Not captured,09/03/2018,Not captured,Not captured,863949,020,00072,ARS-01-0044100,Beacon International,Not captured,Not captured,Not captured,,,,Pronk,Nicole,,01/02/1982,female,Not captured,Not captured,Not captured,Not captured,Not captured,Not captured,Not captured,Not captured,Not captured,Not captured,Not captured,Not captured,Not captured,,,Not captured,Not captured,Not captured,Not captured,13045 Pacific Promenade,,Los Angeles,California,90094,,,Not captured,Not captured,jonathan.ricciardi@gmail.com,Not captured,701852467,,Not captured,Not captured,Not captured,Not captured,Not captured,Not captured,
Not captured,Not captured,09/03/2018,Not captured,Not captured,863949,020,00072,ARS-01-0044099,Beacon International,Not captured,Not captured,Not captured,,,,Ricciardi,Jonathan,,04/21/1986,male,Not captured,Not captured,Not captured,Not captured,Not captured,Not captured,Not captured,Not captured,Not captured,Not captured,Not captured,Not captured,Not captured,,,Not captured,Not captured,Not captured,Not captured,13045 Pacific Promenade,,Los Angeles,California,90094,,,Not captured,Not captured,jonathan.ricciardi@gmail.com,Not captured,701852466,,Not captured,Not captured,Not captured,Not captured,Not captured,Not captured,
Not captured,Not captured,09/02/2018,Not captured,Not captured,863949,020,00072,ARS-02-0044098,Beacon America,Not captured,Not captured,Not captured,Passport(055943668),,,LOPEZ TARABAY,ALFONSO,,03/31/1965,male,Not captured,Not captured,Not captured,Not captured,Not captured,Not captured,Not captured,Not captured,Not captured,Not captured,Not captured,Not captured,Not captured,CRISER ALEJANDRA BAUTISTA,SPOUSE,Not captured,Not captured,Not captured,Not captured,AV PRINCIPAL DE PUEBLO NUEVO URB DONA EMILIA SECTOR BUENOS AIRES CASA 2,,SAN CRISTOBAL,Tachira,5001,4126490161,,Not captured,Not captured,alopez@cboxgroup.com,Not captured,701852464,,Not captured,Not captured,Not captured,Not captured,Not captured,Not captured,
Not captured,Not captured,09/02/2018,Not captured,Not captured,863949,020,00072,ARS-01-0044093,Beacon International,Not captured,Not captured,Not captured,,,,Selim,Christopher,A,05/02/1990,male,Not captured,Not captured,Not captured,Not captured,Not captured,Not captured,Not captured,Not captured,Not captured,Not captured,Not captured,Not captured,Not captured,,,Not captured,Not captured,Not captured,Not captured,Christopher Selim,,Sunnyvale,California,94087,,,Not captured,Not captured,cantonyselim@gmail.com,Not captured,701852453,,Not captured,Not captured,Not captured,Not captured,Not captured,Not captured,
Not captured,Not captured,09/02/2018,Not captured,Not captured,863949,020,00072,ARS-01-0044092,Beacon International,Not captured,Not captured,Not captured,,,,Selim,Cassandra,,03/16/1994,female,Not captured,Not captured,Not captured,Not captured,Not captured,Not captured,Not captured,Not captured,Not captured,Not captured,Not captured,Not captured,Not captured,,,Not captured,Not captured,Not captured,Not captured,Christopher Selim,,Sunnyvale,California,94087,,,Not captured,Not captured,cantonyselim@gmail.com,Not captured,701852452,,Not captured,Not captured,Not captured,Not captured,Not captured,Not captured,
Not captured,Not captured,09/02/2018,Not captured,Not captured,863949,020,00072,ARS-01-0044091,Beacon International,Not captured,Not captured,Not captured,,,,Dabbas,Marcelle,,09/10/1959,female,Not captured,Not captured,Not captured,Not captured,Not captured,Not captured,Not captured,Not captured,Not captured,Not captured,Not captured,Not captured,Not captured,,,Not captured,Not captured,Not captured,Not captured,Christopher Selim,,Sunnyvale,California,94087,,,Not captured,Not captured,cantonyselim@gmail.com,Not captured,701852451,,Not captured,Not captured,Not captured,Not captured,Not captured,Not captured,
Not captured,Not captured,09/02/2018,Not captured,Not captured,863949,020,00072,ARS-01-0044090,Beacon International,Not captured,Not captured,Not captured,,,,Selim,Hany,,06/09/1956,male,Not captured,Not captured,Not captured,Not captured,Not captured,Not captured,Not captured,Not captured,Not captured,Not captured,Not captured,Not captured,Not captured,,,Not captured,Not captured,Not captured,Not captured,Christopher Selim,,Sunnyvale,California,94087,,,Not captured,Not captured,cantonyselim@gmail.com,Not captured,701852450,,Not captured,Not captured,Not captured,Not captured,Not captured,Not captured,
Not captured,Not captured,09/02/2018,Not captured,Not captured,863949,020,00072,ARS-01-0044089,Beacon International,Not captured,Not captured,Not captured,,,,Clark,Nicole,,12/27/1978,female,Not captured,Not captured,Not captured,Not captured,Not captured,Not captured,Not captured,Not captured,Not captured,Not captured,Not captured,Not captured,Not captured,,,Not captured,Not captured,Not captured,Not captured,1747 Germaine ct,,Hayward,California,94541,,,Not captured,Not captured,nclark78@live.com,Not captured,701852449,,Not captured,Not captured,Not captured,Not captured,Not captured,Not captured,
Not captured,Not captured,09/04/2018,Not captured,Not captured,863949,020,00072,ARS-01-0044088,Beacon International,Not captured,Not captured,Not captured,,,,McKinney,Dorothy,,04/30/1952,female,Not captured,Not captured,Not captured,Not captured,Not captured,Not captured,Not captured,Not captured,Not captured,Not captured,Not captured,Not captured,Not captured,Darius Contractor,Son,Not captured,Not captured,Not captured,Not captured,527 Via Garofano Avenue,,Henderson,,89011,4086666791,,Not captured,Not captured,shazad@shazadc.com,Not captured,701852448,,Not captured,Not captured,Not captured,Not captured,Not captured,Not captured,
Not captured,Not captured,09/04/2018,Not captured,Not captured,863949,020,00072,ARS-01-0044087,Beacon International,Not captured,Not captured,Not captured,Passport(513172550),,,Contractor,Shazad,E,08/12/1950,male,Not captured,Not captured,Not captured,Not captured,Not captured,Not captured,Not captured,Not captured,Not captured,Not captured,Not captured,Not captured,Not captured,Darius Contractor,Son,Not captured,Not captured,Not captured,Not captured,527 Via Garofano Avenue,,Henderson,,89011,4086666791,,Not captured,Not captured,shazad@shazadc.com,Not captured,701852447,,Not captured,Not captured,Not captured,Not captured,Not captured,Not captured,
Not captured,Not captured,09/02/2018,Not captured,Not captured,863949,020,00072,ARS-01-0044084,Beacon International,Not captured,Not captured,Not captured,,,,Radlein,Selina,A,09/12/1985,female,Not captured,Not captured,Not captured,Not captured,Not captured,Not captured,Not captured,Not captured,Not captured,Not captured,Not captured,Not captured,Not captured,,,Not captured,Not captured,Not captured,Not captured,425 east 82nd st,,New York,New York,10028,,,Not captured,Not captured,sradlein@gmail.com,Not captured,701852444,,Not captured,Not captured,Not captured,Not captured,Not captured,Not captured,
Not captured,Not captured,09/02/2018,Not captured,Not captured,863949,020,00072,ARS-01-0044083,Beacon International,Not captured,Not captured,Not captured,,,,Woodard,Shawndra,,09/05/1978,female,Not captured,Not captured,Not captured,Not captured,Not captured,Not captured,Not captured,Not captured,Not captured,Not captured,Not captured,Not captured,Not captured,,,Not captured,Not captured,Not captured,Not captured,7800 SW 136th,,Miami,Florida,33156,,,Not captured,Not captured,hoffler.woodard@gmail.com,Not captured,701852443,,Not captured,Not captured,Not captured,Not captured,Not captured,Not captured,
Not captured,Not captured,09/02/2018,Not captured,Not captured,863949,020,00072,ARS-01-0044082,Beacon International,Not captured,Not captured,Not captured,,,,Hoffler,Charles,,11/18/1972,male,Not captured,Not captured,Not captured,Not captured,Not captured,Not captured,Not captured,Not captured,Not captured,Not captured,Not captured,Not captured,Not captured,,,Not captured,Not captured,Not captured,Not captured,7800 SW 136th,,Miami,Florida,33156,,,Not captured,Not captured,hoffler.woodard@gmail.com,Not captured,701852442,,Not captured,Not captured,Not captured,Not captured,Not captured,Not captured,