EE Transaction Type,Dependent Transaction Type,Effective Date,EE Signature,EE Signature Date,Control,Suffix,Account,Plan Number,Plan Name,Claim Office,Network ID Number,Customer Code,EE SSN,Dependent SSN,Dependent Relationship,Last Name,First Name,Middle Initial,DOB,Gender,Ethnicity,PCP/PCD,PCP/PCD Current Patient,Provider Cap Office Number,COB,Dep Student Indicator,Dep OOA Indicator,EE Prior Coverage Indicator,EE Late Entrant,EE Language Indicator,Hire Date,Earnings,Earnings Frequency,Beneficiary (Last Name First Name MI),Beneficiary Relationship,Continuation of Coverage Expiration Date,Continuation of Coverage Event Date,Continuation of Coverage Length of Coverage,Work Location Zip Code,Street Address Line 1,Street Address Line 2,City,State,Zip Code,Home Phone Number,Work Phone Number,Accept Code,Evidence Code,EE Email Address,Communication Disability Code,EE Alternate ID,Dep Alternate ID,Old Control,Old Suffix,Old Account,New Control,New Suffix,New Account,
Not captured,Not captured,08/29/2018,Not captured,Not captured,863949,020,00072,ARS-01-0043967,Beacon International,Not captured,Not captured,Not captured,,,,Schaefer,Marc,,07/29/1973,male,Not captured,Not captured,Not captured,Not captured,Not captured,Not captured,Not captured,Not captured,Not captured,Not captured,Not captured,Not captured,Not captured,,,Not captured,Not captured,Not captured,Not captured,1615 8th ST NW,,Washington,Dist. of Columbia,20001,,,Not captured,Not captured,whitney@mangosafari.com,Not captured,701800243,,Not captured,Not captured,Not captured,Not captured,Not captured,Not captured,
Not captured,Not captured,08/29/2018,Not captured,Not captured,863949,020,00072,ARS-01-0043966,Beacon International,Not captured,Not captured,Not captured,,,,Schaefer,Gina,,10/19/1970,female,Not captured,Not captured,Not captured,Not captured,Not captured,Not captured,Not captured,Not captured,Not captured,Not captured,Not captured,Not captured,Not captured,,,Not captured,Not captured,Not captured,Not captured,1615 8th ST NW,,Washington,Dist. of Columbia,20001,,,Not captured,Not captured,whitney@mangosafari.com,Not captured,701800242,,Not captured,Not captured,Not captured,Not captured,Not captured,Not captured,
Not captured,Not captured,08/29/2018,Not captured,Not captured,863949,020,00072,ARS-01-0043965,Beacon International,Not captured,Not captured,Not captured,,,,Fintoni,Mary,,10/27/1974,female,Not captured,Not captured,Not captured,Not captured,Not captured,Not captured,Not captured,Not captured,Not captured,Not captured,Not captured,Not captured,Not captured,,,Not captured,Not captured,Not captured,Not captured,4470 W Sunset Blvd #90391,,Los Angeles,California,90027,,,Not captured,Not captured,shani.fintoni@icloud.com,Not captured,701800241,,Not captured,Not captured,Not captured,Not captured,Not captured,Not captured,
Not captured,Not captured,08/29/2018,Not captured,Not captured,863949,020,00072,ARS-01-0043964,Beacon International,Not captured,Not captured,Not captured,,,,gonin,jean,p,03/04/1971,male,Not captured,Not captured,Not captured,Not captured,Not captured,Not captured,Not captured,Not captured,Not captured,Not captured,Not captured,Not captured,Not captured,,,Not captured,Not captured,Not captured,Not captured,3003 massasoit avenue,,san diego,California,92117,,,Not captured,Not captured,jean.gonin@gmail.com,Not captured,701800240,,Not captured,Not captured,Not captured,Not captured,Not captured,Not captured,
Not captured,Not captured,08/29/2018,Not captured,Not captured,863949,020,00072,ARS-38-0043963,Beacon Student Choice,Not captured,Not captured,Not captured,Passport(China23488),,,Li,Zeyuan,,10/12/2002,male,Not captured,Not captured,Not captured,Not captured,Not captured,Not captured,Not captured,Not captured,Not captured,Not captured,Not captured,Not captured,Not captured,Wugian Zhao,mother,Not captured,Not captured,Not captured,Not captured,2826 N Elm lane,,Arlington Heights,Illinois,60004,8476304188,,Not captured,Not captured,family@jonkhans.net,Not captured,701800239,,Not captured,Not captured,Not captured,Not captured,Not captured,Not captured,
Not captured,Not captured,08/29/2018,Not captured,Not captured,863949,020,00072,ARS-01-0043960,Beacon International,Not captured,Not captured,Not captured,,,,Taubenfeld,Yosef  ,,10/09/1998,male,Not captured,Not captured,Not captured,Not captured,Not captured,Not captured,Not captured,Not captured,Not captured,Not captured,Not captured,Not captured,Not captured,,,Not captured,Not captured,Not captured,Not captured,18 Witzel Ct NY 10952,,Monsey,New York,10952,(845) 558-1615,,Not captured,Not captured,Sbt0212@gmail.com,Not captured,701800236,,Not captured,Not captured,Not captured,Not captured,Not captured,Not captured,
Not captured,Not captured,08/29/2018,Not captured,Not captured,863949,020,00072,ARS-01-0043956,Beacon International,Not captured,Not captured,Not captured,,,,capoor,preeti,,11/26/1966,female,Not captured,Not captured,Not captured,Not captured,Not captured,Not captured,Not captured,Not captured,Not captured,Not captured,Not captured,Not captured,Not captured,,,Not captured,Not captured,Not captured,Not captured,938 blyleven blvd,,mississauga,Ontario,l5v2g5,4168065145,,Not captured,Not captured,rogermasrani@gmail.com,Not captured,701800230,,Not captured,Not captured,Not captured,Not captured,Not captured,Not captured,
Not captured,Not captured,08/29/2018,Not captured,Not captured,863949,020,00072,ARS-01-0043955,Beacon International,Not captured,Not captured,Not captured,Passport(hk865405),,,masrani,ragesh,,05/20/1959,male,Not captured,Not captured,Not captured,Not captured,Not captured,Not captured,Not captured,Not captured,Not captured,Not captured,Not captured,Not captured,Not captured,,,Not captured,Not captured,Not captured,Not captured,938 blyleven blvd,,mississauga,Ontario,l5v2g5,4168065145,,Not captured,Not captured,rogermasrani@gmail.com,Not captured,701800229,,Not captured,Not captured,Not captured,Not captured,Not captured,Not captured,
Not captured,Not captured,08/29/2018,Not captured,Not captured,863949,020,00072,ARS-01-0043954,Beacon International,Not captured,Not captured,Not captured,,,,DUNCAN,SCOTT,,01/22/1980,male,Not captured,Not captured,Not captured,Not captured,Not captured,Not captured,Not captured,Not captured,Not captured,Not captured,Not captured,Not captured,Not captured,,,Not captured,Not captured,Not captured,Not captured,2/61 Wharf Street,,CHELMER,,4068,,,Not captured,Not captured,scottduncan@fastmail.com,Not captured,701800228,,Not captured,Not captured,Not captured,Not captured,Not captured,Not captured,
Not captured,Not captured,08/29/2018,Not captured,Not captured,863949,020,00072,ARS-01-0043953,Beacon International,Not captured,Not captured,Not captured,,,,Ramayanam,Sai,K,02/14/1992,female,Not captured,Not captured,Not captured,Not captured,Not captured,Not captured,Not captured,Not captured,Not captured,Not captured,Not captured,Not captured,Not captured,,,Not captured,Not captured,Not captured,Not captured,1/1508 heatherton Road Dandenong Victoria,,Melbourne,,3175,,,Not captured,Not captured,kiki.ramayanam@gmail.com,Not captured,701800227,,Not captured,Not captured,Not captured,Not captured,Not captured,Not captured,
Not captured,Not captured,08/29/2018,Not captured,Not captured,863949,020,00072,ARS-01-0043952,Beacon International,Not captured,Not captured,Not captured,,,,Eisnaugle,Robert,M,03/13/1991,male,Not captured,Not captured,Not captured,Not captured,Not captured,Not captured,Not captured,Not captured,Not captured,Not captured,Not captured,Not captured,Not captured,,,Not captured,Not captured,Not captured,Not captured,46891 Eaton ter,,Sterling,Virginia,20164,,,Not captured,Not captured,rme6969@gmail.com,Not captured,701800226,,Not captured,Not captured,Not captured,Not captured,Not captured,Not captured,
Not captured,Not captured,08/29/2018,Not captured,Not captured,863949,020,00072,ARS-01-0043951,Beacon International,Not captured,Not captured,Not captured,,,,Boulton,Ashley,M,12/08/1986,female,Not captured,Not captured,Not captured,Not captured,Not captured,Not captured,Not captured,Not captured,Not captured,Not captured,Not captured,Not captured,Not captured,,,Not captured,Not captured,Not captured,Not captured,1940 5th Ave,,Sacramento,California,95818,,,Not captured,Not captured,cameronboulton@gmail.com,Not captured,701800225,,Not captured,Not captured,Not captured,Not captured,Not captured,Not captured,
Not captured,Not captured,08/29/2018,Not captured,Not captured,863949,020,00072,ARS-01-0043950,Beacon International,Not captured,Not captured,Not captured,,,,Boulton,Cameron,M,05/27/1987,male,Not captured,Not captured,Not captured,Not captured,Not captured,Not captured,Not captured,Not captured,Not captured,Not captured,Not captured,Not captured,Not captured,,,Not captured,Not captured,Not captured,Not captured,1940 5th Ave,,Sacramento,California,95818,,,Not captured,Not captured,cameronboulton@gmail.com,Not captured,701800224,,Not captured,Not captured,Not captured,Not captured,Not captured,Not captured,
Not captured,Not captured,08/29/2018,Not captured,Not captured,863949,020,00072,ARS-01-0043948,Beacon International,Not captured,Not captured,Not captured,,,,Baron,Rachael,,06/08/1982,female,Not captured,Not captured,Not captured,Not captured,Not captured,Not captured,Not captured,Not captured,Not captured,Not captured,Not captured,Not captured,Not captured,,,Not captured,Not captured,Not captured,Not captured,1400 W Morning Vista Dr,,Lehi,Utah,84043,,,Not captured,Not captured,grantisfat@gmail.com,Not captured,701800222,,Not captured,Not captured,Not captured,Not captured,Not captured,Not captured,
Not captured,Not captured,08/29/2018,Not captured,Not captured,863949,020,00072,ARS-01-0043947,Beacon International,Not captured,Not captured,Not captured,,,,Baron,Grant,,11/24/1982,male,Not captured,Not captured,Not captured,Not captured,Not captured,Not captured,Not captured,Not captured,Not captured,Not captured,Not captured,Not captured,Not captured,,,Not captured,Not captured,Not captured,Not captured,1400 W Morning Vista Dr,,Lehi,Utah,84043,,,Not captured,Not captured,grantisfat@gmail.com,Not captured,701800221,,Not captured,Not captured,Not captured,Not captured,Not captured,Not captured,
Not captured,Not captured,08/28/2018,Not captured,Not captured,863949,020,00072,ARS-02-0043946,Beacon America,Not captured,Not captured,Not captured,,,,Wang,Qin,,05/02/1961,female,Not captured,Not captured,Not captured,Not captured,Not captured,Not captured,Not captured,Not captured,Not captured,Not captured,Not captured,Not captured,Not captured,,,Not captured,Not captured,Not captured,Not captured,2517 Sedlak Ct,,San Jose,,95148,,,Not captured,Not captured,gpitner@stanford.edu,Not captured,701800220,,Not captured,Not captured,Not captured,Not captured,Not captured,Not captured,
Not captured,Not captured,08/28/2018,Not captured,Not captured,863949,020,00072,ARS-01-0043944,Beacon International,Not captured,Not captured,Not captured,,,,Olea,Michael,C,03/23/1974,male,Not captured,Not captured,Not captured,Not captured,Not captured,Not captured,Not captured,Not captured,Not captured,Not captured,Not captured,Not captured,Not captured,,,Not captured,Not captured,Not captured,Not captured,3910 W 238th St unit 26,,Torrance,California,90505,,,Not captured,Not captured,nataliyaolea@gmail.com,Not captured,701800218,,Not captured,Not captured,Not captured,Not captured,Not captured,Not captured,
Not captured,Not captured,08/28/2018,Not captured,Not captured,863949,020,00072,ARS-01-0043943,Beacon International,Not captured,Not captured,Not captured,,,,Deering,Christopher,,10/29/1985,male,Not captured,Not captured,Not captured,Not captured,Not captured,Not captured,Not captured,Not captured,Not captured,Not captured,Not captured,Not captured,Not captured,,,Not captured,Not captured,Not captured,Not captured,4204 w Cullom ave,,Chicago,Illinois,60641,,,Not captured,Not captured,cdeering704@gmail.com,Not captured,701800217,,Not captured,Not captured,Not captured,Not captured,Not captured,Not captured,
Not captured,Not captured,08/28/2018,Not captured,Not captured,863949,020,00072,ARS-01-0043940,Beacon International,Not captured,Not captured,Not captured,,,,Ziperski,Mariel,,08/19/1995,female,Not captured,Not captured,Not captured,Not captured,Not captured,Not captured,Not captured,Not captured,Not captured,Not captured,Not captured,Not captured,Not captured,,,Not captured,Not captured,Not captured,Not captured,1004 Swithland Ct.,,Raleigh,North Carolina,27614,,,Not captured,Not captured,lisalampert00@gmail.com,Not captured,701800201,,Not captured,Not captured,Not captured,Not captured,Not captured,Not captured,
Not captured,Not captured,08/28/2018,Not captured,Not captured,863949,020,00072,ARS-01-0043939,Beacon International,Not captured,Not captured,Not captured,,,,Ziperski,David,,09/11/1960,male,Not captured,Not captured,Not captured,Not captured,Not captured,Not captured,Not captured,Not captured,Not captured,Not captured,Not captured,Not captured,Not captured,,,Not captured,Not captured,Not captured,Not captured,1004 Swithland Ct.,,Raleigh,North Carolina,27614,,,Not captured,Not captured,lisalampert00@gmail.com,Not captured,701800200,,Not captured,Not captured,Not captured,Not captured,Not captured,Not captured,
Not captured,Not captured,08/28/2018,Not captured,Not captured,863949,020,00072,ARS-01-0043938,Beacon International,Not captured,Not captured,Not captured,,,,Lampert,Lisa,,12/31/1957,female,Not captured,Not captured,Not captured,Not captured,Not captured,Not captured,Not captured,Not captured,Not captured,Not captured,Not captured,Not captured,Not captured,,,Not captured,Not captured,Not captured,Not captured,1004 Swithland Ct.,,Raleigh,North Carolina,27614,,,Not captured,Not captured,lisalampert00@gmail.com,Not captured,701800199,,Not captured,Not captured,Not captured,Not captured,Not captured,Not captured,
Not captured,Not captured,08/29/2018,Not captured,Not captured,863949,020,00072,ARS-02-0043937,Beacon America,Not captured,Not captured,Not captured,,,,Yu,Kate,,09/04/2011,female,Not captured,Not captured,Not captured,Not captured,Not captured,Not captured,Not captured,Not captured,Not captured,Not captured,Not captured,Not captured,Not captured,Bo Yu,Husband,Not captured,Not captured,Not captured,Not captured,145 Trek Lane,,Redding,California,96003,530-262-7191,,Not captured,Not captured,jcfollower716@gmail.com,Not captured,701800198,,Not captured,Not captured,Not captured,Not captured,Not captured,Not captured,
Not captured,Not captured,08/29/2018,Not captured,Not captured,863949,020,00072,ARS-02-0043936,Beacon America,Not captured,Not captured,Not captured,,,,Yu,Jingyuan,,03/31/2008,male,Not captured,Not captured,Not captured,Not captured,Not captured,Not captured,Not captured,Not captured,Not captured,Not captured,Not captured,Not captured,Not captured,Bo Yu,Husband,Not captured,Not captured,Not captured,Not captured,145 Trek Lane,,Redding,California,96003,530-262-7191,,Not captured,Not captured,jcfollower716@gmail.com,Not captured,701800197,,Not captured,Not captured,Not captured,Not captured,Not captured,Not captured,
Not captured,Not captured,08/29/2018,Not captured,Not captured,863949,020,00072,ARS-02-0043935,Beacon America,Not captured,Not captured,Not captured,,,,Yu,Jerry,,03/28/2006,male,Not captured,Not captured,Not captured,Not captured,Not captured,Not captured,Not captured,Not captured,Not captured,Not captured,Not captured,Not captured,Not captured,Bo Yu,Husband,Not captured,Not captured,Not captured,Not captured,145 Trek Lane,,Redding,California,96003,530-262-7191,,Not captured,Not captured,jcfollower716@gmail.com,Not captured,701800196,,Not captured,Not captured,Not captured,Not captured,Not captured,Not captured,
Not captured,Not captured,08/29/2018,Not captured,Not captured,863949,020,00072,ARS-02-0043934,Beacon America,Not captured,Not captured,Not captured,,,,Yu,Bo,,12/03/1979,male,Not captured,Not captured,Not captured,Not captured,Not captured,Not captured,Not captured,Not captured,Not captured,Not captured,Not captured,Not captured,Not captured,Bo Yu,Husband,Not captured,Not captured,Not captured,Not captured,145 Trek Lane,,Redding,California,96003,530-262-7191,,Not captured,Not captured,jcfollower716@gmail.com,Not captured,701800195,,Not captured,Not captured,Not captured,Not captured,Not captured,Not captured,
Not captured,Not captured,08/29/2018,Not captured,Not captured,863949,020,00072,ARS-02-0043933,Beacon America,Not captured,Not captured,Not captured,,,,Wu,Bin,,04/18/1980,female,Not captured,Not captured,Not captured,Not captured,Not captured,Not captured,Not captured,Not captured,Not captured,Not captured,Not captured,Not captured,Not captured,Bo Yu,Husband,Not captured,Not captured,Not captured,Not captured,145 Trek Lane,,Redding,California,96003,530-262-7191,,Not captured,Not captured,jcfollower716@gmail.com,Not captured,701800194,,Not captured,Not captured,Not captured,Not captured,Not captured,Not captured,
Not captured,Not captured,08/29/2018,Not captured,Not captured,863949,020,00072,ARS-01-0043927,Beacon International,Not captured,Not captured,Not captured,Passport(070425194),,,CASANOVA de PARADA,ILSE,,11/04/1958,female,Not captured,Not captured,Not captured,Not captured,Not captured,Not captured,Not captured,Not captured,Not captured,Not captured,Not captured,Not captured,Not captured,,,Not captured,Not captured,Not captured,Not captured,REsidencia Parque Caurimare Apto 8-1A,,Caracas,Miranda,1061,+582129860575,+584142071751,Not captured,Not captured,Ilsedeparada@gmail.com,Not captured,701800188,,Not captured,Not captured,Not captured,Not captured,Not captured,Not captured,
Not captured,Not captured,08/28/2018,Not captured,Not captured,863949,020,00072,ARS-01-0043917,Beacon International,Not captured,Not captured,Not captured,,,,werner,jennifer,L,01/12/1960,female,Not captured,Not captured,Not captured,Not captured,Not captured,Not captured,Not captured,Not captured,Not captured,Not captured,Not captured,Not captured,Not captured,,,Not captured,Not captured,Not captured,Not captured,Po box 101209,,Fort Worth,Texas,76185,,,Not captured,Not captured,mobilemejen@me.com,Not captured,701800149,,Not captured,Not captured,Not captured,Not captured,Not captured,Not captured,
Not captured,Not captured,08/28/2018,Not captured,Not captured,863949,020,00072,ARS-01-0043916,Beacon International,Not captured,Not captured,Not captured,,,,Nolen,Travis,J,07/31/1976,male,Not captured,Not captured,Not captured,Not captured,Not captured,Not captured,Not captured,Not captured,Not captured,Not captured,Not captured,Not captured,Not captured,,,Not captured,Not captured,Not captured,Not captured,4209 Bay Club Cir,,Tampa,Florida,33607,,,Not captured,Not captured,noletrav@yahoo.com,Not captured,701800148,,Not captured,Not captured,Not captured,Not captured,Not captured,Not captured,
Not captured,Not captured,08/28/2018,Not captured,Not captured,863949,020,00072,ARS-01-0043910,Beacon International,Not captured,Not captured,Not captured,,,,Rai,Vaishali,,03/23/1988,female,Not captured,Not captured,Not captured,Not captured,Not captured,Not captured,Not captured,Not captured,Not captured,Not captured,Not captured,Not captured,Not captured,,,Not captured,Not captured,Not captured,Not captured,13330 Rowles Pl,,Herndon,Virginia,20170,,,Not captured,Not captured,rajath.chouta@gmail.com,Not captured,701800142,,Not captured,Not captured,Not captured,Not captured,Not captured,Not captured,
Not captured,Not captured,08/28/2018,Not captured,Not captured,863949,020,00072,ARS-01-0043909,Beacon International,Not captured,Not captured,Not captured,,,,Chouta,Rajath,S,12/09/1986,male,Not captured,Not captured,Not captured,Not captured,Not captured,Not captured,Not captured,Not captured,Not captured,Not captured,Not captured,Not captured,Not captured,,,Not captured,Not captured,Not captured,Not captured,13330 Rowles Pl,,Herndon,Virginia,20170,,,Not captured,Not captured,rajath.chouta@gmail.com,Not captured,701800141,,Not captured,Not captured,Not captured,Not captured,Not captured,Not captured,
Not captured,Not captured,08/28/2018,Not captured,Not captured,863949,020,00072,ARS-01-0043908,Beacon International,Not captured,Not captured,Not captured,,,,Esquerra,Yvette,,11/02/1990,female,Not captured,Not captured,Not captured,Not captured,Not captured,Not captured,Not captured,Not captured,Not captured,Not captured,Not captured,Not captured,Not captured,,,Not captured,Not captured,Not captured,Not captured,141 Golf Club Road,,Pleasant Hill,California,94523,,,Not captured,Not captured,tholt937@hotmail.com,Not captured,701800138,,Not captured,Not captured,Not captured,Not captured,Not captured,Not captured,
Not captured,Not captured,08/28/2018,Not captured,Not captured,863949,020,00072,ARS-01-0043907,Beacon International,Not captured,Not captured,Not captured,,,,Holt,Taylor,,03/20/1988,male,Not captured,Not captured,Not captured,Not captured,Not captured,Not captured,Not captured,Not captured,Not captured,Not captured,Not captured,Not captured,Not captured,,,Not captured,Not captured,Not captured,Not captured,141 Golf Club Road,,Pleasant Hill,California,94523,,,Not captured,Not captured,tholt937@hotmail.com,Not captured,701800137,,Not captured,Not captured,Not captured,Not captured,Not captured,Not captured,
Not captured,Not captured,08/27/2018,Not captured,Not captured,863949,020,00072,ARS-01-0043899,Beacon International,Not captured,Not captured,Not captured,,,,March,Yehoshua,,04/21/2002,male,Not captured,Not captured,Not captured,Not captured,Not captured,Not captured,Not captured,Not captured,Not captured,Not captured,Not captured,Not captured,Not captured,,,Not captured,Not captured,Not captured,Not captured,74 Omaha Court,,Lakewood,New Jersey,08701,908-9104391,,Not captured,Not captured,ysmgraphics@gmail.com,Not captured,201817807,,Not captured,Not captured,Not captured,Not captured,Not captured,Not captured,
Not captured,Not captured,08/27/2018,Not captured,Not captured,863949,020,00072,ARS-03-0043394,Essential America,Not captured,Not captured,Not captured,Passport(488683822),,,Fixsen,John,Carl,04/20/1963,male,Not captured,Not captured,Not captured,Not captured,Not captured,Not captured,Not captured,Not captured,Not captured,Not captured,Not captured,Not captured,Not captured,,,Not captured,Not captured,Not captured,Not captured,723 York Avenue,,St Paul,Minnesota,55106,651-468-4578,,Not captured,Not captured,jfixsen748@gmail.com,Not captured,201818512,,Not captured,Not captured,Not captured,Not captured,Not captured,Not captured,
Not captured,Not captured,08/27/2018,Not captured,Not captured,863949,020,00072,ARS-01-0043890,Beacon International,Not captured,Not captured,Not captured,,,,Wehman,Robert,e,06/09/1953,male,Not captured,Not captured,Not captured,Not captured,Not captured,Not captured,Not captured,Not captured,Not captured,Not captured,Not captured,Not captured,Not captured,,,Not captured,Not captured,Not captured,Not captured,430 Burnett Avenue,,San Francisco,California,94131,,,Not captured,Not captured,rwehman@mac.com,Not captured,201817448,,Not captured,Not captured,Not captured,Not captured,Not captured,Not captured,
Not captured,Not captured,08/27/2018,Not captured,Not captured,863949,020,00072,ARS-01-0043888,Beacon International,Not captured,Not captured,Not captured,,,,Johnsen,James,,04/10/1988,male,Not captured,Not captured,Not captured,Not captured,Not captured,Not captured,Not captured,Not captured,Not captured,Not captured,Not captured,Not captured,Not captured,,,Not captured,Not captured,Not captured,Not captured,349 W Bute St Apt C6,,Norfolk,Virginia,23510,,,Not captured,Not captured,johnsen.james@gmail.com,Not captured,201817444,,Not captured,Not captured,Not captured,Not captured,Not captured,Not captured,