EE Transaction Type,Dependent Transaction Type,Effective Date,EE Signature,EE Signature Date,Control,Suffix,Account,Plan Number,Plan Name,Claim Office,Network ID Number,Customer Code,EE SSN,Dependent SSN,Dependent Relationship,Last Name,First Name,Middle Initial,DOB,Gender,Ethnicity,PCP/PCD,PCP/PCD Current Patient,Provider Cap Office Number,COB,Dep Student Indicator,Dep OOA Indicator,EE Prior Coverage Indicator,EE Late Entrant,EE Language Indicator,Hire Date,Earnings,Earnings Frequency,Beneficiary (Last Name First Name MI),Beneficiary Relationship,Continuation of Coverage Expiration Date,Continuation of Coverage Event Date,Continuation of Coverage Length of Coverage,Work Location Zip Code,Street Address Line 1,Street Address Line 2,City,State,Zip Code,Home Phone Number,Work Phone Number,Accept Code,Evidence Code,EE Email Address,Communication Disability Code,EE Alternate ID,Dep Alternate ID,Old Control,Old Suffix,Old Account,New Control,New Suffix,New Account,
Not captured,Not captured,08/27/2018,Not captured,Not captured,863949,020,00072,ARS-01-0043881,Beacon International,Not captured,Not captured,Not captured,,,,Chang,Nathan,,10/05/1999,male,Not captured,Not captured,Not captured,Not captured,Not captured,Not captured,Not captured,Not captured,Not captured,Not captured,Not captured,Not captured,Not captured,,,Not captured,Not captured,Not captured,Not captured,711 Brandermill Ct,,San Jose,California,95138,,,Not captured,Not captured,ChangNathan08@gmail.com,Not captured,201817333,,Not captured,Not captured,Not captured,Not captured,Not captured,Not captured,
Not captured,Not captured,08/26/2018,Not captured,Not captured,863949,020,00072,ARS-01-0043879,Beacon International,Not captured,Not captured,Not captured,,,,Carlson,Kathryn,L,11/02/1956,female,Not captured,Not captured,Not captured,Not captured,Not captured,Not captured,Not captured,Not captured,Not captured,Not captured,Not captured,Not captured,Not captured,,,Not captured,Not captured,Not captured,Not captured,3969 Jones Creek Rd,,Baton Rouge,Louisiana,70816,,,Not captured,Not captured,theninjamom@gmail.com,Not captured,201817297,,Not captured,Not captured,Not captured,Not captured,Not captured,Not captured,
Not captured,Not captured,08/26/2018,Not captured,Not captured,863949,020,00072,ARS-01-0043878,Beacon International,Not captured,Not captured,Not captured,,,,Burmeister,Stefan,,11/01/1969,male,Not captured,Not captured,Not captured,Not captured,Not captured,Not captured,Not captured,Not captured,Not captured,Not captured,Not captured,Not captured,Not captured,,,Not captured,Not captured,Not captured,Not captured,1132 Goettingen St,,San Francisco,California,94134,,,Not captured,Not captured,stefan_in_ca@yahoo.com,Not captured,201817287,,Not captured,Not captured,Not captured,Not captured,Not captured,Not captured,
Not captured,Not captured,08/26/2018,Not captured,Not captured,863949,020,00072,ARS-01-0043877,Beacon International,Not captured,Not captured,Not captured,,,,Monteza,Elmer,A,01/22/1968,male,Not captured,Not captured,Not captured,Not captured,Not captured,Not captured,Not captured,Not captured,Not captured,Not captured,Not captured,Not captured,Not captured,,,Not captured,Not captured,Not captured,Not captured,1132 Goettingen St,,San Francisco,California,94134,,,Not captured,Not captured,a_monteza@hotmail.com,Not captured,201817284,,Not captured,Not captured,Not captured,Not captured,Not captured,Not captured,
Not captured,Not captured,08/26/2018,Not captured,Not captured,863949,020,00072,ARS-01-0043875,Beacon International,Not captured,Not captured,Not captured,,,,Vernon,Patrick,,01/16/1961,male,Not captured,Not captured,Not captured,Not captured,Not captured,Not captured,Not captured,Not captured,Not captured,Not captured,Not captured,Not captured,Not captured,,,Not captured,Not captured,Not captured,Not captured,194-11 110th Ave,,Saint Albans,New York,11412,,,Not captured,Not captured,pwvernon1@verizon.net,Not captured,201817278,,Not captured,Not captured,Not captured,Not captured,Not captured,Not captured,
Not captured,Not captured,08/26/2018,Not captured,Not captured,863949,020,00072,ARS-01-0043874,Beacon International,Not captured,Not captured,Not captured,,,,Vernon,Winsome,,05/06/1959,female,Not captured,Not captured,Not captured,Not captured,Not captured,Not captured,Not captured,Not captured,Not captured,Not captured,Not captured,Not captured,Not captured,,,Not captured,Not captured,Not captured,Not captured,194-11 110th Ave,,Saint Albans,New York,11412,,,Not captured,Not captured,pwvernon1@verizon.net,Not captured,201817283,,Not captured,Not captured,Not captured,Not captured,Not captured,Not captured,
Not captured,Not captured,08/26/2018,Not captured,Not captured,863949,020,00072,ARS-01-0043872,Beacon International,Not captured,Not captured,Not captured,,,,Kessler,S,,10/16/1984,female,Not captured,Not captured,Not captured,Not captured,Not captured,Not captured,Not captured,Not captured,Not captured,Not captured,Not captured,Not captured,Not captured,,,Not captured,Not captured,Not captured,Not captured,70 KOSCIUSZKO STREET,,BROOKLYN,New York,11205,,,Not captured,Not captured,sarah.g.kessler@gmail.com,Not captured,201852585,,Not captured,Not captured,Not captured,Not captured,Not captured,Not captured,
Not captured,Not captured,08/25/2018,Not captured,Not captured,863949,020,00072,ARS-01-0043870,Beacon International,Not captured,Not captured,Not captured,,,,Kelley,Shannon,C,01/30/1970,female,Not captured,Not captured,Not captured,Not captured,Not captured,Not captured,Not captured,Not captured,Not captured,Not captured,Not captured,Not captured,Not captured,,,Not captured,Not captured,Not captured,Not captured,2471 31st Avenue,,San Francisco,California,94116,,,Not captured,Not captured,gypsychic4ever@aol.com,Not captured,201852583,,Not captured,Not captured,Not captured,Not captured,Not captured,Not captured,
Not captured,Not captured,08/25/2018,Not captured,Not captured,863949,020,00072,ARS-01-0043869,Beacon International,Not captured,Not captured,Not captured,,,,ONeil,Quinn,M,12/17/1993,female,Not captured,Not captured,Not captured,Not captured,Not captured,Not captured,Not captured,Not captured,Not captured,Not captured,Not captured,Not captured,Not captured,,,Not captured,Not captured,Not captured,Not captured,185 Knutsen Farm Road,,Sequim,Washington,98382,,,Not captured,Not captured,brownhen@olypen.com,Not captured,201852582,,Not captured,Not captured,Not captured,Not captured,Not captured,Not captured,
Not captured,Not captured,08/25/2018,Not captured,Not captured,863949,020,00072,ARS-01-0043867,Beacon International,Not captured,Not captured,Not captured,,,,Anthony,Rose,M,04/30/1956,female,Not captured,Not captured,Not captured,Not captured,Not captured,Not captured,Not captured,Not captured,Not captured,Not captured,Not captured,Not captured,Not captured,,,Not captured,Not captured,Not captured,Not captured,10 Juniper Drive,,Lafayette,California,94549,,,Not captured,Not captured,rose@managementdesign.com,Not captured,201852578,,Not captured,Not captured,Not captured,Not captured,Not captured,Not captured,
Not captured,Not captured,08/25/2018,Not captured,Not captured,863949,020,00072,ARS-01-0043866,Beacon International,Not captured,Not captured,Not captured,,,,Anthony,Tracy,A,05/08/1954,male,Not captured,Not captured,Not captured,Not captured,Not captured,Not captured,Not captured,Not captured,Not captured,Not captured,Not captured,Not captured,Not captured,,,Not captured,Not captured,Not captured,Not captured,10 Juniper Drive,,Lafayette,California,94549,,,Not captured,Not captured,rose@managementdesign.com,Not captured,201852577,,Not captured,Not captured,Not captured,Not captured,Not captured,Not captured,
Not captured,Not captured,08/25/2018,Not captured,Not captured,863949,020,00072,ARS-01-0043865,Beacon International,Not captured,Not captured,Not captured,,,,Olsen,Ashley,E,06/29/1988,female,Not captured,Not captured,Not captured,Not captured,Not captured,Not captured,Not captured,Not captured,Not captured,Not captured,Not captured,Not captured,Not captured,,,Not captured,Not captured,Not captured,Not captured,5432 35th Ave SW,,Seattle,Washington,98126,,,Not captured,Not captured,j.david.olsen@gmail.com,Not captured,201852576,,Not captured,Not captured,Not captured,Not captured,Not captured,Not captured,
Not captured,Not captured,08/25/2018,Not captured,Not captured,863949,020,00072,ARS-01-0043864,Beacon International,Not captured,Not captured,Not captured,,,,Baron,Michael,G,11/09/1990,male,Not captured,Not captured,Not captured,Not captured,Not captured,Not captured,Not captured,Not captured,Not captured,Not captured,Not captured,Not captured,Not captured,,,Not captured,Not captured,Not captured,Not captured,2810 Georgia Avenue,,Nashville,Tennessee,37209,,,Not captured,Not captured,mgbaron3@gmail.com,Not captured,201852575,,Not captured,Not captured,Not captured,Not captured,Not captured,Not captured,
Not captured,Not captured,08/25/2018,Not captured,Not captured,863949,020,00072,OVI-28-0043863,OverseasCare Visitors Insurance Plan,Not captured,Not captured,Not captured,Passport(R4554601),,,Nelluri,Aruna,K,08/19/1952,female,Not captured,Not captured,Not captured,Not captured,Not captured,Not captured,Not captured,Not captured,Not captured,Not captured,Not captured,Not captured,Not captured,Manjari Adusumilli,Daughter,Not captured,Not captured,Not captured,Not captured,4390 US. route 1 N.,,PRINCETON,New Jersey,08540,9082564805,,Not captured,Not captured,shaker@trustek.com,Not captured,201852574,,Not captured,Not captured,Not captured,Not captured,Not captured,Not captured,
Not captured,Not captured,08/25/2018,Not captured,Not captured,863949,020,00072,OVI-28-0043862,OverseasCare Visitors Insurance Plan,Not captured,Not captured,Not captured,Passport(R4554601),,,Nelluri,Venkata Mallikarjuna Babu,,05/15/1947,male,Not captured,Not captured,Not captured,Not captured,Not captured,Not captured,Not captured,Not captured,Not captured,Not captured,Not captured,Not captured,Not captured,Manjari Adusumilli,Daughter,Not captured,Not captured,Not captured,Not captured,4390 US. route 1 N.,,PRINCETON,New Jersey,08540,9082564805,,Not captured,Not captured,shaker@trustek.com,Not captured,201852570,,Not captured,Not captured,Not captured,Not captured,Not captured,Not captured,
Not captured,Not captured,08/27/2018,Not captured,Not captured,863949,020,00072,ARS-02-0043861,Beacon America,Not captured,Not captured,Not captured,,,,GARCIA GONZALEZ,LUIS ENRIQUE,LEGG,05/24/2012,male,Not captured,Not captured,Not captured,Not captured,Not captured,Not captured,Not captured,Not captured,Not captured,Not captured,Not captured,Not captured,Not captured,LUIS ELADIO GARCIA,ESPOSO,Not captured,Not captured,Not captured,Not captured,URB PIRINEOS CALLE URIBANTE LOS CEREZOS SAN CRISTOBAL TACHIRA P131,,SAN CRISTOBAL,Tachira,5001,+582763533077,+584147084022,Not captured,Not captured,zraquel@hotmail.com,Not captured,201852569,,Not captured,Not captured,Not captured,Not captured,Not captured,Not captured,
Not captured,Not captured,08/27/2018,Not captured,Not captured,863949,020,00072,ARS-02-0043860,Beacon America,Not captured,Not captured,Not captured,,,,GARCIA GONZALEZ,LUIS EDUARDO ,LEGG,12/17/2008,male,Not captured,Not captured,Not captured,Not captured,Not captured,Not captured,Not captured,Not captured,Not captured,Not captured,Not captured,Not captured,Not captured,LUIS ELADIO GARCIA,ESPOSO,Not captured,Not captured,Not captured,Not captured,URB PIRINEOS CALLE URIBANTE LOS CEREZOS SAN CRISTOBAL TACHIRA P131,,SAN CRISTOBAL,Tachira,5001,+582763533077,+584147084022,Not captured,Not captured,zraquel@hotmail.com,Not captured,201852571,,Not captured,Not captured,Not captured,Not captured,Not captured,Not captured,
Not captured,Not captured,08/27/2018,Not captured,Not captured,863949,020,00072,ARS-02-0043859,Beacon America,Not captured,Not captured,Not captured,,,,GARCIA RONDON,LUIS ELADIO,LEGR,04/09/1958,male,Not captured,Not captured,Not captured,Not captured,Not captured,Not captured,Not captured,Not captured,Not captured,Not captured,Not captured,Not captured,Not captured,LUIS ELADIO GARCIA,ESPOSO,Not captured,Not captured,Not captured,Not captured,URB PIRINEOS CALLE URIBANTE LOS CEREZOS SAN CRISTOBAL TACHIRA P131,,SAN CRISTOBAL,Tachira,5001,+582763533077,+584147084022,Not captured,Not captured,zraquel@hotmail.com,Not captured,201852566,,Not captured,Not captured,Not captured,Not captured,Not captured,Not captured,
Not captured,Not captured,08/27/2018,Not captured,Not captured,863949,020,00072,ARS-02-0043858,Beacon America,Not captured,Not captured,Not captured,Passport(131941401),,,GONZALEZ DE GARCIA,ZOIRE RAQUEL,ZRGDG,11/25/1973,female,Not captured,Not captured,Not captured,Not captured,Not captured,Not captured,Not captured,Not captured,Not captured,Not captured,Not captured,Not captured,Not captured,LUIS ELADIO GARCIA,ESPOSO,Not captured,Not captured,Not captured,Not captured,URB PIRINEOS CALLE URIBANTE LOS CEREZOS SAN CRISTOBAL TACHIRA P131,,SAN CRISTOBAL,Tachira,5001,+582763533077,+584147084022,Not captured,Not captured,zraquel@hotmail.com,Not captured,201852565,,Not captured,Not captured,Not captured,Not captured,Not captured,Not captured,
Not captured,Not captured,08/26/2018,Not captured,Not captured,863949,020,00072,ARS-01-0043857,Beacon International,Not captured,Not captured,Not captured,,,,Dieguez,Antonio,,06/10/1962,male,Not captured,Not captured,Not captured,Not captured,Not captured,Not captured,Not captured,Not captured,Not captured,Not captured,Not captured,Not captured,Not captured,,,Not captured,Not captured,Not captured,Not captured,7855 W 10th Av,,Hialeah,Florida,33014,,,Not captured,Not captured,epfrankel@yahoo.com,Not captured,201852564,,Not captured,Not captured,Not captured,Not captured,Not captured,Not captured,
Not captured,Not captured,08/26/2018,Not captured,Not captured,863949,020,00072,ARS-01-0043856,Beacon International,Not captured,Not captured,Not captured,,,,Tjon En Fa,Jair,J,10/19/1993,male,Not captured,Not captured,Not captured,Not captured,Not captured,Not captured,Not captured,Not captured,Not captured,Not captured,Not captured,Not captured,Not captured,,,Not captured,Not captured,Not captured,Not captured,14 Mafoengostraat,,Paramaribo,,0000,,,Not captured,Not captured,epfrankel@yahoo.com,Not captured,201852561,,Not captured,Not captured,Not captured,Not captured,Not captured,Not captured,
Not captured,Not captured,08/25/2018,Not captured,Not captured,863949,020,00072,ARS-01-0043854,Beacon International,Not captured,Not captured,Not captured,,,,Seoane Lopez,Brais,,01/26/1981,male,Not captured,Not captured,Not captured,Not captured,Not captured,Not captured,Not captured,Not captured,Not captured,Not captured,Not captured,Not captured,Not captured,,,Not captured,Not captured,Not captured,Not captured,915 Bainbridge St.,,Philadelphia,Pennsylvania,19147,,,Not captured,Not captured,981brais@gmail.com,Not captured,201852505,,Not captured,Not captured,Not captured,Not captured,Not captured,Not captured,
Not captured,Not captured,08/25/2018,Not captured,Not captured,863949,020,00072,ARS-01-0043853,Beacon International,Not captured,Not captured,Not captured,,,,Mcmahon,Jacqueline,M,05/06/1986,female,Not captured,Not captured,Not captured,Not captured,Not captured,Not captured,Not captured,Not captured,Not captured,Not captured,Not captured,Not captured,Not captured,,,Not captured,Not captured,Not captured,Not captured,915 Bainbridge St.,,Philadelphia,Pennsylvania,19147,,,Not captured,Not captured,981brais@gmail.com,Not captured,201852504,,Not captured,Not captured,Not captured,Not captured,Not captured,Not captured,
Not captured,Not captured,08/25/2018,Not captured,Not captured,863949,020,00072,ARS-01-0043852,Beacon International,Not captured,Not captured,Not captured,,,,Chasnoff,Stav,A,05/30/2001,female,Not captured,Not captured,Not captured,Not captured,Not captured,Not captured,Not captured,Not captured,Not captured,Not captured,Not captured,Not captured,Not captured,,,Not captured,Not captured,Not captured,Not captured,Eliezer Yafeh 37,,Raanana,,43104,,,Not captured,Not captured,jchasnoff@gmail.com,Not captured,201852503,,Not captured,Not captured,Not captured,Not captured,Not captured,Not captured,
Not captured,Not captured,08/25/2018,Not captured,Not captured,863949,020,00072,ARS-01-0043851,Beacon International,Not captured,Not captured,Not captured,,,,Mahoney,John,F,10/14/1954,male,Not captured,Not captured,Not captured,Not captured,Not captured,Not captured,Not captured,Not captured,Not captured,Not captured,Not captured,Not captured,Not captured,,,Not captured,Not captured,Not captured,Not captured,3116 55th Avenue,,GREELEY,Colorado,80632,,,Not captured,Not captured,jmahoney2644@comcast.net,Not captured,201852500,,Not captured,Not captured,Not captured,Not captured,Not captured,Not captured,
Not captured,Not captured,08/25/2018,Not captured,Not captured,863949,020,00072,ARS-01-0043850,Beacon International,Not captured,Not captured,Not captured,,,,Mahoney,Cheryl,L,08/16/1960,female,Not captured,Not captured,Not captured,Not captured,Not captured,Not captured,Not captured,Not captured,Not captured,Not captured,Not captured,Not captured,Not captured,,,Not captured,Not captured,Not captured,Not captured,3116 55th Avenue,,GREELEY,Colorado,80632,,,Not captured,Not captured,jmahoney2644@comcast.net,Not captured,201852499,,Not captured,Not captured,Not captured,Not captured,Not captured,Not captured,
Not captured,Not captured,08/25/2018,Not captured,Not captured,863949,020,00072,ARS-01-0043848,Beacon International,Not captured,Not captured,Not captured,,,,Maclachlan,Mary,A,07/30/1962,female,Not captured,Not captured,Not captured,Not captured,Not captured,Not captured,Not captured,Not captured,Not captured,Not captured,Not captured,Not captured,Not captured,,,Not captured,Not captured,Not captured,Not captured,14295 SW Compass Drive,,Beaverton,Oregon,97005,,,Not captured,Not captured,m.maclachlan@gmail.com,Not captured,201852498,,Not captured,Not captured,Not captured,Not captured,Not captured,Not captured,
Not captured,Not captured,08/24/2018,Not captured,Not captured,863949,020,00072,ARS-01-0043845,Beacon International,Not captured,Not captured,Not captured,,,,Boettiger,Penelope,A,06/12/1968,female,Not captured,Not captured,Not captured,Not captured,Not captured,Not captured,Not captured,Not captured,Not captured,Not captured,Not captured,Not captured,Not captured,,,Not captured,Not captured,Not captured,Not captured,18 Ehrlich Rd,,Austin,Texas,78746,,,Not captured,Not captured,penelope.boettiger@gmail.com,Not captured,201852426,,Not captured,Not captured,Not captured,Not captured,Not captured,Not captured,
Not captured,Not captured,08/27/2018,Not captured,Not captured,863949,020,00072,ARS-01-0043843,Beacon International,Not captured,Not captured,Not captured,,,,RAMIREZ ADRIAN,FEDERICO,RAMIREZ,06/16/2004,male,Not captured,Not captured,Not captured,Not captured,Not captured,Not captured,Not captured,Not captured,Not captured,Not captured,Not captured,Not captured,Not captured,ROSANNA ADRIAN,ESPOSA,Not captured,Not captured,Not captured,Not captured,URB. SAN MIGUEL CARRETERA NACIONAL VIA LA TOSCANA CALLE TONORO CASA # 217,,MATURIN,Monagas,6201,+584147656516,,Not captured,Not captured,farp03@gmail.com,Not captured,201888099,,Not captured,Not captured,Not captured,Not captured,Not captured,Not captured,
Not captured,Not captured,08/27/2018,Not captured,Not captured,863949,020,00072,ARS-01-0043842,Beacon International,Not captured,Not captured,Not captured,,,,ADRIAN,ROSANNA,,12/08/1971,female,Not captured,Not captured,Not captured,Not captured,Not captured,Not captured,Not captured,Not captured,Not captured,Not captured,Not captured,Not captured,Not captured,ROSANNA ADRIAN,ESPOSA,Not captured,Not captured,Not captured,Not captured,URB. SAN MIGUEL CARRETERA NACIONAL VIA LA TOSCANA CALLE TONORO CASA # 217,,MATURIN,Monagas,6201,+584147656516,,Not captured,Not captured,farp03@gmail.com,Not captured,201888098,,Not captured,Not captured,Not captured,Not captured,Not captured,Not captured,
Not captured,Not captured,08/27/2018,Not captured,Not captured,863949,020,00072,ARS-01-0043841,Beacon International,Not captured,Not captured,Not captured,Passport(7140471),,,ADRIAN,FRANCISCO,RAMIREZ,12/10/1970,male,Not captured,Not captured,Not captured,Not captured,Not captured,Not captured,Not captured,Not captured,Not captured,Not captured,Not captured,Not captured,Not captured,ROSANNA ADRIAN,ESPOSA,Not captured,Not captured,Not captured,Not captured,URB. SAN MIGUEL CARRETERA NACIONAL VIA LA TOSCANA CALLE TONORO CASA # 217,,MATURIN,Monagas,6201,+584147656516,,Not captured,Not captured,farp03@gmail.com,Not captured,201888097,,Not captured,Not captured,Not captured,Not captured,Not captured,Not captured,
Not captured,Not captured,08/24/2018,Not captured,Not captured,863949,020,00072,ARS-02-0043836,Beacon America,Not captured,Not captured,Not captured,Passport(141674191),,,Escorche,PABLO ,,03/11/1967,male,Not captured,Not captured,Not captured,Not captured,Not captured,Not captured,Not captured,Not captured,Not captured,Not captured,Not captured,Not captured,Not captured,MARIA Escorche,Hija,Not captured,Not captured,Not captured,Not captured,14221 sw120 st 127 MIAMI,,Florida,,33186,3053785210,,Not captured,Not captured,Xenia.perdomo@gmail.com,Not captured,201888091,,Not captured,Not captured,Not captured,Not captured,Not captured,Not captured,
Not captured,Not captured,08/24/2018,Not captured,Not captured,863949,020,00072,ARS-02-0043835,Beacon America,Not captured,Not captured,Not captured,,,,Padnick,Jonah,,10/03/2015,male,Not captured,Not captured,Not captured,Not captured,Not captured,Not captured,Not captured,Not captured,Not captured,Not captured,Not captured,Not captured,Not captured,,,Not captured,Not captured,Not captured,Not captured,4137 E. Pinchot Ave.,,Phoenix,Arizona,85018,,,Not captured,Not captured,josh.padnick@gmail.com,Not captured,201888088,,Not captured,Not captured,Not captured,Not captured,Not captured,Not captured,
Not captured,Not captured,08/24/2018,Not captured,Not captured,863949,020,00072,ARS-02-0043833,Beacon America,Not captured,Not captured,Not captured,,,,Padnick,Joshua,M,01/01/1980,male,Not captured,Not captured,Not captured,Not captured,Not captured,Not captured,Not captured,Not captured,Not captured,Not captured,Not captured,Not captured,Not captured,,,Not captured,Not captured,Not captured,Not captured,4137 E. Pinchot Ave.,,Phoenix,Arizona,85018,,,Not captured,Not captured,josh.padnick@gmail.com,Not captured,201888087,,Not captured,Not captured,Not captured,Not captured,Not captured,Not captured,
Not captured,Not captured,08/27/2018,Not captured,Not captured,863949,020,00072,OVI-28-0043831,OverseasCare Visitors Insurance Plan,Not captured,Not captured,Not captured,Passport(AN633281),,,CUBIDES,JUAN,P,10/20/2017,male,Not captured,Not captured,Not captured,Not captured,Not captured,Not captured,Not captured,Not captured,Not captured,Not captured,Not captured,Not captured,Not captured,RENE HERNANDEZ,FATHER,Not captured,Not captured,Not captured,Not captured,av kr 7 64 50 int 2 ap 102,,BOGOTA,Distrito Capltal de Santa Fe de Bogot&atilde;,110231,2570386,,Not captured,Not captured,marcelahernandezarq@gmail.com,Not captured,201888076,,Not captured,Not captured,Not captured,Not captured,Not captured,Not captured,