EE Transaction Type,Dependent Transaction Type,Effective Date,EE Signature,EE Signature Date,Control,Suffix,Account,Plan Number,Plan Name,Claim Office,Network ID Number,Customer Code,EE SSN,Dependent SSN,Dependent Relationship,Last Name,First Name,Middle Initial,DOB,Gender,Ethnicity,PCP/PCD,PCP/PCD Current Patient,Provider Cap Office Number,COB,Dep Student Indicator,Dep OOA Indicator,EE Prior Coverage Indicator,EE Late Entrant,EE Language Indicator,Hire Date,Earnings,Earnings Frequency,Beneficiary (Last Name First Name MI),Beneficiary Relationship,Continuation of Coverage Expiration Date,Continuation of Coverage Event Date,Continuation of Coverage Length of Coverage,Work Location Zip Code,Street Address Line 1,Street Address Line 2,City,State,Zip Code,Home Phone Number,Work Phone Number,Accept Code,Evidence Code,EE Email Address,Communication Disability Code,EE Alternate ID,Dep Alternate ID,Old Control,Old Suffix,Old Account,New Control,New Suffix,New Account,
Not captured,Not captured,08/07/2018,Not captured,Not captured,863949,020,00072,ARS-02-0043378,Beacon America,Not captured,Not captured,Not captured,,,,Ceffrey,Marie,,02/06/1997,female,Not captured,Not captured,Not captured,Not captured,Not captured,Not captured,Not captured,Not captured,Not captured,Not captured,Not captured,Not captured,Not captured,,,Not captured,Not captured,Not captured,Not captured,1 Rue de la Valle,,Honfleur,,14600,,,Not captured,Not captured,db.rosten@gmail.com,Not captured,201818456,,Not captured,Not captured,Not captured,Not captured,Not captured,Not captured,
Not captured,Not captured,08/07/2018,Not captured,Not captured,863949,020,00072,ARS-01-0043375,Beacon International,Not captured,Not captured,Not captured,,,,Last,Marci,,09/15/1961,female,Not captured,Not captured,Not captured,Not captured,Not captured,Not captured,Not captured,Not captured,Not captured,Not captured,Not captured,Not captured,Not captured,,,Not captured,Not captured,Not captured,Not captured,62 Newport dr,,Hewlett,New York,11557,,,Not captured,Not captured,daryldia62@aol.com,Not captured,201818450,,Not captured,Not captured,Not captured,Not captured,Not captured,Not captured,
Not captured,Not captured,08/07/2018,Not captured,Not captured,863949,020,00072,ARS-01-0043374,Beacon International,Not captured,Not captured,Not captured,,,,Last,Robert,,09/08/1961,male,Not captured,Not captured,Not captured,Not captured,Not captured,Not captured,Not captured,Not captured,Not captured,Not captured,Not captured,Not captured,Not captured,,,Not captured,Not captured,Not captured,Not captured,62 Newport dr,,Hewlett,New York,11557,,,Not captured,Not captured,daryldia62@aol.com,Not captured,201818449,,Not captured,Not captured,Not captured,Not captured,Not captured,Not captured,
Not captured,Not captured,08/07/2018,Not captured,Not captured,863949,020,00072,ARS-01-0043367,Beacon International,Not captured,Not captured,Not captured,,,,Taubenfeld,Jacob ,,08/02/1994,male,Not captured,Not captured,Not captured,Not captured,Not captured,Not captured,Not captured,Not captured,Not captured,Not captured,Not captured,Not captured,Not captured,,,Not captured,Not captured,Not captured,Not captured,18 Witzel Ct,,monsey,New York,10952,8454263257,8455581615,Not captured,Not captured,sbt0212@gmail.com,Not captured,201838774,,Not captured,Not captured,Not captured,Not captured,Not captured,Not captured,
Not captured,Not captured,08/07/2018,Not captured,Not captured,863949,020,00072,ARS-01-0043363,Beacon International,Not captured,Not captured,Not captured,Passport(0092492404),,,Gelves,Eufracio,Y,08/16/1957,male,Not captured,Not captured,Not captured,Not captured,Not captured,Not captured,Not captured,Not captured,Not captured,Not captured,Not captured,Not captured,Not captured,Magda Salazar De Gelves,ESPOSA,Not captured,Not captured,Not captured,Not captured,14306 SW 148 Ave,,Miami,,33196,3055196255,,Not captured,Not captured,mags.gelves@gmail.com,Not captured,201838761,,Not captured,Not captured,Not captured,Not captured,Not captured,Not captured,
Not captured,Not captured,08/07/2018,Not captured,Not captured,863949,020,00072,ARS-01-0043356,Beacon International,Not captured,Not captured,Not captured,,,,Cannon,Jacob,Y,12/02/2000,male,Not captured,Not captured,Not captured,Not captured,Not captured,Not captured,Not captured,Not captured,Not captured,Not captured,Not captured,Not captured,Not captured,,,Not captured,Not captured,Not captured,Not captured,12010 Titian Way,,Potomac,Maryland,20854-3343,,,Not captured,Not captured,jacobycannon@gmail.com,Not captured,201838744,,Not captured,Not captured,Not captured,Not captured,Not captured,Not captured,
Not captured,Not captured,08/07/2018,Not captured,Not captured,863949,020,00072,ARS-01-0043352,Beacon International,Not captured,Not captured,Not captured,,,,Idrovo,Maria,C,11/18/1978,female,Not captured,Not captured,Not captured,Not captured,Not captured,Not captured,Not captured,Not captured,Not captured,Not captured,Not captured,Not captured,Not captured,,,Not captured,Not captured,Not captured,Not captured,4425 Harbor country drive A2,,Gig Harbor,Washington,98335,,,Not captured,Not captured,macridan2004@hotmail.com,Not captured,201838726,,Not captured,Not captured,Not captured,Not captured,Not captured,Not captured,
Not captured,Not captured,08/07/2018,Not captured,Not captured,863949,020,00072,ARS-01-0043351,Beacon International,Not captured,Not captured,Not captured,,,,Perez,Jorge,M,05/27/1977,male,Not captured,Not captured,Not captured,Not captured,Not captured,Not captured,Not captured,Not captured,Not captured,Not captured,Not captured,Not captured,Not captured,,,Not captured,Not captured,Not captured,Not captured,4425 Harbor country drive A2,,Gig Harbor,Washington,98335,,,Not captured,Not captured,macridan2004@hotmail.com,Not captured,201838725,,Not captured,Not captured,Not captured,Not captured,Not captured,Not captured,
Not captured,Not captured,08/07/2018,Not captured,Not captured,863949,020,00072,ARS-01-0043348,Beacon International,Not captured,Not captured,Not captured,,,,Roach ,Annajak,J,08/04/2015,female,Not captured,Not captured,Not captured,Not captured,Not captured,Not captured,Not captured,Not captured,Not captured,Not captured,Not captured,Not captured,Not captured,,,Not captured,Not captured,Not captured,Not captured,102 N Freeman St,,Oceanside,California,92054,7602075441,,Not captured,Not captured,roachtunes@outlook.com,Not captured,201838722,,Not captured,Not captured,Not captured,Not captured,Not captured,Not captured,
Not captured,Not captured,08/07/2018,Not captured,Not captured,863949,020,00072,ARS-01-0043347,Beacon International,Not captured,Not captured,Not captured,,,,Roach ,Eddie,D,09/16/1977,male,Not captured,Not captured,Not captured,Not captured,Not captured,Not captured,Not captured,Not captured,Not captured,Not captured,Not captured,Not captured,Not captured,,,Not captured,Not captured,Not captured,Not captured,102 N Freeman St,,Oceanside,California,92054,7602075441,,Not captured,Not captured,roachtunes@outlook.com,Not captured,201838721,,Not captured,Not captured,Not captured,Not captured,Not captured,Not captured,
Not captured,Not captured,08/07/2018,Not captured,Not captured,863949,020,00072,ARS-01-0043346,Beacon International,Not captured,Not captured,Not captured,Passport(531050918),,,Roach ,Bethany,E,06/01/1984,female,Not captured,Not captured,Not captured,Not captured,Not captured,Not captured,Not captured,Not captured,Not captured,Not captured,Not captured,Not captured,Not captured,,,Not captured,Not captured,Not captured,Not captured,102 N Freeman St,,Oceanside,California,92054,7602075441,,Not captured,Not captured,roachtunes@outlook.com,Not captured,201838720,,Not captured,Not captured,Not captured,Not captured,Not captured,Not captured,
Not captured,Not captured,08/07/2018,Not captured,Not captured,863949,020,00072,ARS-01-0043336,Beacon International,Not captured,Not captured,Not captured,,,,Knoblowitz,Rachel,,01/17/1997,female,Not captured,Not captured,Not captured,Not captured,Not captured,Not captured,Not captured,Not captured,Not captured,Not captured,Not captured,Not captured,Not captured,,,Not captured,Not captured,Not captured,Not captured,187 Williamsburg Lane,,Lakewood,New Jersey,08701,8452454942,,Not captured,Not captured,pkautoaccessories@gmail.com,Not captured,201825304,,Not captured,Not captured,Not captured,Not captured,Not captured,Not captured,
Not captured,Not captured,08/07/2018,Not captured,Not captured,863949,020,00072,ARS-01-0043335,Beacon International,Not captured,Not captured,Not captured,,,,Kenigsberg,Pinchos ,,03/17/1996,male,Not captured,Not captured,Not captured,Not captured,Not captured,Not captured,Not captured,Not captured,Not captured,Not captured,Not captured,Not captured,Not captured,,,Not captured,Not captured,Not captured,Not captured,187 Williamsburg Lane,,Lakewood,New Jersey,08701,8452454942,,Not captured,Not captured,pkautoaccessories@gmail.com,Not captured,201825303,,Not captured,Not captured,Not captured,Not captured,Not captured,Not captured,
Not captured,Not captured,08/06/2018,Not captured,Not captured,863949,020,00072,ARS-01-0043326,Beacon International,Not captured,Not captured,Not captured,,,,Bershad,Tyler,,02/25/1994,male,Not captured,Not captured,Not captured,Not captured,Not captured,Not captured,Not captured,Not captured,Not captured,Not captured,Not captured,Not captured,Not captured,,,Not captured,Not captured,Not captured,Not captured,1137 East Broadway,,Hewlett,New York,11557,,,Not captured,Not captured,speedydcb@gmail.com,Not captured,201823814,,Not captured,Not captured,Not captured,Not captured,Not captured,Not captured,
Not captured,Not captured,08/06/2018,Not captured,Not captured,863949,020,00072,ARS-01-0043325,Beacon International,Not captured,Not captured,Not captured,,,,Aviv,Michal,,06/16/2008,female,Not captured,Not captured,Not captured,Not captured,Not captured,Not captured,Not captured,Not captured,Not captured,Not captured,Not captured,Not captured,Not captured,,,Not captured,Not captured,Not captured,Not captured,529 5th street Brooklyn,,New York,New York,11215,,,Not captured,Not captured,galit.hoffer@gmail.com,Not captured,201823813,,Not captured,Not captured,Not captured,Not captured,Not captured,Not captured,
Not captured,Not captured,08/06/2018,Not captured,Not captured,863949,020,00072,ARS-01-0043324,Beacon International,Not captured,Not captured,Not captured,,,,Ross,Geoffrey,,02/13/1967,male,Not captured,Not captured,Not captured,Not captured,Not captured,Not captured,Not captured,Not captured,Not captured,Not captured,Not captured,Not captured,Not captured,,,Not captured,Not captured,Not captured,Not captured,458 N DOHENY DR # 792,,WEST HOLLYWOOD,California,90048-1737,,,Not captured,Not captured,geoffreyross13@gmail.com,Not captured,201823807,,Not captured,Not captured,Not captured,Not captured,Not captured,Not captured,
Not captured,Not captured,08/05/2018,Not captured,Not captured,863949,020,00072,ARS-01-0043323,Beacon International,Not captured,Not captured,Not captured,,,,Rosen,Udi,,02/25/1977,female,Not captured,Not captured,Not captured,Not captured,Not captured,Not captured,Not captured,Not captured,Not captured,Not captured,Not captured,Not captured,Not captured,,,Not captured,Not captured,Not captured,Not captured,6 Engelberg Terr,,Lakewood,New Jersey,08701,732-942-4492,,Not captured,Not captured,pearl@primeins.com,Not captured,201823804,,Not captured,Not captured,Not captured,Not captured,Not captured,Not captured,
Not captured,Not captured,08/05/2018,Not captured,Not captured,863949,020,00072,ARS-01-0043322,Beacon International,Not captured,Not captured,Not captured,,,,Ilowitz,Pearl,,02/25/1977,female,Not captured,Not captured,Not captured,Not captured,Not captured,Not captured,Not captured,Not captured,Not captured,Not captured,Not captured,Not captured,Not captured,,,Not captured,Not captured,Not captured,Not captured,12 engelberg Terr,,Lakewood,New Jersey,08701,732-622-8450,,Not captured,Not captured,pearl@primeins.com,Not captured,201823803,,Not captured,Not captured,Not captured,Not captured,Not captured,Not captured,
Not captured,Not captured,08/06/2018,Not captured,Not captured,863949,020,00072,ARS-01-0043321,Beacon International,Not captured,Not captured,Not captured,,,,capoor,preeti,,11/26/1966,female,Not captured,Not captured,Not captured,Not captured,Not captured,Not captured,Not captured,Not captured,Not captured,Not captured,Not captured,Not captured,Not captured,,,Not captured,Not captured,Not captured,Not captured,938 blyleven blvd,,mississauga,Ontario,l5v2g5,4168065145,,Not captured,Not captured,rogermasrani@gmail.com,Not captured,201823800,,Not captured,Not captured,Not captured,Not captured,Not captured,Not captured,
Not captured,Not captured,08/06/2018,Not captured,Not captured,863949,020,00072,ARS-01-0043320,Beacon International,Not captured,Not captured,Not captured,,,,masrani,ragesh,,05/20/1959,male,Not captured,Not captured,Not captured,Not captured,Not captured,Not captured,Not captured,Not captured,Not captured,Not captured,Not captured,Not captured,Not captured,,,Not captured,Not captured,Not captured,Not captured,938 blyleven blvd,,mississauga,Ontario,l5v2g5,4168065145,,Not captured,Not captured,rogermasrani@gmail.com,Not captured,201823799,,Not captured,Not captured,Not captured,Not captured,Not captured,Not captured,
Not captured,Not captured,08/06/2018,Not captured,Not captured,863949,020,00072,OVI-28-0043317,OverseasCare Visitors Insurance Plan,Not captured,Not captured,Not captured,,,,Kunjoor,Saroja,,05/31/1960,female,Not captured,Not captured,Not captured,Not captured,Not captured,Not captured,Not captured,Not captured,Not captured,Not captured,Not captured,Not captured,Not captured,Raghavendra Rao,Son,Not captured,Not captured,Not captured,Not captured,1 2nd St Apt 707,,Jersey City,New Jersey,07302,12015654731,,Not captured,Not captured,ragz82@gmail.com,Not captured,201823791,,Not captured,Not captured,Not captured,Not captured,Not captured,Not captured,
Not captured,Not captured,08/06/2018,Not captured,Not captured,863949,020,00072,OVI-28-0043316,OverseasCare Visitors Insurance Plan,Not captured,Not captured,Not captured,,,,Kunjoor,Krishna Rao,,01/15/1949,male,Not captured,Not captured,Not captured,Not captured,Not captured,Not captured,Not captured,Not captured,Not captured,Not captured,Not captured,Not captured,Not captured,Raghavendra Rao,Son,Not captured,Not captured,Not captured,Not captured,1 2nd St Apt 707,,Jersey City,New Jersey,07302,12015654731,,Not captured,Not captured,ragz82@gmail.com,Not captured,201823782,,Not captured,Not captured,Not captured,Not captured,Not captured,Not captured,
Not captured,Not captured,08/07/2018,Not captured,Not captured,863949,020,00072,ARS-01-0043309,Beacon International,Not captured,Not captured,Not captured,Passport(012495767),,,Pantic,Darija,,06/30/1979,female,Not captured,Not captured,Not captured,Not captured,Not captured,Not captured,Not captured,Not captured,Not captured,Not captured,Not captured,Not captured,Not captured,Paolo Tricanico,partner,Not captured,Not captured,Not captured,Not captured,Uzicka 36,,Valjevo,Valjevo,14000,+381637345660,,Not captured,Not captured,darijapantic@yahoo.com,Not captured,201823739,,Not captured,Not captured,Not captured,Not captured,Not captured,Not captured,
Not captured,Not captured,08/05/2018,Not captured,Not captured,863949,020,00072,ARS-01-0043308,Beacon International,Not captured,Not captured,Not captured,,,,Benyamin-van der Steege,Lisette,M,08/21/1970,female,Not captured,Not captured,Not captured,Not captured,Not captured,Not captured,Not captured,Not captured,Not captured,Not captured,Not captured,Not captured,Not captured,,,Not captured,Not captured,Not captured,Not captured,31667 Folkstone Drive,,Farmington,Michigan,48336,,,Not captured,Not captured,L2bdutch@gmail.com,Not captured,201823736,,Not captured,Not captured,Not captured,Not captured,Not captured,Not captured,
Not captured,Not captured,08/05/2018,Not captured,Not captured,863949,020,00072,ARS-01-0043307,Beacon International,Not captured,Not captured,Not captured,,,,Benyamin,Dean,N,09/24/1995,male,Not captured,Not captured,Not captured,Not captured,Not captured,Not captured,Not captured,Not captured,Not captured,Not captured,Not captured,Not captured,Not captured,,,Not captured,Not captured,Not captured,Not captured,31667 Folkstone Drive,,Farmington,Michigan,48336,,,Not captured,Not captured,L2bdutch@gmail.com,Not captured,201823742,,Not captured,Not captured,Not captured,Not captured,Not captured,Not captured,
Not captured,Not captured,08/05/2018,Not captured,Not captured,863949,020,00072,ARS-01-0043306,Beacon International,Not captured,Not captured,Not captured,,,,Benyamin,Jeremy,R,09/13/1998,male,Not captured,Not captured,Not captured,Not captured,Not captured,Not captured,Not captured,Not captured,Not captured,Not captured,Not captured,Not captured,Not captured,,,Not captured,Not captured,Not captured,Not captured,31667 Folkstone Drive,,Farmington,Michigan,48336,,,Not captured,Not captured,L2bdutch@gmail.com,Not captured,201823738,,Not captured,Not captured,Not captured,Not captured,Not captured,Not captured,
Not captured,Not captured,08/05/2018,Not captured,Not captured,863949,020,00072,ARS-01-0043305,Beacon International,Not captured,Not captured,Not captured,,,,Benyamin,Alon,D,11/18/2006,male,Not captured,Not captured,Not captured,Not captured,Not captured,Not captured,Not captured,Not captured,Not captured,Not captured,Not captured,Not captured,Not captured,,,Not captured,Not captured,Not captured,Not captured,31667 Folkstone Drive,,Farmington,Michigan,48336,,,Not captured,Not captured,L2bdutch@gmail.com,Not captured,201823737,,Not captured,Not captured,Not captured,Not captured,Not captured,Not captured,
Not captured,Not captured,08/05/2018,Not captured,Not captured,863949,020,00072,ARS-02-0043304,Beacon America,Not captured,Not captured,Not captured,,,,Hirano,Nio,,04/23/2002,female,Not captured,Not captured,Not captured,Not captured,Not captured,Not captured,Not captured,Not captured,Not captured,Not captured,Not captured,Not captured,Not captured,,,Not captured,Not captured,Not captured,Not captured,3 Old Farm Rd,,Scarsdale,New York,10583,,,Not captured,Not captured,family@yokoichi.org,Not captured,201823727,,Not captured,Not captured,Not captured,Not captured,Not captured,Not captured,
Not captured,Not captured,08/05/2018,Not captured,Not captured,863949,020,00072,ARS-02-0043303,Beacon America,Not captured,Not captured,Not captured,,,,Marcial,Garbanzo Salas,,09/02/1980,male,Not captured,Not captured,Not captured,Not captured,Not captured,Not captured,Not captured,Not captured,Not captured,Not captured,Not captured,Not captured,Not captured,,,Not captured,Not captured,Not captured,Not captured,Vive Sabanilla 355,,San Jos&eacute;,,NA,,,Not captured,Not captured,mgarbanzopcm@gmail.com,Not captured,201823724,,Not captured,Not captured,Not captured,Not captured,Not captured,Not captured,
Not captured,Not captured,08/04/2018,Not captured,Not captured,863949,020,00072,OVI-28-0043295,OverseasCare Visitors Insurance Plan,Not captured,Not captured,Not captured,Passport(L3191498),,,Vinay Zalake,FNU,,07/20/1984,male,Not captured,Not captured,Not captured,Not captured,Not captured,Not captured,Not captured,Not captured,Not captured,Not captured,Not captured,Not captured,Not captured,Jyoti Kagale,Spouse,Not captured,Not captured,Not captured,Not captured,525 E Maude Ave,,Sunnyvale,California,94085,6692041643,,Not captured,Not captured,jyotiip.kagale@gmail.com,Not captured,201824195,,Not captured,Not captured,Not captured,Not captured,Not captured,Not captured,
Not captured,Not captured,08/07/2018,Not captured,Not captured,863949,020,00072,ARS-02-0043294,Beacon America,Not captured,Not captured,Not captured,,,,Zhang,Wanqi,,01/17/2000,male,Not captured,Not captured,Not captured,Not captured,Not captured,Not captured,Not captured,Not captured,Not captured,Not captured,Not captured,Not captured,Not captured,,,Not captured,Not captured,Not captured,Not captured,Dujuanshan East Street No.8 Nanshan,,Shenzhen,,518053,,,Not captured,Not captured,hezhang@davidson.edu,Not captured,201824194,,Not captured,Not captured,Not captured,Not captured,Not captured,Not captured,
Not captured,Not captured,08/07/2018,Not captured,Not captured,863949,020,00072,ARS-02-0043293,Beacon America,Not captured,Not captured,Not captured,,,,Hou,Yu,,05/10/1971,female,Not captured,Not captured,Not captured,Not captured,Not captured,Not captured,Not captured,Not captured,Not captured,Not captured,Not captured,Not captured,Not captured,,,Not captured,Not captured,Not captured,Not captured,Dujuanshan East Street No.8 Nanshan,,Shenzhen,,518053,,,Not captured,Not captured,962449799@qq.com,Not captured,201824193,,Not captured,Not captured,Not captured,Not captured,Not captured,Not captured,
Not captured,Not captured,08/05/2018,Not captured,Not captured,863949,020,00072,ARS-02-0043292,Beacon America,Not captured,Not captured,Not captured,,,,Quan,Chenjiayu,,07/06/2005,male,Not captured,Not captured,Not captured,Not captured,Not captured,Not captured,Not captured,Not captured,Not captured,Not captured,Not captured,Not captured,Not captured,,,Not captured,Not captured,Not captured,Not captured,680 E ALOSTA AVE,,AZUSA,CALIFORNIA,91702,6268151550,,Not captured,Not captured,kathy@eupheus1.com,Not captured,201824192,,Not captured,Not captured,Not captured,Not captured,Not captured,Not captured,
Not captured,Not captured,08/05/2018,Not captured,Not captured,863949,020,00072,ARS-02-0043291,Beacon America,Not captured,Not captured,Not captured,,,,Yang,Fengrui,,09/26/2005,male,Not captured,Not captured,Not captured,Not captured,Not captured,Not captured,Not captured,Not captured,Not captured,Not captured,Not captured,Not captured,Not captured,,,Not captured,Not captured,Not captured,Not captured,680 e alosta ave,,AZUSA,CALIFORNIA,91702,6268151550,,Not captured,Not captured,kathy@eupheus1.com,Not captured,201824191,,Not captured,Not captured,Not captured,Not captured,Not captured,Not captured,
Not captured,Not captured,08/05/2018,Not captured,Not captured,863949,020,00072,ARS-02-0043290,Beacon America,Not captured,Not captured,Not captured,,,,Ma,Haijing,,02/15/1983,male,Not captured,Not captured,Not captured,Not captured,Not captured,Not captured,Not captured,Not captured,Not captured,Not captured,Not captured,Not captured,Not captured,,,Not captured,Not captured,Not captured,Not captured,680 e alosta ave,,AZUSA,CALIFONRIA,91702,6268151550,,Not captured,Not captured,kathy@eupheus1.com,Not captured,201824190,,Not captured,Not captured,Not captured,Not captured,Not captured,Not captured,
Not captured,Not captured,08/05/2018,Not captured,Not captured,863949,020,00072,ARS-02-0043289,Beacon America,Not captured,Not captured,Not captured,,,,Jiang,Qingjing ,,05/25/1985,male,Not captured,Not captured,Not captured,Not captured,Not captured,Not captured,Not captured,Not captured,Not captured,Not captured,Not captured,Not captured,Not captured,,,Not captured,Not captured,Not captured,Not captured,680 e alosta ave,,AZUSA,CALIFORNIA,91702,6268151550,,Not captured,Not captured,kathy@eupheus1.com,Not captured,201824189,,Not captured,Not captured,Not captured,Not captured,Not captured,Not captured,
Not captured,Not captured,08/05/2018,Not captured,Not captured,863949,020,00072,ARS-02-0043288,Beacon America,Not captured,Not captured,Not captured,,,,Jiang,Qinglin,,07/01/2005,male,Not captured,Not captured,Not captured,Not captured,Not captured,Not captured,Not captured,Not captured,Not captured,Not captured,Not captured,Not captured,Not captured,,,Not captured,Not captured,Not captured,Not captured,680 e alosta ave,,AZUSA,California,91702,6268151550,,Not captured,Not captured,kathy@eupheus1.com,Not captured,201824188,,Not captured,Not captured,Not captured,Not captured,Not captured,Not captured,