EE Transaction Type,Dependent Transaction Type,Effective Date,EE Signature,EE Signature Date,Control,Suffix,Account,Plan Number,Plan Name,Claim Office,Network ID Number,Customer Code,EE SSN,Dependent SSN,Dependent Relationship,Last Name,First Name,Middle Initial,DOB,Gender,Ethnicity,PCP/PCD,PCP/PCD Current Patient,Provider Cap Office Number,COB,Dep Student Indicator,Dep OOA Indicator,EE Prior Coverage Indicator,EE Late Entrant,EE Language Indicator,Hire Date,Earnings,Earnings Frequency,Beneficiary (Last Name First Name MI),Beneficiary Relationship,Continuation of Coverage Expiration Date,Continuation of Coverage Event Date,Continuation of Coverage Length of Coverage,Work Location Zip Code,Street Address Line 1,Street Address Line 2,City,State,Zip Code,Home Phone Number,Work Phone Number,Accept Code,Evidence Code,EE Email Address,Communication Disability Code,EE Alternate ID,Dep Alternate ID,Old Control,Old Suffix,Old Account,New Control,New Suffix,New Account,
Not captured,Not captured,07/31/2018,Not captured,Not captured,863949,020,00072,ARS-03-0043170,Essential America,Not captured,Not captured,Not captured,Passport(482296794),,,Allhoff,Mary,Katherine,04/30/1981,female,Not captured,Not captured,Not captured,Not captured,Not captured,Not captured,Not captured,Not captured,Not captured,Not captured,Not captured,Not captured,Not captured,,,Not captured,Not captured,Not captured,Not captured,302 Quinnmoor Dr.,,Ballwin,Missouri,63011,6363911417,,Not captured,Not captured,mka0481@gmail.com,Not captured,201821511,,Not captured,Not captured,Not captured,Not captured,Not captured,Not captured,
Not captured,Not captured,07/31/2018,Not captured,Not captured,863949,020,00072,ARS-01-0043175,Beacon International,Not captured,Not captured,Not captured,,,,Jhaveri,Shivani,,07/09/1993,female,Not captured,Not captured,Not captured,Not captured,Not captured,Not captured,Not captured,Not captured,Not captured,Not captured,Not captured,Not captured,Not captured,,,Not captured,Not captured,Not captured,Not captured,330 texas st,,san francisco,California,94107,,,Not captured,Not captured,shivjhav@gmail.com,Not captured,201821772,,Not captured,Not captured,Not captured,Not captured,Not captured,Not captured,
Not captured,Not captured,07/31/2018,Not captured,Not captured,863949,020,00072,ARS-01-0043166,Beacon International,Not captured,Not captured,Not captured,,,,Schischa,Sam,,03/02/1998,male,Not captured,Not captured,Not captured,Not captured,Not captured,Not captured,Not captured,Not captured,Not captured,Not captured,Not captured,Not captured,Not captured,,,Not captured,Not captured,Not captured,Not captured,Kapach 7,,Jerusalem,,220754,,,Not captured,Not captured,Avrumy1155@gmail.Com,Not captured,201821454,,Not captured,Not captured,Not captured,Not captured,Not captured,Not captured,
Not captured,Not captured,07/31/2018,Not captured,Not captured,863949,020,00072,ARS-02-0043165,Beacon America,Not captured,Not captured,Not captured,,,,Zilberg,Aviva,,06/23/2010,female,Not captured,Not captured,Not captured,Not captured,Not captured,Not captured,Not captured,Not captured,Not captured,Not captured,Not captured,Not captured,Not captured,,,Not captured,Not captured,Not captured,Not captured,2393 E. Strathmore Pl,,Fresno,,93730,,,Not captured,Not captured,natutie1@yahoo.com,Not captured,201821418,,Not captured,Not captured,Not captured,Not captured,Not captured,Not captured,
Not captured,Not captured,07/31/2018,Not captured,Not captured,863949,020,00072,ARS-01-0043164,Beacon International,Not captured,Not captured,Not captured,,,,Tolani,Jivesh,,12/21/1990,male,Not captured,Not captured,Not captured,Not captured,Not captured,Not captured,Not captured,Not captured,Not captured,Not captured,Not captured,Not captured,Not captured,,,Not captured,Not captured,Not captured,Not captured,57 Reade St,,New York,New York,10007,,,Not captured,Not captured,yuvika.t@gmail.com,Not captured,201821412,,Not captured,Not captured,Not captured,Not captured,Not captured,Not captured,
Not captured,Not captured,07/31/2018,Not captured,Not captured,863949,020,00072,ARS-01-0043163,Beacon International,Not captured,Not captured,Not captured,,,,Tolani,Yuvika,,12/23/1992,female,Not captured,Not captured,Not captured,Not captured,Not captured,Not captured,Not captured,Not captured,Not captured,Not captured,Not captured,Not captured,Not captured,,,Not captured,Not captured,Not captured,Not captured,57 Reade St,,New York,New York,10007,,,Not captured,Not captured,yuvika.t@gmail.com,Not captured,201821409,,Not captured,Not captured,Not captured,Not captured,Not captured,Not captured,
Not captured,Not captured,07/30/2018,Not captured,Not captured,863949,020,00072,ARS-02-0043160,Beacon America,Not captured,Not captured,Not captured,,,,Colmenares,Maria,,04/03/1989,female,Not captured,Not captured,Not captured,Not captured,Not captured,Not captured,Not captured,Not captured,Not captured,Not captured,Not captured,Not captured,Not captured,,,Not captured,Not captured,Not captured,Not captured,Av. intercomunal del valle calle 17,,Caracas,,1090,,,Not captured,Not captured,mariatcolmenaresv@gmail.com,Not captured,201874508,,Not captured,Not captured,Not captured,Not captured,Not captured,Not captured,
Not captured,Not captured,07/31/2018,Not captured,Not captured,863949,020,00072,ARS-01-0043157,Beacon International,Not captured,Not captured,Not captured,,,,Wilmer,Avrohom,,02/28/1995,male,Not captured,Not captured,Not captured,Not captured,Not captured,Not captured,Not captured,Not captured,Not captured,Not captured,Not captured,Not captured,Not captured,,,Not captured,Not captured,Not captured,Not captured,1235 45th street,,Brooklyn,New York,11219,,,Not captured,Not captured,avrumy1155@gmail.com,Not captured,201813081,,Not captured,Not captured,Not captured,Not captured,Not captured,Not captured,
Not captured,Not captured,07/30/2018,Not captured,Not captured,863949,020,00072,ARS-01-0043156,Beacon International,Not captured,Not captured,Not captured,,,,Mack,Alice,M,05/20/1944,female,Not captured,Not captured,Not captured,Not captured,Not captured,Not captured,Not captured,Not captured,Not captured,Not captured,Not captured,Not captured,Not captured,,,Not captured,Not captured,Not captured,Not captured,53 laurel st #2,,Somerville,Massachusetts,02143,,,Not captured,Not captured,Aliceontimenow@gmail.com,Not captured,201813080,,Not captured,Not captured,Not captured,Not captured,Not captured,Not captured,
Not captured,Not captured,6/23/2018,Not captured,Not captured,863949,020,00072,BG001030-23-e57cc26f,International Assurance,Not captured,Not captured,Not captured,-,-,,Martin,Regina,,3/8/1965,female,Not captured,Not captured,Not captured,Not captured,Not captured,Not captured,Not captured,Not captured,Not captured,Not captured,Not captured,Not captured,Not captured,,,Not captured,Not captured,Not captured,Not captured,23457 St. Rt. 39,,Big Prairie,Ohio,44611,330-621-4463,,Not captured,Not captured,braddodson@mac.com,Not captured,201813078,,Not captured,Not captured,Not captured,Not captured,Not captured,Not captured,
Not captured,Not captured,07/30/2018,Not captured,Not captured,863949,020,00072,ARS-01-0043152,Beacon International,Not captured,Not captured,Not captured,,,,Masheyev,Isaak,,09/10/1947,male,Not captured,Not captured,Not captured,Not captured,Not captured,Not captured,Not captured,Not captured,Not captured,Not captured,Not captured,Not captured,Not captured,,,Not captured,Not captured,Not captured,Not captured,141-35 Pershing Cresent,,JAMAICA,New York,11435,,,Not captured,Not captured,homes368@gmail.com,Not captured,201813077,,Not captured,Not captured,Not captured,Not captured,Not captured,Not captured,
Not captured,Not captured,07/30/2018,Not captured,Not captured,863949,020,00072,ARS-01-0043149,Beacon International,Not captured,Not captured,Not captured,,,,Mikhailytchev,Fedor,,12/20/1992,male,Not captured,Not captured,Not captured,Not captured,Not captured,Not captured,Not captured,Not captured,Not captured,Not captured,Not captured,Not captured,Not captured,,,Not captured,Not captured,Not captured,Not captured,404 3717 Hamber Place,,North Vancouver,British Columbia,V7G2J6,,,Not captured,Not captured,f.mikhaily@gmail.com,Not captured,201813033,,Not captured,Not captured,Not captured,Not captured,Not captured,Not captured,
Not captured,Not captured,06/18/2018,Not captured,Not captured,863949,020,00072,ARS-01-0041965,Beacon International,Not captured,Not captured,Not captured,,,,Foust,Grant,,09/17/1991,male,Not captured,Not captured,Not captured,Not captured,Not captured,Not captured,Not captured,Not captured,Not captured,Not captured,Not captured,Not captured,Not captured,,,Not captured,Not captured,Not captured,Not captured,505 E HYW 67,,Alvarado,Texas,76009,,,Not captured,Not captured,foust.blake@gmail.com,Not captured,201813019,,Not captured,Not captured,Not captured,Not captured,Not captured,Not captured,
Not captured,Not captured,07/30/2018,Not captured,Not captured,863949,020,00072,ARS-02-0043140,Beacon America,Not captured,Not captured,Not captured,,,,Krohnke,Brian,D,12/13/1969,male,Not captured,Not captured,Not captured,Not captured,Not captured,Not captured,Not captured,Not captured,Not captured,Not captured,Not captured,Not captured,Not captured,,,Not captured,Not captured,Not captured,Not captured,Jose Domingo Albuja 3-72,,Ibarra,,100150,,,Not captured,Not captured,bkrohnke@gmail.com,Not captured,201813013,,Not captured,Not captured,Not captured,Not captured,Not captured,Not captured,
Not captured,Not captured,07/30/2018,Not captured,Not captured,863949,020,00072,ARS-01-0043125,Beacon International,Not captured,Not captured,Not captured,,,,Beilush,Rivka,,01/15/1955,female,Not captured,Not captured,Not captured,Not captured,Not captured,Not captured,Not captured,Not captured,Not captured,Not captured,Not captured,Not captured,Not captured,,,Not captured,Not captured,Not captured,Not captured,1741 56th Street,,Brooklyn,New York,11218,718-234-1714,,Not captured,Not captured,triccv@aol.com,Not captured,201823121,,Not captured,Not captured,Not captured,Not captured,Not captured,Not captured,
Not captured,Not captured,07/30/2018,Not captured,Not captured,863949,020,00072,ARS-01-0043124,Beacon International,Not captured,Not captured,Not captured,,,,Beilush,Moshe,,06/10/1955,male,Not captured,Not captured,Not captured,Not captured,Not captured,Not captured,Not captured,Not captured,Not captured,Not captured,Not captured,Not captured,Not captured,,,Not captured,Not captured,Not captured,Not captured,1741 56th Street,,Brooklyn,New York,11218,718-234-1714,,Not captured,Not captured,triccv@aol.com,Not captured,201823120,,Not captured,Not captured,Not captured,Not captured,Not captured,Not captured,
Not captured,Not captured,07/29/2018,Not captured,Not captured,863949,020,00072,ARS-01-0043123,Beacon International,Not captured,Not captured,Not captured,,,,ilowitz,Chaya R,,11/20/2000,female,Not captured,Not captured,Not captured,Not captured,Not captured,Not captured,Not captured,Not captured,Not captured,Not captured,Not captured,Not captured,Not captured,,,Not captured,Not captured,Not captured,Not captured,12 Engelberg Terr,,Lakewood,New Jersey,08701,732-886-5751,,Not captured,Not captured,Sol@primeins.com,Not captured,201823119,,Not captured,Not captured,Not captured,Not captured,Not captured,Not captured,
Not captured,Not captured,07/30/2018,Not captured,Not captured,863949,020,00072,OVI-28-0043120,OverseasCare Visitors Insurance Plan,Not captured,Not captured,Not captured,Passport(H9914973),,,KOYEMBEDU,NAGARAJAN,SUNDARARAJAN,04/25/1944,male,Not captured,Not captured,Not captured,Not captured,Not captured,Not captured,Not captured,Not captured,Not captured,Not captured,Not captured,Not captured,Not captured,SHANTI BOINEPALLY,DAUGHTER,Not captured,Not captured,Not captured,Not captured,535 COACHGATE CT,,BALLWIN,Missouri,63021,6365446815,6365446815,Not captured,Not captured,boinepallyv@aol.com,Not captured,201823113,,Not captured,Not captured,Not captured,Not captured,Not captured,Not captured,
Not captured,Not captured,07/29/2018,Not captured,Not captured,863949,020,00072,ARS-01-0043119,Beacon International,Not captured,Not captured,Not captured,,,,Reason,Lucy-Mae,V,09/14/2001,female,Not captured,Not captured,Not captured,Not captured,Not captured,Not captured,Not captured,Not captured,Not captured,Not captured,Not captured,Not captured,Not captured,,,Not captured,Not captured,Not captured,Not captured,10717 Verna Trl W,,Fort Worth,Texas,76108,,,Not captured,Not captured,ian@reasonfamily.co.uk,Not captured,201823112,,Not captured,Not captured,Not captured,Not captured,Not captured,Not captured,
Not captured,Not captured,07/29/2018,Not captured,Not captured,863949,020,00072,ARS-01-0043118,Beacon International,Not captured,Not captured,Not captured,,,,Reason,Emily,C,07/11/1996,female,Not captured,Not captured,Not captured,Not captured,Not captured,Not captured,Not captured,Not captured,Not captured,Not captured,Not captured,Not captured,Not captured,,,Not captured,Not captured,Not captured,Not captured,10717 Verna Trl W,,Fort Worth,Texas,76108,,,Not captured,Not captured,ian@reasonfamily.co.uk,Not captured,201823114,,Not captured,Not captured,Not captured,Not captured,Not captured,Not captured,
Not captured,Not captured,07/29/2018,Not captured,Not captured,863949,020,00072,ARS-01-0043117,Beacon International,Not captured,Not captured,Not captured,,,,Reason,Rachel,A,04/17/1972,female,Not captured,Not captured,Not captured,Not captured,Not captured,Not captured,Not captured,Not captured,Not captured,Not captured,Not captured,Not captured,Not captured,,,Not captured,Not captured,Not captured,Not captured,10717 Verna Trl W,,Fort Worth,Texas,76108,,,Not captured,Not captured,ian@reasonfamily.co.uk,Not captured,201823109,,Not captured,Not captured,Not captured,Not captured,Not captured,Not captured,
Not captured,Not captured,07/29/2018,Not captured,Not captured,863949,020,00072,ARS-01-0043116,Beacon International,Not captured,Not captured,Not captured,,,,Reason,Ian,M,05/27/1964,male,Not captured,Not captured,Not captured,Not captured,Not captured,Not captured,Not captured,Not captured,Not captured,Not captured,Not captured,Not captured,Not captured,,,Not captured,Not captured,Not captured,Not captured,10717 Verna Trl W,,Fort Worth,Texas,76108,,,Not captured,Not captured,ian@reasonfamily.co.uk,Not captured,201823108,,Not captured,Not captured,Not captured,Not captured,Not captured,Not captured,
Not captured,Not captured,07/29/2018,Not captured,Not captured,863949,020,00072,ARS-01-0043115,Beacon International,Not captured,Not captured,Not captured,,,,Mizen,Jason,C,09/25/1987,male,Not captured,Not captured,Not captured,Not captured,Not captured,Not captured,Not captured,Not captured,Not captured,Not captured,Not captured,Not captured,Not captured,,,Not captured,Not captured,Not captured,Not captured,5/357 Canning Highway,,Como,,6152,,,Not captured,Not captured,jcmizen@gmail.com,Not captured,201823106,,Not captured,Not captured,Not captured,Not captured,Not captured,Not captured,
Not captured,Not captured,07/29/2018,Not captured,Not captured,863949,020,00072,ARS-01-0043114,Beacon International,Not captured,Not captured,Not captured,,,,Geystrin,Pavel,,04/12/1986,male,Not captured,Not captured,Not captured,Not captured,Not captured,Not captured,Not captured,Not captured,Not captured,Not captured,Not captured,Not captured,Not captured,,,Not captured,Not captured,Not captured,Not captured,2 pulaski st,,brooklyn,New York,11206,,,Not captured,Not captured,pgeystrin@gmail.com,Not captured,201823103,,Not captured,Not captured,Not captured,Not captured,Not captured,Not captured,
Not captured,Not captured,07/29/2018,Not captured,Not captured,863949,020,00072,ARS-01-0043113,Beacon International,Not captured,Not captured,Not captured,,,,Nelson,Hilary,,03/04/1975,female,Not captured,Not captured,Not captured,Not captured,Not captured,Not captured,Not captured,Not captured,Not captured,Not captured,Not captured,Not captured,Not captured,,,Not captured,Not captured,Not captured,Not captured,563 28th St,,San Francisco,California,94131,,,Not captured,Not captured,hnelson123@yahoo.com,Not captured,201823102,,Not captured,Not captured,Not captured,Not captured,Not captured,Not captured,
Not captured,Not captured,07/29/2018,Not captured,Not captured,863949,020,00072,ARS-01-0043111,Beacon International,Not captured,Not captured,Not captured,,,,Flagg,Matthew,P,08/06/1982,male,Not captured,Not captured,Not captured,Not captured,Not captured,Not captured,Not captured,Not captured,Not captured,Not captured,Not captured,Not captured,Not captured,,,Not captured,Not captured,Not captured,Not captured,20868 W Elm Way,,Buckeye,Arizona,85396,6238502951,,Not captured,Not captured,flaggma@gmail.com,Not captured,201823101,,Not captured,Not captured,Not captured,Not captured,Not captured,Not captured,
Not captured,Not captured,07/29/2018,Not captured,Not captured,863949,020,00072,ARS-01-0043110,Beacon International,Not captured,Not captured,Not captured,,,,Gancz,Leah,,10/31/1994,female,Not captured,Not captured,Not captured,Not captured,Not captured,Not captured,Not captured,Not captured,Not captured,Not captured,Not captured,Not captured,Not captured,,,Not captured,Not captured,Not captured,Not captured,1016 East 31st street,,Brooklyn,New York,11210,,,Not captured,Not captured,leahgancz@gmail.com,Not captured,201823098,,Not captured,Not captured,Not captured,Not captured,Not captured,Not captured,
Not captured,Not captured,07/29/2018,Not captured,Not captured,863949,020,00072,ARS-02-0043109,Beacon America,Not captured,Not captured,Not captured,,,,BLACKWELL,Trevor,O,11/04/1969,male,Not captured,Not captured,Not captured,Not captured,Not captured,Not captured,Not captured,Not captured,Not captured,Not captured,Not captured,Not captured,Not captured,,,Not captured,Not captured,Not captured,Not captured,1300 Bear Gulch Road,,Woodside,California,94062,,,Not captured,Not captured,dominika@blackappl.com,Not captured,201823094,,Not captured,Not captured,Not captured,Not captured,Not captured,Not captured,
Not captured,Not captured,07/29/2018,Not captured,Not captured,863949,020,00072,ARS-02-0043108,Beacon America,Not captured,Not captured,Not captured,,,,BLACKAPPL,Dominika,,09/09/1974,female,Not captured,Not captured,Not captured,Not captured,Not captured,Not captured,Not captured,Not captured,Not captured,Not captured,Not captured,Not captured,Not captured,,,Not captured,Not captured,Not captured,Not captured,1300 Bear Gulch Road,,Woodside,California,94062,,,Not captured,Not captured,dominika@blackappl.com,Not captured,201823091,,Not captured,Not captured,Not captured,Not captured,Not captured,Not captured,
Not captured,Not captured,07/08/2018,Not captured,Not captured,863949,020,00072,BG001030-23-f93c0917,International Assurance,Not captured,Not captured,Not captured,-,-,,Klein,Raymond,R,01/22/1955,male,Not captured,Not captured,Not captured,Not captured,Not captured,Not captured,Not captured,Not captured,Not captured,Not captured,Not captured,Not captured,Not captured,,,Not captured,Not captured,Not captured,Not captured,13445 W Hampton Ave,,Brookfield,Wisconsin,53005,262-781-7140,,Not captured,Not captured,gmcclellanjohnson@yahoo.com,Not captured,201806343,,Not captured,Not captured,Not captured,Not captured,Not captured,Not captured,
Not captured,Not captured,07/28/2018,Not captured,Not captured,863949,020,00072,ARS-01-0043105,Beacon International,Not captured,Not captured,Not captured,,,,daga,sharon,J,05/16/1943,female,Not captured,Not captured,Not captured,Not captured,Not captured,Not captured,Not captured,Not captured,Not captured,Not captured,Not captured,Not captured,Not captured,,,Not captured,Not captured,Not captured,Not captured,6709 the masters ave,,Bradenton,Florida,34202,,,Not captured,Not captured,adagamasters@yahoo.com,Not captured,201806342,,Not captured,Not captured,Not captured,Not captured,Not captured,Not captured,
Not captured,Not captured,07/08/2018,Not captured,Not captured,863949,020,00072,BG001030-23-f93c0917,International Assurance,Not captured,Not captured,Not captured,-,-,,McClellanJohnson,Samantha,E,09/28/1990,female,Not captured,Not captured,Not captured,Not captured,Not captured,Not captured,Not captured,Not captured,Not captured,Not captured,Not captured,Not captured,Not captured,,,Not captured,Not captured,Not captured,Not captured,13445 W Hampton Ave,,Brookfield,Wisconsin,53005,262-781-7140,,Not captured,Not captured,gmcclellanjohnson@yahoo.com,Not captured,201806340,,Not captured,Not captured,Not captured,Not captured,Not captured,Not captured,
Not captured,Not captured,07/29/2018,Not captured,Not captured,863949,020,00072,ARS-02-0043103,Beacon America,Not captured,Not captured,Not captured,,,,GAURET,SWAN,J,11/17/2003,male,Not captured,Not captured,Not captured,Not captured,Not captured,Not captured,Not captured,Not captured,Not captured,Not captured,Not captured,Not captured,Not captured,,,Not captured,Not captured,Not captured,Not captured,BLOCK 28-1B-COASTAL ROSE GARDEN 1,,SHENZHEN,,518000,,,Not captured,Not captured,helene.gauret@brunet-china.com,Not captured,201806339,,Not captured,Not captured,Not captured,Not captured,Not captured,Not captured,
Not captured,Not captured,07/08/2018,Not captured,Not captured,863949,020,00072,BG001030-23-f93c0917,International Assurance,Not captured,Not captured,Not captured,-,-,,McClellanJohnson,Gayle,D,02/06/1960,female,Not captured,Not captured,Not captured,Not captured,Not captured,Not captured,Not captured,Not captured,Not captured,Not captured,Not captured,Not captured,Not captured,,,Not captured,Not captured,Not captured,Not captured,13445 W Hampton Ave,,Brookfield,Wisconsin,53005,262-781-7140,,Not captured,Not captured,gmcclellanjohnson@yahoo.com,Not captured,201806338,,Not captured,Not captured,Not captured,Not captured,Not captured,Not captured,
Not captured,Not captured,06/19/2018,Not captured,Not captured,863949,020,00072,ARS-02-0041603,Beacon America,Not captured,Not captured,Not captured,,,,Hickey,Alexander,J,02/01/1996,male,Not captured,Not captured,Not captured,Not captured,Not captured,Not captured,Not captured,Not captured,Not captured,Not captured,Not captured,Not captured,Not captured,,,Not captured,Not captured,Not captured,Not captured,54 Falshire Terrace NE,,Calgary,Alberta,T3J3B3,4034813653,,Not captured,Not captured,alexhickey96@gmail.com,Not captured,201806337,,Not captured,Not captured,Not captured,Not captured,Not captured,Not captured,
Not captured,Not captured,07/27/2018,Not captured,Not captured,863949,020,00072,ARS-01-0043100,Beacon International,Not captured,Not captured,Not captured,,,,Butler,Christopher,c,04/15/1975,male,Not captured,Not captured,Not captured,Not captured,Not captured,Not captured,Not captured,Not captured,Not captured,Not captured,Not captured,Not captured,Not captured,,,Not captured,Not captured,Not captured,Not captured,201 Martin circle,,Royal Palm Beach,Florida,33411,,,Not captured,Not captured,cc-butler@hotmail.com,Not captured,201817461,,Not captured,Not captured,Not captured,Not captured,Not captured,Not captured,
Not captured,Not captured,07/27/2018,Not captured,Not captured,863949,020,00072,ARS-01-0043082,Beacon International,Not captured,Not captured,Not captured,,,,Shiau,Frank,,03/18/1976,male,Not captured,Not captured,Not captured,Not captured,Not captured,Not captured,Not captured,Not captured,Not captured,Not captured,Not captured,Not captured,Not captured,Estate,Estate,Not captured,Not captured,Not captured,Not captured,4630 Center Blvd.,,Long Island City,New York,11109,9177921990,,Not captured,Not captured,steph.leonora@gmail.com,Not captured,201817378,,Not captured,Not captured,Not captured,Not captured,Not captured,Not captured,