EE Transaction Type,Dependent Transaction Type,Effective Date,EE Signature,EE Signature Date,Control,Suffix,Account,Plan Number,Plan Name,Claim Office,Network ID Number,Customer Code,EE SSN,Dependent SSN,Dependent Relationship,Last Name,First Name,Middle Initial,DOB,Gender,Ethnicity,PCP/PCD,PCP/PCD Current Patient,Provider Cap Office Number,COB,Dep Student Indicator,Dep OOA Indicator,EE Prior Coverage Indicator,EE Late Entrant,EE Language Indicator,Hire Date,Earnings,Earnings Frequency,Beneficiary (Last Name, First Name MI),Beneficiary Relationship,Continuation of Coverage Expiration Date,Continuation of Coverage Event Date,Continuation of Coverage Length of Coverage,Work Location Zip Code,Street Address Line 1,Street Address Line 2,City,State,Zip Code,Home Phone Number,Work Phone Number,Accept Code,Evidence Code,EE Email Address,Communication Disability Code,EE Alternate ID,Dep Alternate ID,Old Control,Old Suffix,Old Account,New Control,New Suffix,New Account,
Not captured,Not captured,08/14/2018,Not captured,Not captured,863949,020,00072,ARS-01-0043533,Beacon International,Not captured,Not captured,Not captured,,,,Zelenova,Elena,,10/05/1967,female,Not captured,Not captured,Not captured,Not captured,Not captured,Not captured,Not captured,Not captured,Not captured,Not captured,Not captured,Not captured,Not captured,,,Not captured,Not captured,Not captured,Not captured,Not captured,39-22 Van Duren Ave,,Fair Lawn,New Jersey,07410,,,Not captured,Not captured,gorakin@hotmail.com,Not captured,201813235,,Not captured,Not captured,Not captured,Not captured,Not captured,Not captured,
Not captured,Not captured,08/14/2018,Not captured,Not captured,863949,020,00072,ARS-01-0043532,Beacon International,Not captured,Not captured,Not captured,,,,Gorakine,Konstantin,,12/05/1970,male,Not captured,Not captured,Not captured,Not captured,Not captured,Not captured,Not captured,Not captured,Not captured,Not captured,Not captured,Not captured,Not captured,,,Not captured,Not captured,Not captured,Not captured,Not captured,39-22 Van Duren Ave,,Fair Lawn,New Jersey,07410,,,Not captured,Not captured,gorakin@hotmail.com,Not captured,201813234,,Not captured,Not captured,Not captured,Not captured,Not captured,Not captured,
Not captured,Not captured,08/14/2018,Not captured,Not captured,863949,020,00072,ARS-02-0043527,Beacon America,Not captured,Not captured,Not captured,Passport(085348194),,,PINO TEPEDINO,EDUARDO ANDRES,,03/08/2004,male,Not captured,Not captured,Not captured,Not captured,Not captured,Not captured,Not captured,Not captured,Not captured,Not captured,Not captured,Not captured,Not captured,Maria Pia Tepedino,MADRE,Not captured,Not captured,Not captured,Not captured,Not captured,Urb. San Miguel Calle Los Barrancos Sector La Esperanza TH 2/6,,Maturin,Monagas,6201,+584147666449,+584147666449,Not captured,Not captured,mpiatep@hotmail.com,Not captured,201813220,,Not captured,Not captured,Not captured,Not captured,Not captured,Not captured,
Not captured,Not captured,08/14/2018,Not captured,Not captured,863949,020,00072,ARS-01-0043524,Beacon International,Not captured,Not captured,Not captured,Passport(561470637),,,Hayn,Lyza,M,09/17/1992,female,Not captured,Not captured,Not captured,Not captured,Not captured,Not captured,Not captured,Not captured,Not captured,Not captured,Not captured,Not captured,Not captured,Krzyzstof Adamowski,fiance,Not captured,Not captured,Not captured,Not captured,Not captured,188 county road 101,,Mountain Home,Arkansas,72653,5124925759,,Not captured,Not captured,lyzahayn12@gmail.com,Not captured,201813192,,Not captured,Not captured,Not captured,Not captured,Not captured,Not captured,
Not captured,Not captured,07/22/2018,Not captured,Not captured,863949,020,00072,BG001030-23-87fefeab,International Assurance,Not captured,Not captured,Not captured,-,-,,Gorman,Pierce,David,06/30/2002,male,Not captured,Not captured,Not captured,Not captured,Not captured,Not captured,Not captured,Not captured,Not captured,Not captured,Not captured,Not captured,Not captured,,,Not captured,Not captured,Not captured,Not captured,Not captured,10101 Reunion Place,,San Antonio,Texas,78216,210-696-6688,,Not captured,Not captured,cstein@ib-tx.com,Not captured,201813191,,Not captured,Not captured,Not captured,Not captured,Not captured,Not captured,
Not captured,Not captured,08/13/2018,Not captured,Not captured,863949,020,00072,ARS-02-0043522,Beacon America,Not captured,Not captured,Not captured,Passport(116173793),,,Abarca Runciman,Sebastian,E,11/26/1997,male,Not captured,Not captured,Not captured,Not captured,Not captured,Not captured,Not captured,Not captured,Not captured,Not captured,Not captured,Not captured,Not captured,Cesar Alexander Rodriguez Gonzales,Cousin,Not captured,Not captured,Not captured,Not captured,Not captured,5349 Coach Dr,,El Sobrante,CA,94803,5106196839,,Not captured,Not captured,alexanderrodriguez598@gmail.com,Not captured,201813190,,Not captured,Not captured,Not captured,Not captured,Not captured,Not captured,
Not captured,Not captured,08/14/2018,Not captured,Not captured,863949,020,00072,ARS-01-0043521,Beacon International,Not captured,Not captured,Not captured,,,,Montero,Miguel,,05/03/1989,male,Not captured,Not captured,Not captured,Not captured,Not captured,Not captured,Not captured,Not captured,Not captured,Not captured,Not captured,Not captured,Not captured,,,Not captured,Not captured,Not captured,Not captured,Not captured,Bouwstraat 18 Bs,,Utrecht,,3572 sr,,,Not captured,Not captured,monter89@gmail.com,Not captured,201813189,,Not captured,Not captured,Not captured,Not captured,Not captured,Not captured,
Not captured,Not captured,08/14/2018,Not captured,Not captured,863949,020,00072,ARS-01-0043520,Beacon International,Not captured,Not captured,Not captured,,,,McMaster,Alexis,,05/25/1993,female,Not captured,Not captured,Not captured,Not captured,Not captured,Not captured,Not captured,Not captured,Not captured,Not captured,Not captured,Not captured,Not captured,,,Not captured,Not captured,Not captured,Not captured,Not captured,18168 Quinn Rd,,Chagrin Falls,Ohio,44023,,,Not captured,Not captured,hopelessly.quixotic@gmail.com,Not captured,201813186,,Not captured,Not captured,Not captured,Not captured,Not captured,Not captured,
Not captured,Not captured,08/13/2018,Not captured,Not captured,863949,020,00072,ARS-01-0043519,Beacon International,Not captured,Not captured,Not captured,,,,Sparkes,Gary,G,01/31/1989,male,Not captured,Not captured,Not captured,Not captured,Not captured,Not captured,Not captured,Not captured,Not captured,Not captured,Not captured,Not captured,Not captured,,,Not captured,Not captured,Not captured,Not captured,Not captured,2333 Pennington Rd,,Bel Air,Maryland,21015,,,Not captured,Not captured,mokuba@gmail.com,Not captured,201813185,,Not captured,Not captured,Not captured,Not captured,Not captured,Not captured,
Not captured,Not captured,08/13/2018,Not captured,Not captured,863949,020,00072,ARS-02-0043513,Beacon America,Not captured,Not captured,Not captured,,,,gil hernandez,samuel ,e,04/18/2016,male,Not captured,Not captured,Not captured,Not captured,Not captured,Not captured,Not captured,Not captured,Not captured,Not captured,Not captured,Not captured,Not captured,eduard gil ,esposo,Not captured,Not captured,Not captured,Not captured,Not captured,2418 ruddenstone way,,kissimmee,Florida,34744,7868539839,4079780634,Not captured,Not captured,eduardgil31@gmail.com,Not captured,201813111,,Not captured,Not captured,Not captured,Not captured,Not captured,Not captured,
Not captured,Not captured,08/13/2018,Not captured,Not captured,863949,020,00072,ARS-02-0043512,Beacon America,Not captured,Not captured,Not captured,,,,gil hernandez,orianna ,i,07/08/2014,female,Not captured,Not captured,Not captured,Not captured,Not captured,Not captured,Not captured,Not captured,Not captured,Not captured,Not captured,Not captured,Not captured,eduard gil ,esposo,Not captured,Not captured,Not captured,Not captured,Not captured,2418 ruddenstone way,,kissimmee,Florida,34744,7868539839,4079780634,Not captured,Not captured,eduardgil31@gmail.com,Not captured,201813110,,Not captured,Not captured,Not captured,Not captured,Not captured,Not captured,
Not captured,Not captured,08/13/2018,Not captured,Not captured,863949,020,00072,ARS-02-0043511,Beacon America,Not captured,Not captured,Not captured,Passport(141299631),,,hernandez mora,jessika,,03/21/1979,female,Not captured,Not captured,Not captured,Not captured,Not captured,Not captured,Not captured,Not captured,Not captured,Not captured,Not captured,Not captured,Not captured,eduard gil ,esposo,Not captured,Not captured,Not captured,Not captured,Not captured,2418 ruddenstone way,,kissimmee,Florida,34744,7868539839,4079780634,Not captured,Not captured,eduardgil31@gmail.com,Not captured,201813109,,Not captured,Not captured,Not captured,Not captured,Not captured,Not captured,
Not captured,Not captured,08/14/2018,Not captured,Not captured,863949,020,00072,ARS-03-0043440,Essential America,Not captured,Not captured,Not captured,Passport(114080560),,,MORA,SHARON,,07/02/1989,female,Not captured,Not captured,Not captured,Not captured,Not captured,Not captured,Not captured,Not captured,Not captured,Not captured,Not captured,Not captured,Not captured,,,Not captured,Not captured,Not captured,Not captured,Not captured,LOMAS DE LA JOYA,,SAN JOSE DEL CABO,Baja California Sur,23400,6241608896,,Not captured,Not captured,sharonmora274@gmail.com,Not captured,201838867,,Not captured,Not captured,Not captured,Not captured,Not captured,Not captured,
Not captured,Not captured,08/13/2018,Not captured,Not captured,863949,020,00072,ARS-01-0043507,Beacon International,Not captured,Not captured,Not captured,Passport(203530235),,,Chaves,Alberto,,09/08/1960,male,Not captured,Not captured,Not captured,Not captured,Not captured,Not captured,Not captured,Not captured,Not captured,Not captured,Not captured,Not captured,Not captured,,,Not captured,Not captured,Not captured,Not captured,Not captured,2425 Wilson Blvd,,Arlington,Virginia,22201,7038415607,,Not captured,Not captured,dhernandez@ncsc.org,Not captured,201836559,,Not captured,Not captured,Not captured,Not captured,Not captured,Not captured,
Not captured,Not captured,08/13/2018,Not captured,Not captured,863949,020,00072,OVI-28-0043506,OverseasCare Visitors Insurance Plan,Not captured,Not captured,Not captured,Passport(J6356218),,,Mahadik,Kamal,,09/04/1949,female,Not captured,Not captured,Not captured,Not captured,Not captured,Not captured,Not captured,Not captured,Not captured,Not captured,Not captured,Not captured,Not captured,,,Not captured,Not captured,Not captured,Not captured,Not captured,9825 Saint George Circle,,Cypress,California,90630,7147701952,7147184092,Not captured,Not captured,kanase24@gmail.com,Not captured,201836558,,Not captured,Not captured,Not captured,Not captured,Not captured,Not captured,
Not captured,Not captured,08/14/2018,Not captured,Not captured,863949,020,00072,ARS-01-0043502,Beacon International,Not captured,Not captured,Not captured,Passport(PO1776073),,,Diban,Michel,,11/26/1948,male,Not captured,Not captured,Not captured,Not captured,Not captured,Not captured,Not captured,Not captured,Not captured,Not captured,Not captured,Not captured,Not captured,,,Not captured,Not captured,Not captured,Not captured,Not captured,2425 Wilson Blvd,,Arlington,Virginia,22201,7038415607,,Not captured,Not captured,dhernandez@ncsc.org,Not captured,201836552,,Not captured,Not captured,Not captured,Not captured,Not captured,Not captured,
Not captured,Not captured,08/14/2018,Not captured,Not captured,863949,020,00072,ARS-01-0043498,Beacon International,Not captured,Not captured,Not captured,Passport(536144315),,,Day,Phoebe,,11/03/2000,female,Not captured,Not captured,Not captured,Not captured,Not captured,Not captured,Not captured,Not captured,Not captured,Not captured,Not captured,Not captured,Not captured,CURE International,other,Not captured,Not captured,Not captured,Not captured,Not captured,405 St Johns Church,,Camp Hill,Pennsylvania,17011,717 724 4002,,Not captured,Not captured,beth.vanhall@cureinternational.org,Not captured,201836548,,Not captured,Not captured,Not captured,Not captured,Not captured,Not captured,
Not captured,Not captured,08/14/2018,Not captured,Not captured,863949,020,00072,ARS-01-0043497,Beacon International,Not captured,Not captured,Not captured,Passport(544071300),,,Reynolds,Bethan,,04/05/2001,female,Not captured,Not captured,Not captured,Not captured,Not captured,Not captured,Not captured,Not captured,Not captured,Not captured,Not captured,Not captured,Not captured,CURE International,other,Not captured,Not captured,Not captured,Not captured,Not captured,405 St Johns Church,,Camp Hill,Pennsylvania,17011,717 724 4002,,Not captured,Not captured,beth.vanhall@cureinternational.org,Not captured,201836547,,Not captured,Not captured,Not captured,Not captured,Not captured,Not captured,
Not captured,Not captured,08/14/2018,Not captured,Not captured,863949,020,00072,ARS-03-0043443,Essential America,Not captured,Not captured,Not captured,Passport(EA0830219),,,Wang,Jingxuan,,02/02/2004,male,Not captured,Not captured,Not captured,Not captured,Not captured,Not captured,Not captured,Not captured,Not captured,Not captured,Not captured,Not captured,Not captured,,,Not captured,Not captured,Not captured,Not captured,Not captured,1220 Winyah Drive,,Columbia,South Carolina,29203,803-530-5070,,Not captured,Not captured,xbhuang4@gmail.com,Not captured,201836436,,Not captured,Not captured,Not captured,Not captured,Not captured,Not captured,
Not captured,Not captured,08/14/2018,Not captured,Not captured,863949,020,00072,ARS-03-0043441,Essential America,Not captured,Not captured,Not captured,Passport(E51046934),,,Wang,Shiyuan,,04/11/2001,female,Not captured,Not captured,Not captured,Not captured,Not captured,Not captured,Not captured,Not captured,Not captured,Not captured,Not captured,Not captured,Not captured,,,Not captured,Not captured,Not captured,Not captured,Not captured,4811 Homeplace Dr,,Apex,North Carolina,27539,336-953-5029,,Not captured,Not captured,xbhuang4@gmail.com,Not captured,201838868,,Not captured,Not captured,Not captured,Not captured,Not captured,Not captured,
Not captured,Not captured,08/14/2018,Not captured,Not captured,863949,020,00072,ARS-02-0043493,Beacon America,Not captured,Not captured,Not captured,Passport(YA6605158),,,Minardi,Francesca,,10/19/1987,female,Not captured,Not captured,Not captured,Not captured,Not captured,Not captured,Not captured,Not captured,Not captured,Not captured,Not captured,Not captured,Not captured,Vilma Castagnini,Mother,Not captured,Not captured,Not captured,Not captured,Not captured,Via San Tomaso,,Medicina,Bologna,40059,00393337403279,,Not captured,Not captured,francesca.minardi87@gmail.com,Not captured,201836543,,Not captured,Not captured,Not captured,Not captured,Not captured,Not captured,
Not captured,Not captured,08/14/2018,Not captured,Not captured,863949,020,00072,ARS-01-0043489,Beacon International,Not captured,Not captured,Not captured,,,,Haim,Dean A ,,09/30/2000,male,Not captured,Not captured,Not captured,Not captured,Not captured,Not captured,Not captured,Not captured,Not captured,Not captured,Not captured,Not captured,Not captured,,,Not captured,Not captured,Not captured,Not captured,Not captured,2 White Lane,,Monroe,New York,08831,908-217-,,Not captured,Not captured,sharonhaim5@yahoo.com,Not captured,201836530,,Not captured,Not captured,Not captured,Not captured,Not captured,Not captured,
Not captured,Not captured,08/13/2018,Not captured,Not captured,863949,020,00072,ARS-01-0043484,Beacon International,Not captured,Not captured,Not captured,,,,Sandham,Peter,,11/26/1973,male,Not captured,Not captured,Not captured,Not captured,Not captured,Not captured,Not captured,Not captured,Not captured,Not captured,Not captured,Not captured,Not captured,,,Not captured,Not captured,Not captured,Not captured,Not captured,1130 Nw 41st Street,,Fort Lauderdale,Florida,33309,,,Not captured,Not captured,pjsandham@gmail.com,Not captured,201836520,,Not captured,Not captured,Not captured,Not captured,Not captured,Not captured,
Not captured,Not captured,08/13/2018,Not captured,Not captured,863949,020,00072,ARS-01-0043470,Beacon International,Not captured,Not captured,Not captured,,,,Geise,Paul,,09/03/1969,male,Not captured,Not captured,Not captured,Not captured,Not captured,Not captured,Not captured,Not captured,Not captured,Not captured,Not captured,Not captured,Not captured,,,Not captured,Not captured,Not captured,Not captured,Not captured,3905 S. Expressway 83,,Harlingen,Texas,78550,,,Not captured,Not captured,paul.geise@mavs.uta.edu,Not captured,201836504,,Not captured,Not captured,Not captured,Not captured,Not captured,Not captured,
Not captured,Not captured,08/13/2018,Not captured,Not captured,863949,020,00072,ARS-01-0043457,Beacon International,Not captured,Not captured,Not captured,,,,Donohue,Robert,,12/05/1986,male,Not captured,Not captured,Not captured,Not captured,Not captured,Not captured,Not captured,Not captured,Not captured,Not captured,Not captured,Not captured,Not captured,,,Not captured,Not captured,Not captured,Not captured,Not captured,40 Redwood Tree,,Irvine,California,92612,,,Not captured,Not captured,teddonohue@yahoo.com,Not captured,201836488,,Not captured,Not captured,Not captured,Not captured,Not captured,Not captured,
Not captured,Not captured,08/13/2018,Not captured,Not captured,863949,020,00072,ARS-01-0043454,Beacon International,Not captured,Not captured,Not captured,Passport(524919617),,,Ko,Christopher ,R,01/19/2000,male,Not captured,Not captured,Not captured,Not captured,Not captured,Not captured,Not captured,Not captured,Not captured,Not captured,Not captured,Not captured,Not captured,Roberta Ko,Mother,Not captured,Not captured,Not captured,Not captured,Not captured,730 E. Southern Ave,,Mesa,Arizona,85204,602-688-5800,,Not captured,Not captured,Robin@er2.com,Not captured,201836485,,Not captured,Not captured,Not captured,Not captured,Not captured,Not captured,
Not captured,Not captured,08/12/2018,Not captured,Not captured,863949,020,00072,ARS-02-0043453,Beacon America,Not captured,Not captured,Not captured,Passport(137697850),,,PEREZ HIDALGO,LAURA CRISTINA,,12/10/1995,female,Not captured,Not captured,Not captured,Not captured,Not captured,Not captured,Not captured,Not captured,Not captured,Not captured,Not captured,Not captured,Not captured,TANYA HIDALGO,MOTHER,Not captured,Not captured,Not captured,Not captured,Not captured,2879W 75TH TERR,,HIALEAH,Florida,33018,4073081256,,Not captured,Not captured,perezhidal@gmail.com,Not captured,201836484,,Not captured,Not captured,Not captured,Not captured,Not captured,Not captured,
Not captured,Not captured,08/12/2018,Not captured,Not captured,863949,020,00072,ARS-01-0043451,Beacon International,Not captured,Not captured,Not captured,Passport(586956829),,,Gunnlaugsson,Nicolle,,01/04/1976,female,Not captured,Not captured,Not captured,Not captured,Not captured,Not captured,Not captured,Not captured,Not captured,Not captured,Not captured,Not captured,Not captured,Ann C. Hebert,Mother,Not captured,Not captured,Not captured,Not captured,Not captured,651 6th St. N,,Hudson,,54016,7157819586,,Not captured,Not captured,nickygunn@yahoo.com,Not captured,201836449,,Not captured,Not captured,Not captured,Not captured,Not captured,Not captured,
Not captured,Not captured,08/11/2018,Not captured,Not captured,863949,020,00072,ARS-02-0043450,Beacon America,Not captured,Not captured,Not captured,,,,AGUAYO,MONICA,G,01/01/1940,female,Not captured,Not captured,Not captured,Not captured,Not captured,Not captured,Not captured,Not captured,Not captured,Not captured,Not captured,Not captured,Not captured,,,Not captured,Not captured,Not captured,Not captured,Not captured,SAN ALBERTO 591 DPTO 301,,SANTIAGO,,7560007,,,Not captured,Not captured,juan.luis.osorio@gmail.com,Not captured,201836448,,Not captured,Not captured,Not captured,Not captured,Not captured,Not captured,
Not captured,Not captured,08/11/2018,Not captured,Not captured,863949,020,00072,ARS-02-0043449,Beacon America,Not captured,Not captured,Not captured,,,,Contreras Nunez,Laura,,11/27/1997,female,Not captured,Not captured,Not captured,Not captured,Not captured,Not captured,Not captured,Not captured,Not captured,Not captured,Not captured,Not captured,Not captured,,,Not captured,Not captured,Not captured,Not captured,Not captured,89 Dunfield Ave,,Toronto,Ontario,M4S0A4,,,Not captured,Not captured,dcontrerasv@gmail.com,Not captured,201836447,,Not captured,Not captured,Not captured,Not captured,Not captured,Not captured,
Not captured,Not captured,08/11/2018,Not captured,Not captured,863949,020,00072,ARS-02-0043448,Beacon America,Not captured,Not captured,Not captured,,,,Contreras Nunez,Pablo,,09/24/1995,male,Not captured,Not captured,Not captured,Not captured,Not captured,Not captured,Not captured,Not captured,Not captured,Not captured,Not captured,Not captured,Not captured,,,Not captured,Not captured,Not captured,Not captured,Not captured,89 Dunfield Ave,,Toronto,Ontario,M4S0A4,,,Not captured,Not captured,dcontrerasv@gmail.com,Not captured,201836446,,Not captured,Not captured,Not captured,Not captured,Not captured,Not captured,
Not captured,Not captured,08/11/2018,Not captured,Not captured,863949,020,00072,ARS-02-0043447,Beacon America,Not captured,Not captured,Not captured,,,,Nunez Alvaro,Ana,M,08/30/1965,female,Not captured,Not captured,Not captured,Not captured,Not captured,Not captured,Not captured,Not captured,Not captured,Not captured,Not captured,Not captured,Not captured,,,Not captured,Not captured,Not captured,Not captured,Not captured,89 Dunfield Ave,,Toronto,Ontario,M4S0A4,,,Not captured,Not captured,dcontrerasv@gmail.com,Not captured,201836445,,Not captured,Not captured,Not captured,Not captured,Not captured,Not captured,
Not captured,Not captured,08/11/2018,Not captured,Not captured,863949,020,00072,ARS-02-0043446,Beacon America,Not captured,Not captured,Not captured,,,,Contreras Vicente,Daniel,,08/21/1964,male,Not captured,Not captured,Not captured,Not captured,Not captured,Not captured,Not captured,Not captured,Not captured,Not captured,Not captured,Not captured,Not captured,,,Not captured,Not captured,Not captured,Not captured,Not captured,89 Dunfield Ave,,Toronto,Ontario,M4S0A4,,,Not captured,Not captured,dcontrerasv@gmail.com,Not captured,201836444,,Not captured,Not captured,Not captured,Not captured,Not captured,Not captured,
Not captured,Not captured,08/11/2018,Not captured,Not captured,863949,020,00072,ARS-01-0043445,Beacon International,Not captured,Not captured,Not captured,,,,Walker Harvey,Cassandra,,02/06/1988,female,Not captured,Not captured,Not captured,Not captured,Not captured,Not captured,Not captured,Not captured,Not captured,Not captured,Not captured,Not captured,Not captured,,,Not captured,Not captured,Not captured,Not captured,Not captured,91 Clark Street,,New Haven,Connecticut,06511,,,Not captured,Not captured,cass.walkerh@gmail.com,Not captured,201836443,,Not captured,Not captured,Not captured,Not captured,Not captured,Not captured,
Not captured,Not captured,08/11/2018,Not captured,Not captured,863949,020,00072,ARS-01-0043442,Beacon International,Not captured,Not captured,Not captured,Passport(555643233),,,Flatau,Elizabeth,A,03/15/1997,female,Not captured,Not captured,Not captured,Not captured,Not captured,Not captured,Not captured,Not captured,Not captured,Not captured,Not captured,Not captured,Not captured,Susan Flatau,Mother,Not captured,Not captured,Not captured,Not captured,Not captured,1151 Davis Ln,,Mesa,,99343,5092694415,5098518498,Not captured,Not captured,lizflatau@gmail.com,Not captured,201836435,,Not captured,Not captured,Not captured,Not captured,Not captured,Not captured,