EE Transaction Type,Dependent Transaction Type,Effective Date,EE Signature,EE Signature Date,Control,Suffix,Account,Plan Number,Plan Name,Claim Office,Network ID Number,Customer Code,EE SSN,Dependent SSN,Dependent Relationship,Last Name,First Name,Middle Initial,DOB,Gender,Ethnicity,PCP/PCD,PCP/PCD Current Patient,Provider Cap Office Number,COB,Dep Student Indicator,Dep OOA Indicator,EE Prior Coverage Indicator,EE Late Entrant,EE Language Indicator,Hire Date,Earnings,Earnings Frequency,Beneficiary (Last Name, First Name MI),Beneficiary Relationship,Continuation of Coverage Expiration Date,Continuation of Coverage Event Date,Continuation of Coverage Length of Coverage,Work Location Zip Code,Street Address Line 1,Street Address Line 2,City,State,Zip Code,Home Phone Number,Work Phone Number,Accept Code,Evidence Code,EE Email Address,Communication Disability Code,EE Alternate ID,Dep Alternate ID,Old Control,Old Suffix,Old Account,New Control,New Suffix,New Account,
Not captured,Not captured,08/14/2018,Not captured,Not captured,863949,020,00072,ARS-01-0043533,Beacon International,Not captured,Not captured,Not captured,,,,Zelenova,Elena,,10/05/1967,female,Not captured,Not captured,Not captured,Not captured,Not captured,Not captured,Not captured,Not captured,Not captured,Not captured,Not captured,Not captured,Not captured,,,Not captured,Not captured,Not captured,Not captured,Not captured,39-22 Van Duren Ave,,Fair Lawn,New Jersey,07410,,,Not captured,Not captured,gorakin@hotmail.com,Not captured,201813235,,Not captured,Not captured,Not captured,Not captured,Not captured,Not captured,
Not captured,Not captured,08/14/2018,Not captured,Not captured,863949,020,00072,ARS-01-0043532,Beacon International,Not captured,Not captured,Not captured,,,,Gorakine,Konstantin,,12/05/1970,male,Not captured,Not captured,Not captured,Not captured,Not captured,Not captured,Not captured,Not captured,Not captured,Not captured,Not captured,Not captured,Not captured,,,Not captured,Not captured,Not captured,Not captured,Not captured,39-22 Van Duren Ave,,Fair Lawn,New Jersey,07410,,,Not captured,Not captured,gorakin@hotmail.com,Not captured,201813234,,Not captured,Not captured,Not captured,Not captured,Not captured,Not captured,
Not captured,Not captured,08/14/2018,Not captured,Not captured,863949,020,00072,ARS-02-0043527,Beacon America,Not captured,Not captured,Not captured,Passport(085348194),,,PINO TEPEDINO,EDUARDO ANDRES,,03/08/2004,male,Not captured,Not captured,Not captured,Not captured,Not captured,Not captured,Not captured,Not captured,Not captured,Not captured,Not captured,Not captured,Not captured,Maria Pia Tepedino,MADRE,Not captured,Not captured,Not captured,Not captured,Not captured,Urb. San Miguel Calle Los Barrancos Sector La Esperanza TH 2/6,,Maturin,Monagas,6201,+584147666449,+584147666449,Not captured,Not captured,mpiatep@hotmail.com,Not captured,201813220,,Not captured,Not captured,Not captured,Not captured,Not captured,Not captured,
Not captured,Not captured,08/14/2018,Not captured,Not captured,863949,020,00072,ARS-01-0043524,Beacon International,Not captured,Not captured,Not captured,Passport(561470637),,,Hayn,Lyza,M,09/17/1992,female,Not captured,Not captured,Not captured,Not captured,Not captured,Not captured,Not captured,Not captured,Not captured,Not captured,Not captured,Not captured,Not captured,Krzyzstof Adamowski,fiance,Not captured,Not captured,Not captured,Not captured,Not captured,188 county road 101,,Mountain Home,Arkansas,72653,5124925759,,Not captured,Not captured,lyzahayn12@gmail.com,Not captured,201813192,,Not captured,Not captured,Not captured,Not captured,Not captured,Not captured,
Not captured,Not captured,08/14/2018,Not captured,Not captured,863949,020,00072,ARS-02-0043523,Beacon America,Not captured,Not captured,Not captured,,,,Rinn,Christopher,,03/02/1993,male,Not captured,Not captured,Not captured,Not captured,Not captured,Not captured,Not captured,Not captured,Not captured,Not captured,Not captured,Not captured,Not captured,,,Not captured,Not captured,Not captured,Not captured,Not captured,Box 131,,Langruth,Manitoba,R0h 0n0,,,Not captured,Not captured,crinb1@lsu.edu,Not captured,201813191,,Not captured,Not captured,Not captured,Not captured,Not captured,Not captured,
Not captured,Not captured,08/14/2018,Not captured,Not captured,863949,020,00072,ARS-01-0043521,Beacon International,Not captured,Not captured,Not captured,,,,Montero,Miguel,,05/03/1989,male,Not captured,Not captured,Not captured,Not captured,Not captured,Not captured,Not captured,Not captured,Not captured,Not captured,Not captured,Not captured,Not captured,,,Not captured,Not captured,Not captured,Not captured,Not captured,Bouwstraat 18 Bs,,Utrecht,,3572 sr,,,Not captured,Not captured,monter89@gmail.com,Not captured,201813189,,Not captured,Not captured,Not captured,Not captured,Not captured,Not captured,
Not captured,Not captured,08/14/2018,Not captured,Not captured,863949,020,00072,ARS-01-0043520,Beacon International,Not captured,Not captured,Not captured,,,,McMaster,Alexis,,05/25/1993,female,Not captured,Not captured,Not captured,Not captured,Not captured,Not captured,Not captured,Not captured,Not captured,Not captured,Not captured,Not captured,Not captured,,,Not captured,Not captured,Not captured,Not captured,Not captured,18168 Quinn Rd,,Chagrin Falls,Ohio,44023,,,Not captured,Not captured,hopelessly.quixotic@gmail.com,Not captured,201813186,,Not captured,Not captured,Not captured,Not captured,Not captured,Not captured,
Not captured,Not captured,08/14/2018,Not captured,Not captured,863949,020,00072,ARS-03-0043440,Essential America,Not captured,Not captured,Not captured,Passport(114080560),,,MORA,SHARON,,07/02/1989,female,Not captured,Not captured,Not captured,Not captured,Not captured,Not captured,Not captured,Not captured,Not captured,Not captured,Not captured,Not captured,Not captured,,,Not captured,Not captured,Not captured,Not captured,Not captured,LOMAS DE LA JOYA,,SAN JOSE DEL CABO,Baja California Sur,23400,6241608896,,Not captured,Not captured,sharonmora274@gmail.com,Not captured,201838867,,Not captured,Not captured,Not captured,Not captured,Not captured,Not captured,
Not captured,Not captured,08/14/2018,Not captured,Not captured,863949,020,00072,ARS-01-0043502,Beacon International,Not captured,Not captured,Not captured,Passport(PO1776073),,,Diban,Michel,,11/26/1948,male,Not captured,Not captured,Not captured,Not captured,Not captured,Not captured,Not captured,Not captured,Not captured,Not captured,Not captured,Not captured,Not captured,,,Not captured,Not captured,Not captured,Not captured,Not captured,2425 Wilson Blvd,,Arlington,Virginia,22201,7038415607,,Not captured,Not captured,dhernandez@ncsc.org,Not captured,201836552,,Not captured,Not captured,Not captured,Not captured,Not captured,Not captured,
Not captured,Not captured,08/14/2018,Not captured,Not captured,863949,020,00072,ARS-01-0043498,Beacon International,Not captured,Not captured,Not captured,Passport(536144315),,,Day,Phoebe,,11/03/2000,female,Not captured,Not captured,Not captured,Not captured,Not captured,Not captured,Not captured,Not captured,Not captured,Not captured,Not captured,Not captured,Not captured,CURE International,other,Not captured,Not captured,Not captured,Not captured,Not captured,405 St Johns Church,,Camp Hill,Pennsylvania,17011,717 724 4002,,Not captured,Not captured,beth.vanhall@cureinternational.org,Not captured,201836548,,Not captured,Not captured,Not captured,Not captured,Not captured,Not captured,
Not captured,Not captured,08/14/2018,Not captured,Not captured,863949,020,00072,ARS-01-0043497,Beacon International,Not captured,Not captured,Not captured,Passport(544071300),,,Reynolds,Bethan,,04/05/2001,female,Not captured,Not captured,Not captured,Not captured,Not captured,Not captured,Not captured,Not captured,Not captured,Not captured,Not captured,Not captured,Not captured,CURE International,other,Not captured,Not captured,Not captured,Not captured,Not captured,405 St Johns Church,,Camp Hill,Pennsylvania,17011,717 724 4002,,Not captured,Not captured,beth.vanhall@cureinternational.org,Not captured,201836547,,Not captured,Not captured,Not captured,Not captured,Not captured,Not captured,
Not captured,Not captured,08/14/2018,Not captured,Not captured,863949,020,00072,ARS-03-0043443,Essential America,Not captured,Not captured,Not captured,Passport(EA0830219),,,Wang,Jingxuan,,02/02/2004,male,Not captured,Not captured,Not captured,Not captured,Not captured,Not captured,Not captured,Not captured,Not captured,Not captured,Not captured,Not captured,Not captured,,,Not captured,Not captured,Not captured,Not captured,Not captured,1220 Winyah Drive,,Columbia,South Carolina,29203,803-530-5070,,Not captured,Not captured,xbhuang4@gmail.com,Not captured,201836436,,Not captured,Not captured,Not captured,Not captured,Not captured,Not captured,
Not captured,Not captured,08/14/2018,Not captured,Not captured,863949,020,00072,ARS-03-0043441,Essential America,Not captured,Not captured,Not captured,Passport(E51046934),,,Wang,Shiyuan,,04/11/2001,female,Not captured,Not captured,Not captured,Not captured,Not captured,Not captured,Not captured,Not captured,Not captured,Not captured,Not captured,Not captured,Not captured,,,Not captured,Not captured,Not captured,Not captured,Not captured,4811 Homeplace Dr,,Apex,North Carolina,27539,336-953-5029,,Not captured,Not captured,xbhuang4@gmail.com,Not captured,201838868,,Not captured,Not captured,Not captured,Not captured,Not captured,Not captured,
Not captured,Not captured,08/14/2018,Not captured,Not captured,863949,020,00072,ARS-02-0043493,Beacon America,Not captured,Not captured,Not captured,Passport(YA6605158),,,Minardi,Francesca,,10/19/1987,female,Not captured,Not captured,Not captured,Not captured,Not captured,Not captured,Not captured,Not captured,Not captured,Not captured,Not captured,Not captured,Not captured,Vilma Castagnini,Mother,Not captured,Not captured,Not captured,Not captured,Not captured,Via San Tomaso,,Medicina,Bologna,40059,00393337403279,,Not captured,Not captured,francesca.minardi87@gmail.com,Not captured,201836543,,Not captured,Not captured,Not captured,Not captured,Not captured,Not captured,
Not captured,Not captured,08/14/2018,Not captured,Not captured,863949,020,00072,ARS-01-0043489,Beacon International,Not captured,Not captured,Not captured,,,,Haim,Dean A ,,09/30/2000,male,Not captured,Not captured,Not captured,Not captured,Not captured,Not captured,Not captured,Not captured,Not captured,Not captured,Not captured,Not captured,Not captured,,,Not captured,Not captured,Not captured,Not captured,Not captured,2 White Lane,,Monroe,New York,08831,908-217-,,Not captured,Not captured,sharonhaim5@yahoo.com,Not captured,201836530,,Not captured,Not captured,Not captured,Not captured,Not captured,Not captured,
Not captured,Not captured,08/14/2018,Not captured,Not captured,863949,020,00072,ARS-01-0043265,Beacon International,Not captured,Not captured,Not captured,Passport(511659702),,,Klesack,Edward,R,10/20/1955,male,Not captured,Not captured,Not captured,Not captured,Not captured,Not captured,Not captured,Not captured,Not captured,Not captured,Not captured,Not captured,Not captured,Donna M Aber,sister,Not captured,Not captured,Not captured,Not captured,Not captured,2025 St. Rt. 511,,Perrysville,Ohio,44864,4193683220,,Not captured,Not captured,Raoule23@Yahoo.com,Not captured,201824163,,Not captured,Not captured,Not captured,Not captured,Not captured,Not captured,
Not captured,Not captured,08/14/2018,Not captured,Not captured,863949,020,00072,ARS-01-0043190,Beacon International,Not captured,Not captured,Not captured,,,,Berhe,Fireweyni,T,03/01/1969,female,Not captured,Not captured,Not captured,Not captured,Not captured,Not captured,Not captured,Not captured,Not captured,Not captured,Not captured,Not captured,Not captured,,,Not captured,Not captured,Not captured,Not captured,Not captured,Arbaete Asmara,,Asmara,,107,,,Not captured,Not captured,kikasem11@gmail.com,Not captured,201822573,,Not captured,Not captured,Not captured,Not captured,Not captured,Not captured,
Not captured,Not captured,08/14/2018,Not captured,Not captured,863949,020,00072,ARS-01-0041635,Beacon International,Not captured,Not captured,Not captured,,,,Smagulova,Sabina,,04/03/1990,female,Not captured,Not captured,Not captured,Not captured,Not captured,Not captured,Not captured,Not captured,Not captured,Not captured,Not captured,Not captured,Not captured,,,Not captured,Not captured,Not captured,Not captured,Not captured,4954 Hazeltine Ave Apt 18,,Sherman Oaks,California,91423,,,Not captured,Not captured,smagulova.sabina@gmail.com,Not captured,201807248,,Not captured,Not captured,Not captured,Not captured,Not captured,Not captured,
Not captured,Not captured,08/14/2018,Not captured,Not captured,863949,020,00072,OVI-28-0041621,OverseasCare Visitors Insurance Plan,Not captured,Not captured,Not captured,Passport(A07746853),,,azzam,islam,Nashaat Zaky,12/14/1973,female,Not captured,Not captured,Not captured,Not captured,Not captured,Not captured,Not captured,Not captured,Not captured,Not captured,Not captured,Not captured,Not captured,,,Not captured,Not captured,Not captured,Not captured,Not captured,72-200 Owl Drive,,Ottawa,Ontario,K1V9P7,8193292616,6135626262,Not captured,Not captured,islamazzam5@gmail.com,Not captured,201807195,,Not captured,Not captured,Not captured,Not captured,Not captured,Not captured,
Not captured,Not captured,08/19/2018,Not captured,Not captured,863949,020,00072,BG001030-23-dc813c10,International Assurance,Not captured,Not captured,Not captured,-,-,,Warner,James,,05/22/1951,male,Not captured,Not captured,Not captured,Not captured,Not captured,Not captured,Not captured,Not captured,Not captured,Not captured,Not captured,Not captured,Not captured,,,Not captured,Not captured,Not captured,Not captured,Not captured,563 E Pennsylvania Ave,,Van,Texas,	75790,	8006474589,,Not captured,Not captured,	Teams@nvm.org,Not captured,201813193,,Not captured,Not captured,Not captured,Not captured,Not captured,Not captured,
Not captured,Not captured,08/19/2018,Not captured,Not captured,863949,020,00072,BG001030-23-dc813c10,International Assurance,Not captured,Not captured,Not captured,-,-,,Warner,Cherilyn,,07/09/1950,male,Not captured,Not captured,Not captured,Not captured,Not captured,Not captured,Not captured,Not captured,Not captured,Not captured,Not captured,Not captured,Not captured,,,Not captured,Not captured,Not captured,Not captured,Not captured,563 E Pennsylvania Ave,,Van,Texas,	75790,	8006474589,,Not captured,Not captured,	Teams@nvm.org,Not captured,201813202,,Not captured,Not captured,Not captured,Not captured,Not captured,Not captured,
Not captured,Not captured,09/07/2018,Not captured,Not captured,863949,020,00072,BG001030-23-dc813c10,International Assurance,Not captured,Not captured,Not captured,-,-,,Rudkin,Jason,,06/11/1981,male,Not captured,Not captured,Not captured,Not captured,Not captured,Not captured,Not captured,Not captured,Not captured,Not captured,Not captured,Not captured,Not captured,,,Not captured,Not captured,Not captured,Not captured,Not captured,563 E Pennsylvania Ave,,Van,Texas,	75790,	8006474589,,Not captured,Not captured,	Teams@nvm.org,Not captured,201813207,,Not captured,Not captured,Not captured,Not captured,Not captured,Not captured,
Not captured,Not captured,09/10/2018,Not captured,Not captured,863949,020,00072,BG001030-23-dc813c10,International Assurance,Not captured,Not captured,Not captured,-,-,,Thompson,Mark ,,10/30/1957,male,Not captured,Not captured,Not captured,Not captured,Not captured,Not captured,Not captured,Not captured,Not captured,Not captured,Not captured,Not captured,Not captured,,,Not captured,Not captured,Not captured,Not captured,Not captured,563 E Pennsylvania Ave,,Van,Texas,	75790,	8006474589,,Not captured,Not captured,	Teams@nvm.org,Not captured,201813213,,Not captured,Not captured,Not captured,Not captured,Not captured,Not captured