Original Effective Date,Plan Type,Control,Suffix,Account,Policy Number,ID,EE SSN,Dependent SSN,Dependent Relationship,Last Name,First Name,Middle Initial,DOB,Gender,Address,State,City,Country,Postcode,Max/Ded,Premium,
08/07/2018,Beacon International,863949,020,00072,ARS-01-0043356,201838744,,,,Cannon,Jacob,Y,12/02/2000,male,12010 Titian Way,Maryland,Potomac,United States,20854-3343,$110000/$0,$11.88,
08/07/2018,Beacon International,863949,020,00072,ARS-01-0043352,201838726,,,,Idrovo,Maria,C,11/18/1978,female,4425 Harbor country drive A2,Washington,Gig Harbor,United States,98335,$60000/$250,$5.4,
08/07/2018,Beacon International,863949,020,00072,ARS-01-0043351,201838725,,,,Perez,Jorge,M,05/27/1977,male,4425 Harbor country drive A2,Washington,Gig Harbor,United States,98335,$60000/$250,$9,
08/07/2018,Beacon International,863949,020,00072,ARS-01-0043348,201838722,,,,Roach ,Annajak,J,08/04/2015,female,102 N Freeman St,California,Oceanside,Cambodia,92054,$110000/$100,$340.34,
08/07/2018,Beacon International,863949,020,00072,ARS-01-0043347,201838721,,,,Roach ,Eddie,D,09/16/1977,male,102 N Freeman St,California,Oceanside,Cambodia,92054,$110000/$100,$720.72,
08/07/2018,Beacon International,863949,020,00072,ARS-01-0043346,201838720,Passport(531050918),,,Roach ,Bethany,E,06/01/1984,female,102 N Freeman St,California,Oceanside,Cambodia,92054,$110000/$100,$432.43,
08/07/2018,Beacon International,863949,020,00072,ARS-01-0041034,201838712,,,,Patterson,Daniel,L,12/25/1987,male,305-136A Sandpiper Road,Alberta,Fort McMurray,Canada,T9K0J7,$1100000/$1000,$155.66,
08/07/2018,Beacon International,863949,020,00072,ARS-01-0041033,201876715,Passport(AB593905),,,McGean,Kelly,L,01/06/1987,female,305-136A Sandpiper Road,Alberta,Fort McMurray,Canada,T9K0J7,$1100000/$1000,$155.66,
08/07/2018,Beacon International,863949,020,00072,ARS-01-0043336,201825304,,,,Knoblowitz,Rachel,,01/17/1997,female,187 Williamsburg Lane,New Jersey,Lakewood,United States,08701,$2000000/$0,$12.3,
08/07/2018,Beacon International,863949,020,00072,ARS-01-0043335,201825303,,,,Kenigsberg,Pinchos ,,03/17/1996,male,187 Williamsburg Lane,New Jersey,Lakewood,United States,08701,$2000000/$0,$12.3,
08/06/2018,Beacon International,863949,020,00072,ARS-01-0043326,201823814,,,,Bershad,Tyler,,02/25/1994,male,1137 East Broadway,New York,Hewlett,United States,11557,$60000/$100,$12.54,
08/06/2018,Beacon International,863949,020,00072,ARS-01-0043325,201823813,,,,Aviv,Michal,,06/16/2008,female,529 5th street Brooklyn,New York,New York,United States,11215,$60000/$250,$5.46,
08/06/2018,Beacon International,863949,020,00072,ARS-01-0043324,201823807,,,,Ross,Geoffrey,,02/13/1967,male,458 N DOHENY DR # 792,California,WEST HOLLYWOOD,United States,90048-1737,$110000/$250,$111.74,
08/05/2018,Beacon International,863949,020,00072,ARS-01-0043323,201823804,,,,Rosen,Udi,,02/25/1977,female,6 Engelberg Terr,New Jersey,Lakewood,United States,08701,$1100000/$0,$25,
08/05/2018,Beacon International,863949,020,00072,ARS-01-0043322,201823803,,,,Ilowitz,Pearl,,02/25/1977,female,12 engelberg Terr,New Jersey,Lakewood,United States,08701,$2000000/$0,$37.25,
08/06/2018,Beacon International,863949,020,00072,ARS-01-0043321,201823800,,,,capoor,preeti,,11/26/1966,female,938 blyleven blvd,Ontario,mississauga,Canada,l5v2g5,$110000/$250,$33.22,
08/06/2018,Beacon International,863949,020,00072,ARS-01-0043320,201823799,,,,masrani,ragesh,,05/20/1959,male,938 blyleven blvd,Ontario,mississauga,Canada,l5v2g5,$110000/$250,$33.22,
08/07/2018,Beacon International,863949,020,00072,ARS-01-0043309,201823739,Passport(012495767),,,Pantic,Darija,,06/30/1979,female,Uzicka 36,Valjevo,Valjevo,Serbia,14000,$550000/$0,$43.88,
08/05/2018,Beacon International,863949,020,00072,ARS-01-0043308,201823736,,,,Benyamin-van der Steege,Lisette,M,08/21/1970,female,31667 Folkstone Drive,Michigan,Farmington,United States,48336,$60000/$250,$28.5,
08/05/2018,Beacon International,863949,020,00072,ARS-01-0043307,201823742,,,,Benyamin,Dean,N,09/24/1995,male,31667 Folkstone Drive,Michigan,Farmington,United States,48336,$60000/$250,$14.44,
08/05/2018,Beacon International,863949,020,00072,ARS-01-0043306,201823738,,,,Benyamin,Jeremy,R,09/13/1998,male,31667 Folkstone Drive,Michigan,Farmington,United States,48336,$60000/$250,$14.44,
08/05/2018,Beacon International,863949,020,00072,ARS-01-0043305,201823737,,,,Benyamin,Alon,D,11/18/2006,male,31667 Folkstone Drive,Michigan,Farmington,United States,48336,$60000/$250,$13.3,
08/05/2018,Beacon America,863949,020,00072,ARS-02-0043304,201823727,,,,Hirano,Nio,,04/23/2002,female,3 Old Farm Rd,New York,Scarsdale,United States,10583,$60000/$0,$41.51,
08/05/2018,Beacon America,863949,020,00072,ARS-02-0043303,201823724,,,,Marcial,Garbanzo Salas,,09/02/1980,male,Vive Sabanilla 355,,San Jos&eacute;,Costa Rica,NA,$60000/$250,$17.06,
08/07/2018,Beacon America,863949,020,00072,ARS-02-0043294,201824194,,,,Zhang,Wanqi,,01/17/2000,male,Dujuanshan East Street No.8 Nanshan,,Shenzhen,China,518053,$60000/$250,$9.92,
08/07/2018,Beacon America,863949,020,00072,ARS-02-0043293,201824193,,,,Hou,Yu,,05/10/1971,female,Dujuanshan East Street No.8 Nanshan,,Shenzhen,China,518053,$60000/$250,$19.6,
08/05/2018,Beacon America,863949,020,00072,ARS-02-0043292,201824192,,,,Quan,Chenjiayu,,07/06/2005,male,680 E ALOSTA AVE,CALIFORNIA,AZUSA,United States,91702,$550000/$100,$30.8,
08/05/2018,Beacon America,863949,020,00072,ARS-02-0043291,201824191,,,,Yang,Fengrui,,09/26/2005,male,680 e alosta ave,CALIFORNIA,AZUSA,United States,91702,$550000/$100,$30.8,
08/05/2018,Beacon America,863949,020,00072,ARS-02-0043290,201824190,,,,Ma,Haijing,,02/15/1983,male,680 e alosta ave,CALIFONRIA,AZUSA,United States,91702,$550000/$100,$39.73,
08/05/2018,Beacon America,863949,020,00072,ARS-02-0043289,201824189,,,,Jiang,Qingjing ,,05/25/1985,male,680 e alosta ave,CALIFORNIA,AZUSA,United States,91702,$550000/$100,$39.73,
08/05/2018,Beacon America,863949,020,00072,ARS-02-0043288,201824188,,,,Jiang,Qinglin,,07/01/2005,male,680 e alosta ave,California,AZUSA,United States,91702,$550000/$100,$30.8,
08/05/2018,Beacon America,863949,020,00072,ARS-02-0043287,201824185,,,,jin,Zeshuai ,,01/27/2002,male,680 e alosta ave,CALIFNORia,azusA,United States,91702,$550000/$100,$13.2,
08/05/2018,Beacon America,863949,020,00072,ARS-02-0043286,201824184,,,,Sun,Jiaming,,05/19/2002,male,680 E ALOSTA AVE,California,AZUSA,United States,91702,$550000/$100,$13.2,
08/05/2018,Beacon America,863949,020,00072,ARS-02-0043285,201824183,,,,Li,Jingfan,,03/18/2002,male,680 e alosta ave,CALIFORNIA,AZUSA,United States,91702,$550000/$100,$13.2,
08/05/2018,Beacon America,863949,020,00072,ARS-02-0043284,201824182,,,,Wang,Xingjian,,06/01/2002,male,680 e alosta ave,CALIFORNIA,AZUSA,United States,91702,$550000/$100,$13.2,
08/05/2018,Beacon America,863949,020,00072,ARS-02-0043283,201824181,,,, Hongping Sun,Jackson,,01/12/1985,male,680 E ALOSTA AVE,CALIFORNIA,AZUSA,United States,91702,$550000/$100,$31.22,
08/05/2018,Beacon America,863949,020,00072,ARS-02-0043282,201824180,,,,Xiao,Jing,,12/01/2001,male,680 e alosta ave,CALIFORNIA,AZUSA,United States,91702,$550000/$100,$30.8,
08/05/2018,Beacon America,863949,020,00072,ARS-02-0043281,201824179,,,,Huang,Mengsi,,02/16/2000,male,680 e alosta ave,CALIFORNIA,AZUSA,United States,92376,$550000/$100,$33.57,
08/05/2018,Beacon America,863949,020,00072,ARS-02-0043280,201824178,,,,Shen,Shuwen,,11/20/1986,female,680 e alosta ave,CALIFORNIA,AZUSA,United States,91702,$550000/$100,$39.73,
08/05/2018,Beacon America,863949,020,00072,ARS-02-0043279,201824177,,,,Chen,yanlong,,12/28/2013,male,680 E ALOSTA AVE,CALIFORNIA,AZUSA,United States,91702,$550000/$100,$30.8,
08/05/2018,Beacon America,863949,020,00072,ARS-02-0043278,201824176,,,,Zhao,Junying,,11/28/1988,female,680 e alosta ave,califorNIA,AZUSA,United States,91702,$550000/$100,$33.57,
08/05/2018,Beacon America,863949,020,00072,ARS-02-0043277,201824175,,,,Zheng,Hanzhe,,11/04/2013,male,680 e alosta ave,CALIFORNIA,AZUSA,United States,91702,$550000/$100,$30.8,
08/05/2018,Beacon America,863949,020,00072,ARS-02-0043276,201824174,,,,Chen,Cuilin,,08/24/1977,male,680 e alosta ave,CALIFORNNIA,AZUSA,United States,91702,$550000/$100,$61.6,
08/05/2018,Beacon America,863949,020,00072,ARS-02-0043275,201824173,,,,Chen,Yizheng,,05/21/2000,female,680 e alosta ave,CALIFORNIA,AZUSA,United States,91702,$550000/$100,$33.57,
08/05/2018,Beacon America,863949,020,00072,ARS-02-0043272,201824170,,,,Chen,Zixi,,07/05/2005,male,680 e alosta ave,,AZUSA,United States,91702,$550000/$100,$30.8,
08/05/2018,Beacon America,863949,020,00072,ARS-02-0043271,201824169,,,,Huang,Jinxing,,03/13/2005,male,680 e alosta ave,CALIFORNIA,AZUSA,United States,91702,$550000/$100,$30.8,
08/05/2018,Beacon America,863949,020,00072,ARS-02-0043270,201824168,,,,KHANNA,SAHIL,,03/27/1998,male,680 e alosta ave,CALIFORNIA,AZUSA,United States,92376,$550000/$100,$33.57,
08/05/2018,Beacon America,863949,020,00072,ARS-02-0043269,201824167,,,,Xiao,Yuxiang,,01/31/2000,male,680 e alosta ave,California,Azusa,United States,91702,$550000/$100,$33.57,
08/05/2018,Beacon America,863949,020,00072,ARS-02-0043268,201824166,,,,ZHANG,CHUNLIN,,01/01/2000,female,680 e alosta ave,California,AZUSA,United States,91702,$550000/$100,$33.57,
08/05/2018,Beacon America,863949,020,00072,ARS-02-0043267,201824165,,,,Sun,Yanni,,05/23/1982,female,680 e alosta ave,CALIFORNIA,AZUSA,United States,91702,$550000/$100,$45.41,
08/05/2018,Beacon America,863949,020,00072,ARS-02-0043266,201824164,,,,Zhang,Xueyun,,01/18/1996,female,680 e alosta ave,california,azusa,United States,91702,$550000/$100,$33.57,
08/03/2018,Beacon America,863949,020,00072,ARS-02-0043263,201824065,Passport(L4710808),,,Doppalapudi,Taraka,N,03/11/1993,male,200 20th Street,,Butner,United States,27509,$1100000/$250,$866.32,
08/06/2018,Beacon International,863949,020,00072,ARS-01-0043261,201824063,,,,OBRIEN,DIANA,,12/22/1986,female,2425 Wilson Blvd. Suite 350,,Arlington,United States,22201,$60000/$0,$5.63,
08/06/2018,Beacon International,863949,020,00072,ARS-01-0043260,201824062,,,,MCLEAN,ADRIAN,,05/24/1984,male,2425 Wilson Blvd. Suite 350,,Arlington,United States,22201,$60000/$0,$5.63,
08/03/2018,Beacon International,863949,020,00072,ARS-01-0043258,201824060,,,,cook,steven,,09/23/1956,male,318 east 70th street,New York,new york,United States,10021,$110000/$250,$658.8,
08/05/2018,Beacon International,863949,020,00072,ARS-01-0043257,201824059,,,,Chung,Sarah,,11/01/1981,female,1019 Beacon Street,Massachusetts,Brookline,United States,02446,$1100000/$500,$70.79,
08/06/2018,Beacon America,863949,020,00072,ARS-02-0043254,201824052,Passport(na),,,Parra Ortiz,Luis Alberto,,08/02/1994,male,National Center for State Courts,Distrito Capltal de Santa Fe de Bogot&atilde;,Bogota,Colombia,na,$550000/$0,$191.3,
08/03/2018,Beacon International,863949,020,00072,ARS-01-0043253,201824051,Passport(124448241),,,Domador,Cristina,,09/13/1991,female,Crisaldomal@gmail.com,Monagas,Maturin,Venezuela,6201,$1100000/$0,$22.13,
08/03/2018,Beacon America,863949,020,00072,ARS-02-0043252,201824050,,,,Berendsen,Matthew,A,09/04/1995,male,46 Armstrong Avenue,,Gerringong,Australia,2534,$60000/$250,$141.86,
08/03/2018,Beacon International,863949,020,00072,ARS-01-0043251,201824049,,,,Blackburn,Robyn,,03/15/1975,female,205 West 88th Street Apt 15A,New York,New York,United States,10024,$60000/$250,$16.5,
08/03/2018,Beacon America,863949,020,00072,ARS-02-0043250,201824048,,,,Harnett,Jaelen,,08/30/2005,male,240 Meeker Ave Apt 52,New York,Brooklyn,United States,11211,$60000/$0,$7.19,
08/03/2018,Beacon America,863949,020,00072,ARS-02-0043249,201824048,,,,Harnett,Julia,,03/26/1984,female,240 Meeker Ave Apt 52,New York,Brooklyn,United States,11211,$60000/$0,$10.25,
08/06/2018,Beacon America,863949,020,00072,ARS-02-0043248,201824045,Passport(M2740221),,,Balamitran,Lalitha,,05/06/1944,female,41686 Meiggs Street,California,Fremont,United States,94538,$50000/$250,$446.4,
08/03/2018,Beacon International,863949,020,00072,ARS-01-0043246,201824043,,,,THompson,Amy,,09/20/1965,female,815 Dewey Ave #4,Colorado,Boulder,United States,80304,$550000/$500,$115.31,
08/02/2018,Beacon International,863949,020,00072,ARS-01-0043244,201824041,,,,Stuhr,Krystalyn,,12/28/1984,female,1201 N Kensington st,Virginia,Arlington,United States,22205,$60000/$250,$6.3,
08/06/2018,Beacon America,863949,020,00072,ARS-02-0043243,201824040,,,,Scollie,William,,12/03/1941,male,2215 Gregor Road,Ontario,Thunder Bay,Canada,P7J 1E1,$50000/$250,$36,
08/02/2018,Beacon International,863949,020,00072,ARS-01-0043241,201824038,,,,ALLASON,THOMAS,,08/29/1980,male,6240 E MERCER WAY,Washington,MERCER ISLAND,United States,98040,$550000/$250,$205.2,
08/02/2018,Beacon International,863949,020,00072,ARS-01-0043240,201824037,,,,Nabiulina,Anna,,08/02/1991,female,6240 E MERCER WAY,Washington,MERCER ISLAND,United States,98040,$550000/$250,$167.2,
08/04/2018,Beacon International,863949,020,00072,ARS-01-0043234,201823999,Passport(112965723),,,mendoza leal,yusely alexandra,,07/30/1989,female,119-40UNION TPKE APT. 3B KEW GARDEN NEW YORK,New York,KEW GARDENS,Venezuela,11415,$110000/$0,$15.44,
08/02/2018,Beacon America,863949,020,00072,ARS-02-0043232,201823997,,,,Groo,Noach,,04/27/2017,male,51 South Bell Ave,New Jersey,Lakewood,United States,08701,$110000/$0,$8.75,
08/02/2018,Beacon America,863949,020,00072,ARS-02-0043231,201823987,,,,Gross,Yitzchok,,07/10/1992,male,51 South Bell Ave,New Jersey,Lakewood,United States,08701,$110000/$0,$9.63,
08/02/2018,Beacon America,863949,020,00072,ARS-02-0043230,201823986,Passport(492472437),,,Gross,Deena,,05/17/1994,female,51 South Bell Ave,New Jersey,Lakewood,United States,08701,$110000/$0,$9.63,
08/02/2018,Beacon International,863949,020,00072,ARS-01-0043228,201823757,,,,Berreta,Graziella,f,10/14/1970,female,11370 NW 83rd wy,Florida,Doral,United States,33178,$60000/$250,$21,
08/02/2018,Beacon America,863949,020,00072,ARS-02-0043227,201823754,,,,Kett,Hannah,A,12/11/1993,female,43 Pykes Down,,Ivybridge,United Kingdom,PL210BY,$60000/$0,$24.8,
08/02/2018,Beacon America,863949,020,00072,ARS-02-0043226,201823753,,,,Kawabata,Mia,,05/31/2010,female,Beya Koyoen House 1F,,Nishonomiya,Japan,662-0014,$60000/$250,$33.35,
08/02/2018,Beacon America,863949,020,00072,ARS-02-0043225,201823749,,,,Kawabata,Yuko,,05/26/1970,female,Beya Koyoen House 1F,,Nishonomiya,Japan,662-0014,$60000/$250,$71.05,
08/03/2018,Beacon America,863949,020,00072,ARS-02-0043224,201823748,Passport(122697865),,,Toledo,Andres ,M,03/02/1948,male,3910 N Fremont St,Illinois,Chicago,United States,60613,$50000/$500,$155.52,
08/03/2018,Beacon America,863949,020,00072,ARS-02-0043223,201823720,Passport(P676385),,,Toledo ,Miguel ,A,02/18/1999,male,3910 N Fremont St,Illinois,Chicago,United States,60613,$110000/$500,$33.26,
08/02/2018,Beacon International,863949,020,00072,ARS-01-0043222,201823717,,,,Major,Elke,I,10/20/1965,female,2031 252nd St NW,Washington,Stanwood,United States,98292,$60000/$250,$28.6,
08/03/2018,Beacon International,863949,020,00072,ARS-01-0042728,201823668,,,,McDonald,Owen,K,08/13/2012,male,274 1st Ave Apt 1G,New York,New York,United States,10009,$1100000/$500,$4.95,
08/03/2018,Beacon International,863949,020,00072,ARS-01-0042727,201823651,,,,Kaufman,Pamela,,02/22/1965,female,274 1st Ave Apt 1G,New York,New York,United States,10009,$1100000/$500,$14.13,
08/03/2018,Beacon International,863949,020,00072,ARS-01-0042726,201823643,,,,McDonald,Marcus,D,02/08/1961,male,274 1st Ave Apt 1G,New York,New York,United States,10009,$1100000/$500,$14.13,
08/03/2018,Beacon International,863949,020,00072,ARS-01-0042592,201822193,,,,McDonald,Alec,K,10/16/2007,male,274 1st Avenue 1G,New York,New York,United States,10009,$1100000/$1000,$6.76,
08/01/2018,Beacon America,863949,020,00072,ARS-02-0043218,201870113,,,,Hauer,Epfraim,,08/01/2009,male,142 pine Street,New Jersey,Lakewood,United States,08701,$1100000/$0,$22.5,
08/01/2018,Beacon America,863949,020,00072,ARS-02-0043217,201870112,,,,Hauer,Yitzchok,,11/20/2010,male,142 pine Street,New Jersey,Lakewood,United States,08701,$1100000/$0,$22.5,
08/01/2018,Beacon America,863949,020,00072,ARS-02-0043216,201870111,,,,Hauer,Yosef,,08/17/2014,male,142 pine Street,New Jersey,Lakewood,United States,08701,$1100000/$0,$22.5,
08/01/2018,Beacon America,863949,020,00072,ARS-02-0043215,201870110,,,,Hauer,Elisheva,,08/05/1987,female,142 pine Street,New Jersey,Lakewood,United States,08701,$1100000/$0,$33.98,
08/01/2018,Beacon America,863949,020,00072,ARS-02-0043214,201870109,,,,Hauer,Akiva,,08/17/1983,male,142 pine Street,New Jersey,Lakewood,United States,08701,$1100000/$0,$33.98,
08/01/2018,Beacon International,863949,020,00072,ARS-01-0043207,201870101,,,,Jebali,Zied,,11/30/1995,male,3421 Drummond,Quebec,Montreal,Canada,H3G1X7,$60000/$100,$39.29,
08/01/2018,Beacon International,863949,020,00072,ARS-01-0043205,201870099,,,,Diaz,Jose,E,10/11/1948,male,9652 Ridgecrest Court,Florida,Davie,United States,33328,$60000/$250,$19.4,
08/06/2018,Beacon International,863949,020,00072,ARS-01-0043203,201870095,,,,Weldegerges,Almaz,G,06/27/1967,female,Kushet,,Asmara,Eritrea,107,$60000/$250,$20.8,
08/01/2018,Beacon International,863949,020,00072,ARS-01-0043199,201822584,,,,McErlain,Stephen,E,04/08/1944,male,167 Raff Ave,New York,Floral Park,United States,11001,$50000/$0,$64.69,
08/01/2018,Beacon International,863949,020,00072,ARS-01-0043192,201822575,,,,Sorscher,William,,02/16/1961,male,1985 S. Ocean Drive,Florida,Hallendale Beach,United States,33009,$1100000/$250,$21.98,
08/07/2018,Beacon International,863949,020,00072,ARS-01-0043189,201822572,,,,Measho,Tsega,A,01/01/1982,female,Dekemhare,,Dekemhare,Eritrea,1198,$60000/$250,$7.2,
08/01/2018,Beacon International,863949,020,00072,ARS-01-0043188,201822400,,,,MOLENAAR,ISABELLE,T,07/06/1999,female,303 West 80th Place,Indiana,MERRILLVILLE,United States,46410,$60000/$250,$7.6,
08/01/2018,Beacon International,863949,020,00072,ARS-01-0043187,201822399,,,,ROT,SANDRA,J,05/29/1959,female,303 West 80th Place,Indiana,MERRILLVILLE,United States,46410,$60000/$250,$26,
08/01/2018,Beacon International,863949,020,00072,ARS-01-0043186,201822396,,,,ROT,MARK,A,10/28/1958,male,303 West 80th Place,Indiana,MERRILLVILLE,United States,46410,$60000/$250,$26,
08/01/2018,Beacon International,863949,020,00072,ARS-01-0043185,201822395,,,,VANCUREN,KIMBERLY,A,08/02/1968,female,303 West 80th Place,Indiana,MERRILLVILLE,United States,46410,$60000/$250,$15,
08/01/2018,Beacon International,863949,020,00072,ARS-01-0043183,201822391,,,,WAECHTER,AUSTIN,M,05/05/1999,male,303 West 80th Place,Indiana,MERRILLVILLE,United States,46410,$60000/$250,$7.6,
08/01/2018,Beacon International,863949,020,00072,ARS-01-0043182,201822313,,,,WIERSEMA,CHAD,R,01/22/1977,male,303 West 80th Place,Indiana,MERRILLVILLE,United States,46410,$60000/$250,$15,
08/01/2018,Beacon International,863949,020,00072,ARS-01-0043181,201822312,,,,Mendlowitz,Toby,,09/14/1993,female,99 Forest Way,New York,Monroe,United States,10950,$60000/$0,$6.65,
08/02/2018,Beacon International,863949,020,00072,ARS-01-0043180,201822311,,,,Mendlowitz,Joel,,09/28/1993,male,99 Forest Way,New York,Monroe,United States,10950,$60000/$0,$5.7,
08/01/2018,Beacon International,863949,020,00072,ARS-01-0043179,201821780,,,,NAVARRETTE,BLANCA,E,01/02/1957,female,303 West 80th Place,Indiana,MERRILLVILLE,United States,46410,$60000/$250,$32.5,
08/01/2018,Beacon International,863949,020,00072,ARS-01-0043178,201821777,,,,CARTER,TYLER,M,05/16/1981,male,303 West 80th Place,Indiana,MERRILLVILLE,United States,46410,$60000/$250,$9,
08/01/2018,Beacon International,863949,020,00072,ARS-01-0043177,201821776,,,,ZIMMERMAN,CARA,M,01/24/1989,female,303 West 80th Place,Indiana,MERRILLVILLE,United States,46410,$60000/$250,$7.6,
08/01/2018,Beacon International,863949,020,00072,ARS-01-0043176,201821775,,,,WEDDING,COREY,E,12/20/1968,male,303 West 80th Place,Indiana,MERRILLVILLE,United States,46410,$60000/$250,$15,
08/01/2018,Beacon International,863949,020,00072,ARS-01-0043174,201821751,,,,PAZDER,TRISTA,E,02/16/1991,female,303 West 80th Place,Indiana,MERRILLVILLE,United States,46410,$60000/$250,$7.6,
08/01/2018,Beacon International,863949,020,00072,ARS-01-0043172,201821695,,,,WEDDING,COREY,L,12/20/1968,male,303 West 80th Place,Indiana,MERRILLVILLE,United States,46410,$60000/$250,$15,
08/02/2018,Beacon International,863949,020,00072,ARS-01-0043169,201821495,,,,Mendlowitz,Toby,,09/14/1993,female,99 Forest Way,New York,Monroe,United States,10950,$60000/$0,$5.7,
08/02/2018,Beacon International,863949,020,00072,ARS-01-0043168,201821494,,,,Mendlowitz,Joel,,09/28/1993,male,99 Forest Way,New York,Monroe,United States,10950,$60000/$0,$5.7,
08/01/2018,Beacon International,863949,020,00072,ARS-01-0043162,201821403,,,,Byrd,Linda,A,05/02/1951,female,1355 Commerce Drive Apt 108,,Auburn,United States,36830,$60000/$250,$120.28,
08/01/2018,Beacon International,863949,020,00072,ARS-01-0043161,201821415,Passport(512381566),,,Byrd,Terry,A,07/15/1950,male,1355 Commerce Drive Apt 108,,Auburn,United States,36830,$60000/$250,$120.28,
08/01/2018,Beacon America,863949,020,00072,ARS-02-0038362,201874507,,,,Kapurova,Maryna,,11/11/1986,female,113 I Travnya Street,,Pryluky,Ukraine,17500,$60000/$0,$365.11,
08/04/2018,Beacon International,863949,020,00072,ARS-01-0043159,201813083,,,,Stevenson,Kassia,G,06/05/2000,female,48 Homewood Ave.,Ontario,Hamilton,Canada,L8P2M2,$110000/$0,$478.57,
08/01/2018,Beacon America,863949,020,00072,ARS-02-0043155,201813080,Passport(AU858278),,,ORTEGA,ROBERTO ,,11/19/1984,male,KILOMETRO 6 VEREDA MUESES POTOSI,Nari&ntilde;o,POTOSI,Colombia,00000,$550000/$0,$16.13,
08/01/2018,Beacon America,863949,020,00072,ARS-02-0043154,201813079,Passport(AU846535),,,NARANJO,ANDRES,A.,03/08/1991,male,CARRERA 3E#16B-08,Nari&ntilde;o,PASTO,Colombia,00000,$550000/$0,$13.63,
08/01/2018,Beacon America,863949,020,00072,ARS-02-0043151,201813076,Passport(A14886176),,,AbdElWahab,Shadia,,09/15/1949,female,291 FAIRMEADOW WAY,California,MILPITAS,United States,95035,$550000/$500,$626.54,
08/04/2018,Beacon International,863949,020,00072,ARS-01-0043150,201813075,,,,Grogan,Miyuki,O,05/06/1971,female,6987 Penkridge Lane,Florida,Windermere,United States,34786,$110000/$250,$14.4,
08/05/2018,Beacon International,863949,020,00072,ARS-01-0043148,201813032,,,,RAMIREZ,WILLIAM,,08/23/1982,male,2425 Wilson Blvd. Suite 350,Virginia,Arlington,United States,22201,$60000/$0,$31.5,
08/06/2018,Beacon International,863949,020,00072,ARS-01-0043147,201813031,,,,SOOKRAM,STEPHEN,,12/11/1952,male,2425 Wilson Blvd. Suite 350,,Arlington,United States,22201,$60000/$0,$24.25,
08/06/2018,Beacon International,863949,020,00072,ARS-01-0043146,201813028,,,,GASPARD,ROGER,,03/24/1963,male,2425 Wilson Blvd. Suite 350,,Arlington,United States,22201,$60000/$0,$16.25,
08/06/2018,Beacon International,863949,020,00072,ARS-01-0043145,201813027,,,,FREDERICK,RAY,,03/02/1979,male,2425 Wilson Blvd. Suite 350,,Arlington,United States,22201,$60000/$0,$5.63,
08/06/2018,Beacon International,863949,020,00072,ARS-01-0043144,201813026,,,,ARCHER,DOUGLAS,,12/16/1964,male,2425 Wilson Blvd. Suite 350,,Arlington,United States,22201,$60000/$0,$16.25,
08/01/2018,Beacon America,863949,020,00072,ARS-02-0035579,201813025,Passport(7291611421),,,Shilnikova,Galina,,07/29/1952,female,6076 Desert Star Lane,Utah,Herriman,United States,84096,$1100000/$2500,$96.6,
08/01/2018,Beacon International,863949,020,00072,ARS-01-0043143,201813021,Passport(AQ035603),,,Bolivar,Diego,,05/02/1980,male,2425 Wilson Blvd,Virginia,Arlington,Colombia,22201,$60000/$0,$19.13,
08/05/2018,Beacon International,863949,020,00072,ARS-01-0043139,201812998,,,,ARROYAVE,ANDRES,,10/20/1982,male,2425 Wilson Blvd. Suite 350,,Arlington,United States,22201,$60000/$0,$31.5,
08/05/2018,Beacon International,863949,020,00072,ARS-01-0043138,201812997,,,,PEREA,JHAN,,09/13/1994,male,2425 Wilson Blvd. Suite 350,,Arlington,United States,22201,$60000/$0,$26.6,
08/05/2018,Beacon International,863949,020,00072,ARS-01-0043137,201812996,,,,ESCOBAR,ANDRES,,12/31/1989,male,2425 Wilson Blvd. Suite 350,,Arlington,United States,22201,$60000/$0,$26.6,