Original Effective Date,Plan Type,Control,Suffix,Account,Policy Number,ID,EE SSN,Dependent SSN,Dependent Relationship,Last Name,First Name,Middle Initial,DOB,Gender,Address,State,City,Country,Postcode,Max/Ded,Premium,
07/22/2018,Beacon International,863949,020,00072,ARS-01-0042959,201891078,,,,Schapira,Lydia,,09/30/1946,female,2421 Glenview Rd,Illinois,Glenview,United States,60025,$50000/$250,$322,
07/22/2018,Beacon International,863949,020,00072,ARS-01-0042958,201891077,,,,Lukasiewicz Elharrar,Adam,,02/24/2016,male,142 7TH AVE APT 2,New York,Brooklyn,United States,11215,$60000/$0,$12.25,
07/22/2018,Beacon International,863949,020,00072,ARS-01-0042957,201891076,,,,Lukasiewicz,Karolina,J,01/28/1980,female,142 7TH AVE APT 2,New York,Brooklyn,United States,11215,$60000/$0,$15.75,
07/22/2018,Beacon International,863949,020,00072,ARS-01-0042956,201891075,,,,Elharrar,Dan,,07/10/1980,male,142 7TH AVE APT 2,New York,Brooklyn,United States,11215,$60000/$0,$15.75,
07/22/2018,Beacon America,863949,020,00072,ARS-02-0042955,201891074,Passport(N1069802),,,Devi,Luxmi,,11/06/1951,female,3019 Tonopah cir,California,pleasanton,United States,94588,$110000/$1000,$957.44,
07/21/2018,Beacon America,863949,020,00072,ARS-02-0042951,201891068,,,,Thompson,Kenneth,E,11/09/1984,male,22828 NE 61st Streeet,Washington,Redmond,United States,98053,$110000/$250,$13.52,
07/21/2018,Beacon International,863949,020,00072,ARS-01-0042949,201891066,,,,Lipp,Murray,,07/24/1976,male,232 East 116th Street Apt 26,New York,New York,United States,10029,$110000/$250,$30.6,
07/21/2018,Beacon America,863949,020,00072,ARS-02-0042946,201891059,,,,Korhonen,Gordon,C,03/01/1940,male,6601 E US Hwy 60 ,Arizona,Gold Canyon,United States,85118,$50000/$250,$86.4,
07/21/2018,Beacon America,863949,020,00072,ARS-02-0042945,201891058,,,,Korhonen,Brenda,J,04/12/1942,female,6601 E US Hwy 60 ,Arizona,Gold Canyon,United States,85118,$50000/$250,$86.4,
07/21/2018,Beacon International,863949,020,00072,ARS-01-0042943,201891056,,,,Aviv,Neta,,04/29/2004,female,529 5th street Brooklyn,New York,New York,United States,11215,$60000/$250,$17.94,
07/21/2018,Beacon International,863949,020,00072,ARS-01-0038129,201891055,Passport(577033219),,,Harth,Julia,Tydings,03/07/1997,female,114 Canterbury Place,Mississippi,Ridgeland,United States,39157,$1100000/$0,$10.33,
07/20/2018,Beacon International,863949,020,00072,ARS-01-0042941,201890917,,,,Brady,Jake,P,12/25/1970,male,2959 Sequoia Lane,Florida,Sarasota,United States,34237,$60000/$250,$36,
07/20/2018,Beacon International,863949,020,00072,ARS-01-0042940,201890916,,,,Chase,Susannah,K,02/03/1976,female,2959 Sequoia Lane,Florida,Sarasota,United States,34237,$60000/$250,$36,
07/20/2018,Beacon International,863949,020,00072,ARS-01-0042926,201890719,,,,DOMINGUEZ,JULIE,A,01/18/1975,female,5290 SW 64TH CT,Florida,MIAMI,United States,33155,$1100000/$0,$12.5,
07/20/2018,OverseasCare Visitors Insurance Plan,863949,020,00072,OVI-28-0042924,201890717,Passport(J1686029),,,JETHWANI,RUKMANI,K,12/24/1947,female,2634 DORAY CIRCLE,California,MONROVIA,United States,91016,$110000/$500,$278.46,
07/20/2018,Beacon International,863949,020,00072,ARS-01-0042922,201890715,,,,Christian,Isabella,A,09/22/2001,female,9805 NE 116th St,Washington,Kirkland,United States,98034,$1100000/$250,$29.7,
07/20/2018,Beacon International,863949,020,00072,ARS-01-0042921,201890714,,,,Leseberg,Phillipa,,05/08/1964,female,9805 NE 116th St,Washington,Kirkland,United States,98034,$1100000/$250,$84.78,
07/20/2018,Beacon International,863949,020,00072,ARS-01-0042920,201890698,,,,Hotard,Concordia,,11/03/1995,female,1067 Harbourview Circle,Florida,Pensacola,United States,32507,$60000/$250,$22.8,
07/20/2018,Beacon International,863949,020,00072,ARS-01-0042919,201890697,,,,Wyatt,Matthew,,07/10/1996,male,1067 Harbourview Circle,Florida,Pensacola,United States,32507,$60000/$250,$22.8,
07/20/2018,Beacon International,863949,020,00072,ARS-01-0042918,201890696,,,,Banh,Victoria,,01/21/1988,female,2535 Modugno,Quebec,Montreal,Canada,H7M 1M9,$60000/$250,$13.5,
07/20/2018,Beacon International,863949,020,00072,ARS-01-0042917,201890695,,,,Nguyen,Daniel,,09/02/1988,male,2535 Modugno,Quebec,Montreal,Canada,H7M 1M9,$60000/$250,$11.4,
07/20/2018,Beacon International,863949,020,00072,ARS-01-0042915,201890684,,,,Stewart,Elizabeth,,01/18/1994,female,315 1st Ave N,Washington,Seattle,United States,98109,$60000/$250,$19.76,
07/20/2018,Beacon International,863949,020,00072,ARS-01-0042914,201890683,,,,Wilson,Justin,,01/10/1989,male,315 1st Ave N,Washington,Seattle,United States,98109,$60000/$250,$19.76,
07/20/2018,Beacon International,863949,020,00072,ARS-01-0042913,201890682,,,,Liu,Jeffrey,,08/20/1957,male,2110 Harbourside Drive,Florida,Longboat Key,United States,34228,$60000/$250,$32.5,
07/19/2018,Beacon International,863949,020,00072,ARS-01-0042910,201890678,,,,Pulido,Andrea,,07/21/2003,female,2838 Brickell Ave,Florida,Miami,United States,33129,$60000/$250,$30.42,
07/19/2018,Beacon America,863949,020,00072,ARS-02-0042907,201890347,,,,LUSH,JAMES,T,02/08/1971,male,605 whisper woods drive,British Columbia,lakeland,Canada,33813,$60000/$100,$250.64,
07/19/2018,Beacon International,863949,020,00072,ARS-01-0042901,201890313,,,,Burke,Daniel,L,07/17/1991,male,8429 Willow Forge Rd.,Virginia,Springfield,United States,22152,$60000/$250,$3.8,
07/19/2018,Beacon America,863949,020,00072,ARS-02-0042898,201890308,Passport(E4029190),,,Davis,Emma,,09/15/1981,female,7095 Hollywood Boulevard,California,Los Angeles,United States,90028,$110000/$0,$273,
07/20/2018,Beacon International,863949,020,00072,ARS-01-0042889,201890295,,,,Revelo,Tania,,06/17/1967,female,401 E Las Olas Bldv,Florida,Fort Lauderdale,United States,33301,$60000/$1000,$131.04,
07/20/2018,Beacon International,863949,020,00072,ARS-01-0042888,201890294,Passport(14534585),,,Morar,Lorin,,01/21/1972,male,401 E Las Olas Bldv,Florida,Fort Lauderdale,United States,33301,$60000/$1000,$75.6,
07/19/2018,Beacon International,863949,020,00072,ARS-01-0042882,201890102,Passport(480462459),,,Curry,Kaitlyn,,07/31/1994,female,4311 Newman Rd,Missouri,Joplin,United States,64801,$110000/$100,$12.54,
07/19/2018,Beacon International,863949,020,00072,ARS-01-0042880,201890100,Passport(524124745),,,Larimer,Caitlin,,03/12/1995,female,4311 Newman Rd,Missouri,Joplin,United States,64801,$110000/$100,$12.54,
07/18/2018,Beacon International,863949,020,00072,ARS-01-0042877,201890097,,,,Beck,Denise,,04/30/1977,female,4311 Newman Rd,Missouri,Joplin,United States,64801,$110000/$100,$25.74,
07/18/2018,Beacon International,863949,020,00072,ARS-01-0042876,201890096,Passport(50606287),,,Beck,Joshua,,02/09/1977,male,4311 Newman Rd,Missouri,Joplin,United States,64801,$110000/$100,$25.74,
07/18/2018,Beacon International,863949,020,00072,ARS-01-0042874,201890092,Passport(514673096),,,Furst,Jesse,,12/15/1994,female,4311 Newman Rd,Missouri,Joplin,United States,64801,$110000/$100,$13.59,
07/19/2018,Beacon International,863949,020,00072,ARS-01-0042873,201890091,,,,Bayes,Katherine,,09/14/1993,female,4311 Newman Rd,Missouri,Joplin,United States,64801,$110000/$100,$12.54,
07/19/2018,Beacon International,863949,020,00072,ARS-01-0042872,201890090,Passport(488009395),,,Bayes,Daniel,,08/04/1991,male,4311 Newman Rd,Missouri,Joplin,United States,64801,$110000/$100,$12.54,
07/19/2018,Beacon International,863949,020,00072,ARS-01-0042871,201889984,,,,Brazle,Alexandria,,09/30/1993,female,4311 Newman Rd,Missouri,Joplin,United States,64801,$110000/$100,$12.54,
07/19/2018,Beacon International,863949,020,00072,ARS-01-0042870,201889983,Passport(465939541),,,Brazle,Josiah,,08/12/1993,male,4311 Newman Rd,Missouri,Joplin,United States,64801,$110000/$100,$12.54,
07/18/2018,Beacon America,863949,020,00072,ARS-02-0042869,201889982,,,,Valentine,Michael,,11/24/1975,male,Athene House 86 The Broadway,,london,United Kingdom,NW73TD,$60000/$250,$12.25,
07/19/2018,Beacon International,863949,020,00072,ARS-01-0042868,201889981,Passport(550762135),,,Sundararajan,Hema,,08/03/1941,female,1210 Geraldine Way,California,Belmont,United States,94002,$50000/$0,$64.69,
07/18/2018,Beacon International,863949,020,00072,ARS-01-0042867,201889980,,,,swenson,marcia,j,10/13/1954,female,9 Churchill Avenue,Massachusetts,Wareham,United States,02571,$1100000/$250,$66.5,
07/18/2018,Beacon International,863949,020,00072,ARS-01-0042866,201889979,,,,swenson,richard,m,01/16/1954,male,9 Churchill Avenue,Massachusetts,Wareham,United States,02571,$1100000/$250,$66.5,
07/19/2018,Beacon International,863949,020,00072,ARS-01-0042864,201889977,,,,Hounshell,Kelsey,,03/09/1994,female,4311 Newman Rd,Missouri,Joplin,United States,64801,$110000/$100,$12.54,
07/19/2018,Beacon International,863949,020,00072,ARS-01-0042863,201889976,Passport(465939544),,,Hounshell,Daniel ,,02/26/1994,male,4311 Newman Rd,Missouri,Joplin,United States,64801,$110000/$100,$12.54,
07/20/2018,Beacon America,863949,020,00072,ARS-02-0042860,201889973,,,,HALLAK SAKAL,NOHELY DE JESUS,,11/09/2012,female,7205 NW 102nd place,Florida,Miami,Venezuela,33178,$110000/$250,$82.6,
07/20/2018,Beacon America,863949,020,00072,ARS-02-0042859,201889972,,,,HALLAK SAKAL,ELIAS JOSE DE JESUS,,12/20/2009,male,7205 NW 102nd place,Florida,Miami,Venezuela,33178,$110000/$250,$82.6,
07/20/2018,Beacon America,863949,020,00072,ARS-02-0042858,201889971,Passport(091435505),,,SAKAL AZGAN,GEORGETTE,,12/04/1985,female,7205 NW 102nd place,Florida,Miami,Venezuela,33178,$110000/$250,$122.72,
07/19/2018,Beacon America,863949,020,00072,ARS-02-0042856,201889969,Passport(AU960947),,,ORTIZ VARGAS,RAFAEL ALBERTO,,06/09/1987,male,CARRERA 24A #194-47,Santander,FLORIDABLANCA,Colombia,057,$60000/$500,$8.86,
07/18/2018,Beacon America,863949,020,00072,ARS-02-0042850,201889963,,,,Basch,Aliza,,08/31/2016,female,31 Meadow Brook Rd,Ontario,Toronto,Canada,m6b2s5,$110000/$0,$47.25,
07/18/2018,Beacon America,863949,020,00072,ARS-02-0042849,201889962,,,,Basch,Chaim,,03/17/2014,male,31 Meadow Brook Rd,Ontario,Toronto,Canada,m6b2s5,$110000/$0,$47.25,
07/18/2018,Beacon America,863949,020,00072,ARS-02-0042848,201889961,,,,Basch,Gittle,,02/10/2013,female,31 Meadow Brook Rd,Ontario,Toronto,Canada,m6b2s5,$110000/$0,$47.25,
07/18/2018,Beacon America,863949,020,00072,ARS-02-0042847,201889960,,,,Basch,Bracha,,08/13/1991,female,31 Meadow Brook Rd,Ontario,Toronto,Canada,m6b2s5,$110000/$0,$51.98,
07/18/2018,Beacon America,863949,020,00072,ARS-02-0042846,201889959,,,,Brach,Yermiyahu,,06/01/1988,male,31 Meadow Brook Rd,Ontario,Toronto,Canada,m6b2s5,$110000/$0,$70.2,
07/18/2018,Beacon International,863949,020,00072,ARS-01-0042844,201889955,,,,Lilkendey,James,T,11/24/1998,male,4209 NW 60th Ave,Florida,Gainesville,United States,32653,$60000/$250,$17.48,
07/19/2018,OverseasCare Visitors Insurance Plan,863949,020,00072,OVI-28-0042843,201889954,Passport(R7478816),,,DURAIRAJ,USHA,,04/24/1959,female,9328 S ORCHARD PARK CIR,Wisconsin,OAK CREEK,United States,53154,$60000/$500,$76.2,
07/19/2018,OverseasCare Visitors Insurance Plan,863949,020,00072,OVI-28-0042842,201889953,Passport(R7478816),,,PERIASAMY,SAMPATHKUMAR,,12/10/1955,male,9328 S ORCHARD PARK CIR,Wisconsin,OAK CREEK,United States,53154,$60000/$500,$92.4,
07/21/2018,Beacon International,863949,020,00072,ARS-01-0042840,201813423,Passport(514826657),,,Yeager,Loretta Lynn,,10/18/1959,female,101 Yeager Rd,Georgia,Newnan,United States,30263,$2000000/$100,$40.66,
07/21/2018,Beacon International,863949,020,00072,ARS-01-0042839,201813422,,,,Davis Jr,Hoyt,,07/11/1967,male,19 Backwater Cove Ct.,Georgia,Newnan,United States,30263,$2000000/$100,$55.9,
07/21/2018,Beacon International,863949,020,00072,ARS-01-0042838,201813421,Passport(558984393),,,Bonner Davis,Wendy,,01/02/1970,female,19 Backwater Cove Ct.,Georgia,Newnan,United States,30263,$2000000/$100,$36.06,
07/18/2018,Beacon International,863949,020,00072,ARS-01-0042835,201813403,,,,Coleman,Monroe,,08/29/1946,male,7431 Bullard Ave,Louisiana,New Orleans,United States,70128,$50000/$0,$86.25,
07/18/2018,Beacon International,863949,020,00072,ARS-01-0042833,201813401,Passport(583595675),,,Drillman,Yitzchok,,02/23/2001,male,17 n Crest pl,New Jersey,Lakewood,United States,08701,$2000000/$0,$46,
07/19/2018,Beacon International,863949,020,00072,ARS-01-0042830,201813398,Passport(487077759),,,ESPARZA,JAIME,E,03/01/1983,male,3301 NE 5th Avenue APT 1210,Florida,Miami,United States,33137,$2000000/$0,$46.06,
07/19/2018,Beacon International,863949,020,00072,ARS-01-0042828,201813394,Passport(588677829),,,Saunders,Richard,A,06/24/1963,male,3301 NE 5th Avenue APT 1210,,Miami,United States,33137,$2000000/$0,$97.6,
07/20/2018,Beacon America,863949,020,00072,ARS-02-0042827,201813393,Passport(091539713),,,ZAKAR DE AZGAN,GEORGETTE,,09/10/1945,female,7205 NW 102nd place,Florida,Miami,Venezuela,33178,$50000/$500,$324,
07/18/2018,Beacon International,863949,020,00072,ARS-01-0042826,201813392,,,,Rahimian,Benyamin,,03/13/1996,male,1530 E 18th St.,New York,Brooklyn,United States,11230,$60000/$250,$3.8,
07/17/2018,Beacon International,863949,020,00072,ARS-01-0042824,201813156,,,,Henderson,Juliet,,03/08/1972,female,11 Interlaken Rd.,Connecticut,Lakeville,United States,06039,$60000/$250,$34.5,
07/18/2018,Beacon America,863949,020,00072,ARS-02-0042819,201813143,,,,Kaplan,Chanania,,10/07/1996,male,1140 East 13th Street,New York,Brooklyn,United States,11230,$110000/$0,$50.05,
07/18/2018,Beacon America,863949,020,00072,ARS-02-0042817,201813141,,,,BADRA SAKAL,HIKMAT JOSE,,05/26/2010,male,7205 NW 102nd place,Florida,Miami,Venezuela,33178,$110000/$250,$72.8,
07/18/2018,Beacon America,863949,020,00072,ARS-02-0042816,201813140,,,,BADRA SAKAL,FAVIOLA DEL VALLE,,05/21/2008,female,7205 NW 102nd place,Florida,Miami,Venezuela,33178,$110000/$250,$72.8,
07/18/2018,Beacon America,863949,020,00072,ARS-02-0042815,201813139,Passport(091435217),,,SAKAL AZGAN,HILDA DEL VALLE,,07/05/1984,female,7205 NW 102nd place,Florida,Miami,Venezuela,33178,$110000/$250,$108.16,
07/19/2018,Beacon America,863949,020,00072,ARS-02-0042790,201813006,,,,Khan,Bibi,Shafeena,09/26/1977,male,245 Hein Drive,North Carolina,Clayton,United States,27527,$550000/$0,$465,
07/18/2018,Beacon America,863949,020,00072,ARS-02-0042789,201813005,,,,Kohn,Leah,,01/17/2017,female,156 Clymer,New York,Brooklyn,United States,11211,$550000/$0,$49.5,
07/18/2018,Beacon America,863949,020,00072,ARS-02-0042788,201813004,Passport(565751581),,,Kohn,Miriam,,03/01/2015,female,156 Clymer,New York,Brooklyn,United States,11211,$550000/$0,$49.5,
07/19/2018,Beacon America,863949,020,00072,ARS-02-0041954,201812999,Passport(144127809),,,DROZ FRISCIONI,MARIA BEATRIZ,,09/09/1997,female,URBANIZACI&Oacute;N PALMA REAL AV. LOS JAVILLOS C.R. LOMAS DEL SOL TH # 2,Monagas,MATURIN,Venezuela,6201,$110000/$0,$59.68,
07/19/2018,Beacon America,863949,020,00072,ARS-02-0035579,201813025,Passport(7291611421),,,Shilnikova,Galina,,07/29/1952,female,6076 Desert Star Lane,Utah,Herriman,United States,84096,$1100000/$2500,$83.72,
07/19/2018,Essential America,863949,020,00072,ARS-03-0042719,201822747,Passport(572329588),,,Carmack,James,Harold,08/03/1971,male,7853 Pine Forest Rd,Florida,Pensacola,United States,32526,$5000000/$1000,$1186,
07/19/2018,Essential America,863949,020,00072,ARS-03-0042719,201822749,,Passport(479200650),Spouse,Carmack,Tracy,Lee,09/09/1971,female,7853 Pine Forest Rd,Florida,Pensacola,United States,32526,$5000000/$1000,$1925.3,
07/19/2018,Essential America,863949,020,00072,ARS-03-0042719,201822752,,Passport(529610723),Dependant,Carmack,Sydney,Faith,10/25/2004,female,7853 Pine Forest Rd,Florida,Pensacola,United States,32526,$5000000/$1000,$442,
07/19/2018,Essential America,863949,020,00072,ARS-03-0042719,201822756,,Passport(559440289),Dependant,Carmack,Shelby,Jewel,11/24/2008,female,7853 Pine Forest Rd,Florida,Pensacola,United States,32526,$5000000/$1000,$0,
07/19/2018,Essential America,863949,020,00072,ARS-03-0042719,201822761,,Passport(559440281),Dependant,Carmack,Jada,Belle,12/06/2011,female,7853 Pine Forest Rd,Florida,Pensacola,United States,32526,$5000000/$1000,$0,
07/17/2018,Beacon International,863949,020,00072,ARS-01-0042781,201822771,,,,schlueter,stepanie,r,09/23/1986,female,167 carisbrooke street,Florida,ocoee,United States,34761,$550000/$250,$10.8,
07/17/2018,Beacon International,863949,020,00072,ARS-01-0042780,201822767,,,,schlueter,karen,,05/25/1963,female,167 carisbrooke street,Florida,ocoee,United States,34761,$550000/$250,$24.64,
07/21/2018,Beacon America,863949,020,00072,ARS-02-0042779,201822766,Passport(B0728634),,,Njuba,Charles,,05/25/1983,male,12125 Woodcrest Executive Dr Ste 100,MO,Saint Louis,United States,63141,$110000/$100,$34.32,
07/21/2018,Beacon America,863949,020,00072,ARS-02-0042778,201822760,Passport(PP0028664),,,Howbott,Christian,,04/07/1974,male,12125 Woodcrest Executive Dr Ste 100,MO,Saint Louis,United States,63141,$110000/$100,$49.17,
07/21/2018,Beacon America,863949,020,00072,ARS-02-0042777,201822759,Passport(B1038247),,,Nsubuga,Charles,,04/20/1962,male,12125 Woodcrest Executive Dr Ste 100,MO,Saint Louis,United States,63141,$110000/$100,$75.57,
07/17/2018,Beacon International,863949,020,00072,ARS-01-0042774,201822754,,,,Zinovjev,Andrei,,03/19/1982,male,4125 141st St SE,Washington,Mill Creek,United States,98012,$60000/$250,$31.5,
07/18/2018,Beacon International,863949,020,00072,ARS-01-0042773,201822748,,,,Gilleard,Keith,,09/21/1948,male,37 Windgate,California,Mission Viejo,United Kingdom,92692,$550000/$100,$162.36,
07/18/2018,Beacon International,863949,020,00072,ARS-01-0042772,201822744,,,,Gale,Deborah,,03/04/1960,female,37 Windgate,California,Mission Viejo,United Kingdom,92692,$550000/$100,$101.64,
07/18/2018,Beacon International,863949,020,00072,ARS-01-0042771,201822743,Passport(498344443),,,Pike,Kristine,E,06/12/1992,female,210 Hearthstone Dr. West,Georgia,Newnan,United States,30263,$110000/$0,$432.25,
07/17/2018,OverseasCare Visitors Insurance Plan,863949,020,00072,OVI-28-0042769,201822741,,,,Dhaliwal,Kawaljit,K,09/05/1949,female,305 Piccolo,,Irvine,United States,92620,$60000/$100,$67.68,
07/17/2018,OverseasCare Visitors Insurance Plan,863949,020,00072,OVI-28-0042768,201822733,,,,Dhaliwal,Amarjit,S,03/31/1941,male,305 Piccolo,,Irvine,United States,92620,$60000/$100,$89.28,
07/19/2018,Beacon International,863949,020,00072,ARS-01-0042767,201822732,Passport(576208048),,,Fortna,Jane,E,05/01/2002,female,3478 STONE QUARRY RD,New York,FREDONIA,United States,14063,$550000/$0,$17.88,
07/19/2018,Beacon International,863949,020,00072,ARS-01-0042766,201822729,Passport(576208047),,,Fortna,Julia,M,05/01/2002,female,3478 STONE QUARRY RD,New York,FREDONIA,United States,14063,$550000/$0,$17.88,
07/21/2018,Beacon America,863949,020,00072,ARS-02-0042763,201821640,Passport(16AI33872),,,Sawane,Yaya,,09/07/1961,male,12125 Woodcrest Executive Dr Ste 100,MO,Saint Louis,United States,63141,$110000/$0,$85.88,
07/21/2018,Beacon International,863949,020,00072,ARS-01-0042753,201821583,Passport(na),,,Ochanda,Richard Muko,,05/16/1971,male,81 Prospect Street,New York,Brooklyn,United States,11201,$1100000/$0,$20,
07/21/2018,Beacon International,863949,020,00072,ARS-01-0042752,201821580,Passport(na),,,Trapence,Gift,,12/23/1973,male,81 Prospect Street,New York,Brooklyn,United States,11201,$1100000/$0,$20,
07/21/2018,Beacon International,863949,020,00072,ARS-01-0042751,201821579,Passport(na),,,Mcheka,Eric Wellingtone,,05/28/1972,male,81 Prospect Street,New York,Brooklyn,United States,11201,$1100000/$0,$20,
07/21/2018,Beacon International,863949,020,00072,ARS-01-0042750,201821576,Passport(na),,,Mailosi,Diana,,02/25/1984,female,81 Prospect Street,New York,Brooklyn,United States,11201,$1100000/$0,$13.8,
07/21/2018,Beacon International,863949,020,00072,ARS-01-0042749,201821575,Passport(na),,,Mashoko,Chamunorwa J,,04/26/1972,male,81 Prospect Street,New York,Brooklyn,United States,11201,$1100000/$0,$20,
07/21/2018,Beacon International,863949,020,00072,ARS-01-0042747,201821573,Passport(na),,,Meki,Brighton,,04/29/1986,male,81 Prospect Street,New York,Brooklyn,United States,11201,$1100000/$0,$13.8,
07/16/2018,Essential America,863949,020,00072,ARS-03-0042578,201827814,Passport(TB023718),,,Granger,Kevin,Maurice,01/06/1980,male,43 Atiya Avenue,,Chaquanas,Trinidad And Tobago,00000,$5000000/$5000,$709.8,
07/16/2018,Essential America,863949,020,00072,ARS-03-0042578,201827816,,Passport(TB212759),Spouse,Morgan,Karyss,Patrice,02/06/1985,female,43 Atiya Avenue,,Chaquanas,Trinidad And Tobago,00000,$5000000/$5000,$1006.25,
07/16/2018,Essential America,863949,020,00072,ARS-03-0042578,201827819,,Passport(TB284783),Dependant,Granger,Mason,Andrew,10/29/2014,male,43 Atiya Avenue,,Chaquanas,Trinidad And Tobago,00000,$5000000/$5000,$0,
07/16/2018,Essential America,863949,020,00072,ARS-03-0042578,201827823,,Passport(TB488507),Dependant,Granger,Luc,Aaron,09/15/2016,male,43 Atiya Avenue,,Chaquanas,Trinidad And Tobago,00000,$5000000/$5000,$0,
07/16/2018,Beacon International,863949,020,00072,ARS-01-0042745,201821522,Passport(556829505),,,Rubinstein,Benjamin Martin,,07/07/1979,male,1130 54 st,New York,BROOKLYN,United States,11219,$1100000/$0,$8.63,
07/16/2018,Beacon International,863949,020,00072,ARS-01-0042744,201821521,,,,Friedman,Joseph,,02/24/1975,male,4 Plymouth Pl,New York,Airmont,United States,10977,$110000/$0,$11.25,
07/16/2018,OverseasCare Visitors Insurance Plan,863949,020,00072,OVI-28-0042742,201823734,,,,MALHOTRA,KAMLESH,,11/30/1945,female,18843 Dundee Ave,California,Saratoga,United States,95070,$60000/$100,$86.8,
07/17/2018,Beacon International,863949,020,00072,ARS-01-0042741,201823733,,,,Johnson,Benjamin,T,01/27/1982,male,6524 N. Congress Ave.,Oregon,Portland,United States,97217,$60000/$250,$138.6,
07/16/2018,Beacon International,863949,020,00072,ARS-01-0042731,201823691,,,,Herder,Clayton,A,10/09/1987,male,1816 24 Street South,Alberta,Lethbridge,Canada,t1k2m3,$1100000/$250,$136.62,
07/16/2018,Beacon International,863949,020,00072,ARS-01-0042730,201823690,,,,Johnson,Rachel,J,11/29/1991,female,1816 24 Street South,Alberta,Lethbridge,Canada,t1k2m3,$1100000/$250,$116.82,
07/20/2018,Beacon America,863949,020,00072,ARS-02-0042725,201823642,Passport(BH3573874),,,KOCSIS,GABOR,,08/06/1969,male,2 S END AVE,NEW YORK,NEW YORK,United States,10280,$550000/$0,$160,
07/16/2018,Beacon America,863949,020,00072,ARS-02-0039652,201823600,,,,MALINENI ,USHARANI ,,09/08/1968,female,6286 Joaquin Murieta Avenue,California,Newark,United States,94560,$550000/$100,$79.2,
07/16/2018,Beacon International,863949,020,00072,ARS-01-0042713,201822380,,,,Fink,Malka,,01/17/1997,female,465 10th street,New Jersey,Lakewood,United States,08701,$1100000/$0,$36.88,
07/16/2018,Beacon International,863949,020,00072,ARS-01-0042712,201822379,,,,Fink,Chaim S,,02/01/1994,male,465 10th street,New Jersey,Lakewood,United States,08701,$1100000/$0,$36.88,
07/18/2018,Beacon America,863949,020,00072,ARS-02-0042702,201822359,Passport(164857303),,,Escobar Mejia de Cabrera,Paola,,10/05/1971,female,12125 Woodcrest Executive Dr Ste 100,Missouri,Saint Louis,United States,63141,$110000/$100,$55.73,
07/20/2018,Beacon America,863949,020,00072,ARS-02-0042701,201822358,Passport(M00063353),,,Oldewage Theron,Wilhelmina,,10/27/1960,female,12125 Woodcrest Executive Dr Ste 100,Missouri,Saint Louis,United States,63141,$110000/$100,$75.57,
07/21/2018,Beacon America,863949,020,00072,ARS-02-0042700,201822357,Passport(13AE28690),,,Nhambire,Roberto,,05/10/1986,male,12125 Woodcrest Executive Dr Ste 100,Missouri,Saint Louis,United States,63141,$110000/$100,$34.32,
07/22/2018,Beacon America,863949,020,00072,ARS-02-0042699,201822356,Passport(A01550617),,,Guindo,Papa Douda,,05/30/1975,male,12125 Woodcrest Executive Dr Ste 100,Missouri,Saint Louis,United States,63141,$110000/$100,$45.89,
07/22/2018,Beacon America,863949,020,00072,ARS-02-0042698,201822355,Passport(A01375197),,,Bousso,Mamadou,,04/08/1977,male,12125 Woodcrest Executive Dr Ste 100,Missouri,Saint Louis,United States,63141,$110000/$100,$45.89,