Original Effective Date,Plan Type,Control,Suffix,Account,Policy Number,ID,EE SSN,Dependent SSN,Dependent Relationship,Last Name,First Name,Middle Initial,DOB,Gender,Address,State,City,Country,Postcode,Max/Ded,Premium,
07/15/2018,Beacon International,863949,020,00072,ARS-01-0042739,201823729,,,,Boxx,Kingston,J,08/01/2017,male,372 east wiser lake road,Washington,Lynden,United States,98264,$60000/$250,$9.1,
07/15/2018,Beacon International,863949,020,00072,ARS-01-0042738,201823732,,,,Boxx,Brandon,J,09/25/1983,male,372 east wiser lake road,Washington,Lynden,United States,98264,$60000/$250,$11.7,
07/15/2018,Beacon International,863949,020,00072,ARS-01-0042737,201823729,,,,Pagac,Megs,T,03/17/1985,female,372 east wiser lake road,Washington,Lynden,United States,98264,$60000/$250,$11.7,
07/15/2018,Beacon International,863949,020,00072,ARS-01-0042733,201823704,Passport(553606223),,,Grainger,Leslie,,10/18/1988,female,7 Cove Circle,Massachusetts,Marion,United States,02738,$60000/$100,$7.52,
07/15/2018,Beacon International,863949,020,00072,ARS-01-0042732,201823694,,,,Nieuwenhuizen,Pieter,C,08/09/1968,male,689 Minnesota ave,Florida,Winter Park,United States,32789,$60000/$100,$18.15,
07/14/2018,Beacon International,863949,020,00072,ARS-01-0042728,201823668,,,,McDonald,Owen,K,08/13/2012,male,274 1st Ave Apt 1G,New York,New York,United States,10009,$1100000/$500,$19.8,
07/14/2018,Beacon International,863949,020,00072,ARS-01-0042727,201823651,,,,Kaufman,Pamela,,02/22/1965,female,274 1st Ave Apt 1G,New York,New York,United States,10009,$1100000/$500,$56.52,
07/14/2018,Beacon International,863949,020,00072,ARS-01-0042726,201823643,,,,McDonald,Marcus,D,02/08/1961,male,274 1st Ave Apt 1G,New York,New York,United States,10009,$1100000/$500,$56.52,
07/15/2018,Beacon America,863949,020,00072,ARS-02-0042724,201822921,Passport(94521337),,,LOPEZ PONCE DE LEON,JUAN PABLO,M,07/28/1978,male,Carrera 102 17-37,Valle del Cauca,Cali,Colombia,760032,$1100000/$0,$22.65,
07/14/2018,Beacon America,863949,020,00072,ARS-02-0042722,201822917,,,,Garbanzo-Salas,Marcial,,09/02/1980,male,355 Vive Sabanilla,,San Jose,Costa Rica,NA,$110000/$250,$35.15,
07/13/2018,Beacon International,863949,020,00072,ARS-01-0042721,201822916,,,,Romero,Nelson,J,08/17/1980,male,3646 N 69TH AVE APT 109,Arizona,PHOENIX,United States,85033,$110000/$250,$20.52,
07/13/2018,Beacon America,863949,020,00072,ARS-02-0042716,201822387,,,,Matheson,Margarete,L,05/15/1942,female,#36-1840 Oliver Ranch Road,British Columbia,Okanagan Falls,Canada,V0H 1R2,$50000/$250,$43.2,
07/14/2018,Beacon America,863949,020,00072,ARS-02-0042714,201822382,Passport(G29912818),,,SOLOGUREN,LUZ,,12/24/1983,female,2465 W 6TH AVE,British Columbia,VANCOUVER,Mexico,V6K1W2,$1100000/$0,$154.78,
07/13/2018,Beacon America,863949,020,00072,ARS-02-0042697,201822354,,,,Barringer,James,,08/10/2017,male,#08-1548 Block 159,,Toa Payoh,Singapore,310159,$60000/$250,$26.45,
07/13/2018,Beacon America,863949,020,00072,ARS-02-0042696,201822353,,,,Hou,Zhuoni,,05/02/1984,female,#08-1548 Block 159,,Toa Payoh,Singapore,310159,$60000/$250,$37.72,
07/13/2018,OverseasCare Visitors Insurance Plan,863949,020,00072,OVI-28-0042695,201822352,Passport(K0617246),,,Sao,Pushpa,,11/14/1952,female,610 Robert York Ave,Illinois,Deerfield,United States,60015,$60000/$500,$50.82,
07/13/2018,OverseasCare Visitors Insurance Plan,863949,020,00072,OVI-28-0042694,201822351,Passport(K0617246),,,Sao,Yeshwant,,07/15/1949,male,610 Robert York Ave,Illinois,Deerfield,United States,60015,$60000/$500,$50.82,
07/12/2018,Beacon International,863949,020,00072,ARS-01-0042692,201822349,,,,PRELL,MELVIN,R,05/14/1952,male,JUSMAGTHAI,Florida,APO AP,United States,96546,$1100000/$0,$31.88,
07/12/2018,Beacon America,863949,020,00072,ARS-02-0042689,201822337,,,,stern,melech,,03/18/1998,male,18 portland avenue,,london,United Kingdom,n16 6et,$60000/$0,$18.6,
07/12/2018,Beacon International,863949,020,00072,ARS-01-0042686,201822332,,,,S&aacute;nchez rivas,Manuela,E,07/29/1975,female,3646n 69th Ave unit 59,Arizona,Phoenix,United States,85033,$60000/$250,$34.5,
07/12/2018,Beacon International,863949,020,00072,ARS-01-0042685,201822331,,,,Vega Sanchez,Yeshia,N,05/26/1992,female,3646n 69th Ave unit 59,Arizona,Phoenix,United States,85033,$60000/$250,$17.48,
07/12/2018,Beacon America,863949,020,00072,ARS-02-0042682,201822328,,,,Bistritz,Yaakov,,04/23/2018,male,373 Ridgwood Ave,New York,Staten Island,United States,10312,$550000/$0,$11.25,
07/12/2018,Beacon America,863949,020,00072,ARS-02-0042681,201822327,,,,Bistritz,Nechama,H,07/16/1990,male,373 Ridgwood Ave,New York,Staten Island,United States,10312,$550000/$0,$13.63,
07/12/2018,Beacon America,863949,020,00072,ARS-02-0042680,201822326,,,,Bistritz,Avrohom,,01/05/1989,male,373 Ridgwood Ave,New York,Staten Island,United States,10312,$550000/$0,$13.63,
07/14/2018,Beacon International,863949,020,00072,ARS-01-0042679,201822325,,,,Khan,Farhaan,S,01/23/2017,male,300 Fir Tree Crescent,TT,CHAGUANAS,Trinidad And Tobago,99999,$1100000/$0,$8.25,
07/14/2018,Beacon International,863949,020,00072,ARS-01-0042678,201822324,,,,Khan,Nurah,H,06/20/2014,female,300 Fir Tree Crescent,TT,CHAGUANAS,Trinidad And Tobago,99999,$1100000/$0,$8.25,
07/14/2018,Beacon International,863949,020,00072,ARS-01-0042677,201822323,,,,Khan,Farhat,,08/06/1986,female,300 Fir Tree Crescent,TT,CHAGUANAS,Trinidad And Tobago,99999,$1100000/$0,$10.35,
07/14/2018,Beacon International,863949,020,00072,ARS-01-0042676,201822322,,,,Khan,Fadil,,07/07/1986,male,300 Fir Tree Crescent,TT,CHAGUANAS,Trinidad And Tobago,99999,$1100000/$0,$10.35,
07/14/2018,Beacon International,863949,020,00072,ARS-01-0042675,201822321,,,,Khan,Sana,A,10/13/2005,female,300 Fir Tree Crescent,TT,CHAGUANAS,Trinidad And Tobago,99999,$1100000/$0,$8.25,
07/14/2018,Beacon International,863949,020,00072,ARS-01-0042674,201822320,,,,Khan,Soraiya,F,09/30/1993,female,300 Fir Tree Crescent,TT,CHAGUANAS,Trinidad And Tobago,99999,$1100000/$0,$8.85,
07/14/2018,Beacon International,863949,020,00072,ARS-01-0042673,201822319,,,,Khan,Fareeza,,10/11/1956,female,300 Fir Tree Crescent,TT,CHAGUANAS,Trinidad And Tobago,99999,$1100000/$0,$35.63,
07/14/2018,Beacon International,863949,020,00072,ARS-01-0042672,201822318,Passport(BA011077),,,Khan,Mohammed,S,10/12/1955,male,300 Fir Tree Crescent,TT,CHAGUANAS,Trinidad And Tobago,99999,$1100000/$0,$35.63,
07/13/2018,Beacon America,863949,020,00072,ARS-02-0042668,201822299,Passport(550846883),,,Komor,Julia,,03/19/1997,female,295 Brompton Park Crescent,England,London,United Kingdom,SW6 1SE,$60000/$250,$38.44,
07/13/2018,Beacon International,863949,020,00072,ARS-01-0042662,201822293,Passport(144159444),,,DUQUE ROSALES,ALEXANDRA,M,06/23/1991,female,Res. Altamira Piso 4. Apto 4-4. Calle 1.,Tachira,San Cristobal,Venezuela,000000,$60000/$0,$59.85,
07/13/2018,Beacon International,863949,020,00072,ARS-01-0042661,201822292,Passport(094302127),,,AYALA VELAZCO,ALEJANDRO,J.,10/23/1991,male,Res. Altamira Piso 4. Apto 4-4. Calle 1.,Tachira,San Cristobal,Venezuela,00000,$60000/$0,$58.9,
07/12/2018,Beacon International,863949,020,00072,ARS-01-0042657,201822287,,,,Fromartz,David,B,06/04/1956,male,32 Court St. Ste 507,New York,Brooklyn,United States,11201,$110000/$0,$72,
07/13/2018,Beacon America,863949,020,00072,ARS-02-0042656,201822286,,,,Kumar,Narendra,,05/20/1950,male,3214 brynwood pl,Virginia,herndon,United States,20171,$60000/$100,$183.04,
07/12/2018,Beacon International,863949,020,00072,ARS-01-0042653,201822278,,,,Munro,Matthew,,09/04/1970,male,British Embassy Comoros Road,,Addis Ababa,Ethiopia,00000,$60000/$250,$9,
07/12/2018,Beacon International,863949,020,00072,ARS-01-0042652,201822277,,,,Mrdeza,Iva,,09/29/1971,female,British Embassy Comoros Road,,Addis Ababa,Ethiopia,00000,$60000/$250,$9,
07/13/2018,Beacon America,863949,020,00072,ARS-02-0042650,201822275,,,,Kumar,Jaishree,,05/31/1959,female,3214 Brynwood Pl,Virginia,herndon,United States,20171,$60000/$100,$217.8,
07/12/2018,Beacon International,863949,020,00072,ARS-01-0042647,201822270,,,,Yuen,Georgiana,,01/02/1954,female,111 MONARCH WAY,North Carolina,CARY,United States,27518,$550000/$250,$32.55,
07/12/2018,Beacon International,863949,020,00072,ARS-01-0042646,201822269,,,,Yuen,Johnny,,09/20/1956,male,111 MONARCH WAY,North Carolina,CARY,United States,27518,$550000/$250,$32.55,
07/13/2018,Beacon International,863949,020,00072,ARS-01-0042644,201822267,Passport(722994369),,,Kozlov,Sergei,,08/05/1982,male,63 Shaumyana str apt.33,Sankt-Peterburg,Sankt-Peterburg,Russia,195213,$550000/$0,$17.55,
07/13/2018,Beacon International,863949,020,00072,ARS-01-0042643,201822266,Passport(72 5279710),,,Egorycheva,Mariia,,04/14/1978,female,15/3 Avtovskya str apt.157,Sankt-Peterburg,Sankt-Peterburg,Russia,198096,$550000/$0,$25.48,
07/14/2018,Beacon International,863949,020,00072,ARS-01-0042642,201822265,Passport(73 3495868),,,Lukoshkin,Grigorii,,09/13/1990,male,K-Marksa 82b kv 133 ,,Wologda,Russia,160000,$550000/$0,$12.52,
07/15/2018,Beacon America,863949,020,00072,ARS-02-0042641,201822264,,,,Gonz&aacute;lez Aparicio,Ulises,,10/19/1995,male,Calle Tlalayote #1 Interior 3,,Mexico City,Mexico,14070,$60000/$0,$12.09,
07/15/2018,Beacon America,863949,020,00072,ARS-02-0042640,201822263,,,,Gonz&aacute;lez Aparicio,David,,10/22/1993,male,Calle Tlalayote #1 Interior 3,,Mexico City,Mexico,14070,$60000/$0,$12.09,
07/15/2018,Beacon America,863949,020,00072,ARS-02-0042639,201822262,,,,Vargas L&oacute;pez,Ren&eacute;,,07/10/1988,male,Calle Tlalayote #1 Interior 3,,Mexico City,Mexico,14070,$60000/$0,$15.99,
07/15/2018,Beacon America,863949,020,00072,ARS-02-0042638,201822261,,,,Mart&iacute;nez Palestino,Andrea,,11/20/1994,female,Calle Tlalayote #1 Interior 3,,Mexico City,Mexico,14070,$60000/$0,$12.09,
07/15/2018,Beacon America,863949,020,00072,ARS-02-0042637,201822260,,,,Mondrag&oacute;n Le&oacute;n,Estefania,,07/03/1996,female,Calle Tlalayote #1 Interior 3,,Mexico City,Mexico,14070,$60000/$0,$12.09,
07/15/2018,Beacon America,863949,020,00072,ARS-02-0042636,201822259,,,,Castellanos Garc&iacute;a,Minerva,,08/07/1989,female,Calle Tlalayote #1 Interior 3,,Mexico City,Mexico,14070,$60000/$0,$12.09,
07/15/2018,Beacon America,863949,020,00072,ARS-02-0042635,201822258,,,,Gonz&aacute;lez G&oacute;mez,Raiza,,01/15/1989,female,Calle Tlalayote #1 Interior 3,,Mexico City,Mexico,14070,$60000/$0,$12.09,
07/15/2018,Beacon America,863949,020,00072,ARS-02-0042634,201822257,,,,Maldonado Mandujano,Ilse,,08/27/1993,female,Calle Tlalayote #1 Interior 3,,Mexico City,Mexico,14070,$60000/$0,$12.09,
07/15/2018,Beacon America,863949,020,00072,ARS-02-0042632,201822255,,,,Ru&iacute;z Escudero,Noem&iacute;,J,08/23/1989,female,21 Avenida Ozuluama Interior 8,,Mexico City,Mexico,06100,$60000/$0,$12.09,
07/15/2018,Beacon America,863949,020,00072,ARS-02-0042631,201822254,,,,Ramos Zapata,Luis,,07/24/1979,male,21 Avenida Ozuluama Interior 8,,Mexico City,Mexico,06100,$60000/$0,$15.99,
07/15/2018,Beacon America,863949,020,00072,ARS-02-0042630,201822253,,,,Mihaes,Bianca,,05/02/1993,female,21 Avenida Ozuluama Interior 8,,Mexico City,Mexico,06100,$60000/$0,$12.09,
07/15/2018,Beacon America,863949,020,00072,ARS-02-0042629,201822252,,,,Corona Hern&aacute;ndez,Helena,,03/25/1993,female,21 Avenida Ozuluama Interior 8,,Mexico City,Mexico,06100,$60000/$0,$12.09,
07/15/2018,Beacon America,863949,020,00072,ARS-02-0042628,201822251,,,,Ram&iacute;rez Bernal,Daniela,,11/18/1993,female,21 Avenida Ozuluama Interior 8,,Mexico City,Mexico,06100,$60000/$0,$12.09,
07/15/2018,Beacon America,863949,020,00072,ARS-02-0042627,201822250,,,,Ortiz Rodriguez,Daniela,,06/22/1993,female,21 Avenida Ozuluama Interior 8,,Mexico City,Mexico,06100,$60000/$0,$12.09,
07/11/2018,Beacon America,863949,020,00072,ARS-02-0042626,201822249,,,,Fils,Thabita Laure,,05/10/1994,female,5495 Visa Rocas,California,Westlake Village,United States,91362,$1100000/$0,$71.4,
07/13/2018,Beacon International,863949,020,00072,ARS-01-0042620,201822237,Passport(75 7361537),,,Kurchenkov,Maksim,,02/19/1980,male,Mendeleev Blvd. Bldg. 1,Leningradskaya oblast,Saint Petersburg,Russia,188662,$110000/$0,$14.04,
07/12/2018,Beacon International,863949,020,00072,ARS-01-0042616,201822233,Passport(728534996),,,Karimov,Timur,I.,03/27/1991,male,Vernosti st. 38/3 apt. 53,Sankt-Peterburg,Sankt-Peterburg,Russia,195273,$550000/$0,$17.88,
07/15/2018,Beacon International,863949,020,00072,ARS-01-0042614,201822229,Passport(592216930),,,Hickson,Jordan Annie Melissa,,03/09/2002,female,111 Jane Street,New York,New York,United States,10014,$1100000/$250,$59.8,
07/14/2018,Beacon International,863949,020,00072,ARS-01-0042608,201822216,Passport(75 4317126),,,Molchanov,Andrei,,10/28/1985,male,Vitebskiy pr. 97 k1 kv. 21,Sankt-Peterburg,Sankt-Peterburg,Russia,196233,$110000/$0,$12.29,
07/11/2018,Beacon International,863949,020,00072,ARS-01-0042604,201822210,,,,BINSUWAYDAN,ABDALAZIZ,,07/06/1996,male,DAMMAM PRINCE AHMAD STREET BEHIND DARIN MALL,Ash Sharqlyah,DAMMAM,Saudi Arabia,11504,$60000/$0,$29.45,
07/11/2018,Beacon International,863949,020,00072,ARS-01-0042603,201822209,,,,alexander,shari,,03/07/1973,female,433 west 34th st #9D,New York,NEW YORK,United States,10001,$1100000/$100,$17.6,
07/12/2018,Beacon International,863949,020,00072,ARS-01-0042602,201822208,Passport(593110973),,,Persenaire Hogeterp,Brennan Pascal,,04/01/1999,male,1700 28th St SE,Michigan,Grand Rapids,United States,49508,$1100000/$0,$536.9,
07/11/2018,Beacon International,863949,020,00072,ARS-01-0042600,201822206,,,,Sydavar,Helen,A,04/16/1965,female,16-V Ridge Road,Maryland,Greenbelt,United States,20770,$110000/$250,$60.4,
07/11/2018,Beacon International,863949,020,00072,ARS-01-0042595,201822196,Passport(469064689),,,Sipzner,Howard,,06/10/1961,male,70 Biarritz Street,,Lido Beach,United States,11561,$1100000/$500,$39.56,
07/14/2018,Beacon America,863949,020,00072,ARS-02-0042593,201822194,,,,BHUSRI,KAUSHALYA RANI,,12/31/1927,female,45 ROSEMONT PLACE,California,SAN FRANCISCO,United States,94103,$12000/$250,$61.25,
07/10/2018,Beacon International,863949,020,00072,ARS-01-0042592,201822193,,,,McDonald,Alec,K,10/16/2007,male,274 1st Avenue 1G,New York,New York,United States,10009,$1100000/$1000,$32.45,
07/11/2018,Beacon International,863949,020,00072,ARS-01-0042589,201821690,,,,Douglas,Larry,S,07/09/1953,male,234 Donahue Street,California,Sausalito,United States,94965,$1100000/$250,$30.6,
07/10/2018,Beacon International,863949,020,00072,ARS-01-0042586,201821687,,,,Bhatia,Hardeep,S,11/24/1992,male,Koncertowa 11/86,,Warsaw,Poland,02-787,$60000/$250,$12.16,
07/10/2018,Beacon International,863949,020,00072,ARS-01-0042585,201821410,,,,Ramer,John,W,06/10/1956,male,779 Lucerne Ct,Illinois,Mundelein,United States,60060,$60000/$250,$48.75,
07/13/2018,Beacon International,863949,020,00072,ARS-01-0042584,201821407,Passport(525923823),,,Vonada,Lori,L,10/27/1972,female,379 Bucktail Road,Pennsylvania,Franklin,United States,16323,$1100000/$0,$20,
07/13/2018,Beacon International,863949,020,00072,ARS-01-0037210,201821370,Passport(45208788273),,,Bernier,Lawrence,R.,07/07/1964,male,C/O Barnett,New York,New york,United States,10024,$550000/$500,$85.93,
07/11/2018,Beacon America,863949,020,00072,ARS-02-0042582,201827980,,,,Joseph,Abhishek George,,08/03/1999,male,Thundiyil House Opp Govt UP School Padamugal Kakkanad,,Kochi,India,682030,$550000/$250,$47.96,
07/11/2018,Beacon America,863949,020,00072,ARS-02-0042581,201827979,,,,Joseph,Adarsh Joy,,02/05/2002,male,Thundiyil House Opp Govt UP School Padamugal Kakkanad,,Kochi,India,682030,$550000/$250,$39.6,
07/11/2018,Beacon America,863949,020,00072,ARS-02-0042580,201827978,,,,Joseph,Ann Maria Susan,,05/19/1994,female,Thundiyil House Opp Govt UP School Padamugal Kakkanad,,Kochi,India,682030,$550000/$250,$47.96,
07/11/2018,Beacon America,863949,020,00072,ARS-02-0042579,201827977,,,,Joy Joseph,Alph Anie Mini,,05/27/1965,female,Thundiyil House Opp Govt UP School Padamugal Kakkanad,,Kochi,India,682030,$550000/$250,$124.08,
07/12/2018,Beacon International,863949,020,00072,ARS-01-0042576,201827812,Passport(549771675),,,Kettle,Matthew,D,06/24/1990,male,11 Single Hill,England,Bath,United Kingdom,BA2 8LZ,$550000/$0,$30.39,
07/10/2018,Beacon International,863949,020,00072,ARS-01-0042571,201827786,,,,Leibel,Shlomo,,09/03/1964,male,138 Bates Dr,New York,Monsey,United States,10952,$1100000/$0,$23.55,
07/15/2018,Beacon America,863949,020,00072,ARS-02-0042566,201827781,Passport(AS530755),,,miranda herrera ,felix daniel ,,06/02/1984,male,av 26 nro 75-25,Distrito Capltal de Santa Fe de Bogot&atilde;,Bogota,Colombia,001,$550000/$0,$45.15,
07/10/2018,OverseasCare Visitors Insurance Plan,863949,020,00072,OVI-28-0042564,201827779,Passport(J0152209),,,PRASAD,KAMTA ,,07/29/1951,male,2 WOODLAND WAY,New Jersey,Mt. ARLINGTON,United States,07856,$110000/$100,$145.2,
07/09/2018,Beacon International,863949,020,00072,ARS-01-0042543,201827758,,,,Roberts,Patricia,M,10/04/1989,female,4407 Sheridan Street,Maryland,University Park,United States,20782,$60000/$250,$18.24,
07/10/2018,Beacon International,863949,020,00072,ARS-01-0042536,201827471,Passport(459437650),,,Bechtold,Nathaniel Ivan,,02/28/1993,male,507 W Lisburn,Pennsylvania,Mechanicsburg,United States,17055,$1100000/$0,$26.55,
07/12/2018,Beacon America,863949,020,00072,ARS-02-0042535,201827470,Passport(AN441103),,,MANZANO G,CESAR A,,07/17/1987,male,CALLE 44C # 45-28,Distrito Capltal de Santa Fe de Bogot&atilde;,Bogota DC,Colombia,111321,$550000/$0,$79.66,
07/13/2018,Beacon International,863949,020,00072,ARS-01-0040393,201836434,,,,Engelhorn,Genevieve,,11/18/1992,female,25052 Buckboard Lane,California,Laguna Hills,United States,92653,$2000000/$0,$82.62,
07/09/2018,Beacon International,863949,020,00072,ARS-01-0042533,201827468,,,,McGee,Kyra,G,11/11/2005,female,15 Preston Court,Kentucky,Lexington,United States,40507,$110000/$0,$9.56,
07/09/2018,Beacon International,863949,020,00072,ARS-01-0042532,201827467,Passport(578888609),,,McGee,Tatsiana,V,01/02/1979,female,15 Preston Court,Kentucky,Lexington,United States,40507,$110000/$0,$12.15,
07/09/2018,Beacon International,863949,020,00072,ARS-01-0042530,201827465,Passport(542145307),,,Vreeland,John,D,12/28/1983,male,8080 Estates Blvd,Idaho,Fruitland,United States,83619,$550000/$0,$37.13,
07/12/2018,Beacon International,863949,020,00072,ARS-01-0042529,201827464,Passport(082873307),,,CHERRABE ZIGHIN,HIKMAT JAIME,,06/30/1972,male,Av Los Fundadores,Anzoategui,Ciudad de Panama,Venezuela,0819,$1100000/$0,$125,
07/09/2018,Beacon International,863949,020,00072,ARS-01-0042526,201827461,,,,Archibald,Michael,P,04/29/1964,male,2807 Grand Avenue,New York,Baldwin,United States,11510,$110000/$250,$15.1,
07/09/2018,Beacon International,863949,020,00072,ARS-01-0042525,201827460,,,,Archibald,Oliver,P,02/12/1958,male,1123 Luttrell Street,Tennessee,Knoxville,United States,37917,$110000/$250,$25.2,
07/09/2018,Beacon America,863949,020,00072,ARS-02-0042523,201827458,Passport(J4718441),,,Krishnaswamy,Srinivasan,,12/06/1945,male,1091 Lily Ave,California,Sunnyvale,United States,94086,$50000/$0,$1161,
07/11/2018,Beacon International,863949,020,00072,ARS-01-0042522,201827457,,,,Seawright,Piper,E,09/09/1986,female,807 Main Street W.,Texas,Mount Vernon,United States,75457,$550000/$250,$13.5,
07/11/2018,Beacon International,863949,020,00072,ARS-01-0042521,201827456,,,,Layton,Kerri,C,12/07/1977,female,807 Main Street W.,Texas,Mount Vernon,United States,75457,$550000/$250,$19.6,
07/11/2018,Beacon International,863949,020,00072,ARS-01-0042520,201827455,,,,cason,margaret dory,D,09/11/1952,female,807 Main Street W.,Texas,Mount Vernon,United States,75457,$550000/$250,$49.2,
07/15/2018,Beacon International,863949,020,00072,ARS-01-0042509,201827444,,,,Taylor,Scott,,08/03/1977,male,144 Faucette Mill Road,North Carolina,Hillsborough,United States,27278,$60000/$250,$16.5,
07/15/2018,Beacon International,863949,020,00072,ARS-01-0042508,201827444,,,,Johnson,Lynnette,,08/17/1980,female,144 Faucette Mill Road,North Carolina,Hillsborough,United States,27278,$60000/$250,$9.9,
07/09/2018,Beacon International,863949,020,00072,ARS-01-0042507,201827441,,,,Berhe,Fireweyni,T,03/01/1969,female,Asmara,,Asmara,Eritrea,107,$60000/$250,$22.5,
07/14/2018,Beacon International,863949,020,00072,ARS-01-0042492,201827421,,,,Martinez,Nevil,,12/28/1976,male,2425 Wlison Blvd,Virginia,Arlington,United States,22201,$60000/$0,$15,
07/14/2018,Beacon International,863949,020,00072,ARS-01-0042491,201827418,,,,Betancourt,Louis,,04/12/1977,male,2425 Wlison Blvd,Virginia,Arlington,United States,22201,$60000/$0,$15,
07/14/2018,Beacon International,863949,020,00072,ARS-01-0042490,201827417,,,,Jones,Kevin,,06/17/1974,male,2425 Wlison Blvd,Virginia,Arlington,United States,22201,$60000/$0,$15,
07/14/2018,Beacon International,863949,020,00072,ARS-01-0042489,201827416,,,,Moralez,Hector,,07/21/1977,male,2425 Wlison Blvd,Virginia,Arlington,United States,22201,$60000/$0,$15,
07/14/2018,Beacon International,863949,020,00072,ARS-01-0042488,201827415,,,,Mai,Dalia,,02/28/1989,female,2425 Wlison Blvd,Virginia,Arlington,United States,22201,$60000/$0,$7.6,
07/15/2018,Essential America,863949,020,00072,ARS-03-0042439,201825459,Passport(579103031),,,Tremarche,Katherine,Elizabeth,06/02/1991,female,38 Lakeview Avenue,Maine,Waltham,United States,02451,$5000000/$250,$1857.6,
07/15/2018,Essential America,863949,020,00072,ARS-03-0042438,201825458,Passport(581934344),,,McIsaac,Katherine,Frances,10/29/1990,female,9 Weaver Way,Maine,Sandwich,United States,02563,$5000000/$250,$1548,
07/09/2018,Beacon America,863949,020,00072,ARS-02-0042481,201826868,,,,li,siwen,,06/16/1988,female,20807 32nd Pl W,WA,Lynnwood,United States,98036,$60000/$100,$645.83,
07/11/2018,Beacon International,863949,020,00072,ARS-01-0042469,201826534,,,,Hernandez,Freddy,,03/03/1961,male,6361 SW 164 Path,Florida,Miami,United States,33193,$550000/$0,$23.1,
07/13/2018,Beacon America,863949,020,00072,ARS-02-0041807,201810002,,,,DIAO,NINA,,11/27/1942,female,16093 TAMARIND TERRACE,,CHINO HILLS,United States,91709,$50000/$250,$208.8,
07/15/2018,Beacon International,863949,020,00072,ARS-01-0042468,201826533,,,,APARICIO,JUAN,,11/18/1978,male,2425 Wilson Blvd. Suite 350,,Arlington,United States,22201,$60000/$0,$31.5,
07/15/2018,Beacon International,863949,020,00072,ARS-01-0042467,201826532,,,,VASQUEZ,JOHN,,07/18/1980,male,2425 Wilson Blvd. Suite 350,,Arlington,United States,22201,$60000/$0,$31.5,
07/15/2018,Beacon International,863949,020,00072,ARS-01-0042466,201826531,,,,HERNANDEZ,AURELIANO,,04/07/1977,male,2425 Wilson Blvd. Suite 350,,Arlington,United States,22201,$60000/$0,$52.5,
07/09/2018,Beacon International,863949,020,00072,ARS-01-0042456,201825526,Passport(22318959),,,Plavnik,Alexander,,07/04/1971,male,K Subrtce 797,Prague (Praha hlavni mesto),Prague,Czech Republic,16400,$2000000/$0,$29.8,
07/11/2018,Beacon America,863949,020,00072,ARS-02-0040245,201875772,Passport(M7109229),,,Fadnis,Prakash,,08/26/1948,male,11207 Appletree Ln,Texas,Austin,United States,78726,$110000/$250,$448.8,
07/11/2018,Beacon America,863949,020,00072,ARS-02-0040246,201896598,,,,Fadnis,Prerana,,03/11/1952,female,11207 Appletree Ln,Texas,Austin,United States,78726,$110000/$250,$448.8,
07/13/2018,Beacon America,863949,020,00072,ARS-02-0042435,201825452,Passport(AP981605),,,ORTIZ ULLOA,JENNY MARITZA,,05/10/1981,female,CARRERA 91 #19A-29,Distrito Capltal de Santa Fe de Bogot&atilde;,BOGOTA,Colombia,057,$60000/$0,$30.75,
07/15/2018,Beacon International,863949,020,00072,ARS-01-0042432,201825449,Passport(459403123),,,Robinson,Emily,B,03/25/1988,female,58 Bow Street,Massachusetts,Somerville,United States,02143,$2000000/$0,$29.98,
07/15/2018,Beacon International,863949,020,00072,ARS-01-0042425,201825267,,,,Brhane,Tesfu,M,09/02/1980,male,Mendefera,,Mendefera,Eritrea,1198,$60000/$250,$7.2,
07/09/2018,Beacon America,863949,020,00072,ARS-02-0042419,201825261,,,,Potvin,Marilyn,O,02/17/1941,female,100 West Road,Massachusetts,Longmeadow,United States,01106,$50000/$2500,$32.76,